{"text_format":"1","workbook":"xlsx","n_sheets":6,"sheets":["CONSOLIDADO","Tablas","Dashboard","Dias Feriados","Efectividad Distrital","Tabla de Deficientes"],"not_rendered":{"charts":21,"images":7,"macros":1,"external_links":0,"defined_names":24,"comments":0,"pivot_tables":23},"unopened":[],"bounds":{"document_bytes":16777216,"sheet_cells":100000,"rows_first":2000,"rows_last":500,"rows_between":2000,"halvings":0,"cell_chars":16384,"cell_head_chars":4096},"cells_cut":0,"cells_raw":0,"read":"whole","date_system":"1900"}

{"sheet":"CONSOLIDADO","index":0,"n_rows":370,"n_cols":58,"rows_kept":370,"cut":false,"hidden":true,"merged":[]}
["--","MES","Fecha Despacho","FechaIng","CodGuia","Control","Nombre","Direccion","DEPARTAMENTO","Provincia","Ciudad","NroDocu.","FECHA DE ESTADO REAL","Estado actual","Cuenta","MP","CAMPAÑA","ZONA","MOTIVO","Fecha Motivo","Marca","Provincia","DiasLEadTime","LeadHoras","Semana","Deficientes","Observacion","Cita","Llegada","Puntual","Chofer","Fecha","Devuelto CD","Razón","Fecha Despacho","Visita1","Estado1","Visita2","Estado2","Visita3","Estado3","Visita+4","Estado+4","Visita Final","Estado Final","Suma","24hrs","48hrs","72hrs","72+","Ruta","Motivo","Evalucion","At","Ft","Ne","Null","Leadtime2"]
["B001667555",{"$f":"TEXT(C2,\"mmm\")","v":"May"},"2025-05-27","2025-05-28","G/I. 030-10132",1,"ROBERT NICOLAS AQUIJE ALCANTAR","AV AMERICA ENTRANDO X LA CRUZ PASANDO COLEGIO AV AMERICA BAJADA DE LA MOLINA","Provincia","CHINCHA","ALTO LARAN","B001667555","2025-05-28","Entregado",9730017052,"F",202508,203201,"Entregado","Dia 1",{"$f":"IF(MID(R2,1,2)=\"10\",\"PACIFIKA\",IF(MID(R2,1,2)=\"20\",\"CARMEL\",\"EMPLEADOS\"))","v":"CARMEL"},{"$f":"IF(I2=\"LIMA\",\"LIMA\",\"PROVINCIA\")","v":"PROVINCIA"},{"$f":"NETWORKDAYS.INTL(D2,M2,11,'Dias Feriados'!$A$1:$A$15)","v":1},{"$f":"IF(OR(M2=\"\",M2=\"En Ruta\"),\"En Ruta\",IF(M2=\"Motivado\",\"Motivado\",IF(W2<=1,\"24hrs\",IF(W2=2,\"48hrs\",IF(W2=3,\"72hrs\",\"+72hrs\")))))","v":"24hrs"},{"$f":"WEEKNUM(C2)","v":22},"NO",null,0.9375,0.94722222222222219,1,"MAGALLANES",{"$f":"DATEVALUE(D2)","v":"2025-05-28"},null,null,{"$f":"C2","v":45804},{"$f":"IF(AK2=\"Entregado\",M2,\"\")","v":45805},{"$f":"IF(AS2=\"Devuelto\",\"\",IF(X2=\"24hrs\",\"Entregado\",CONSOLIDADO!S2))","v":"Entregado"},{"$f":"IF(AM2=\"Entregado\",M2,\"\")","v":""},{"$f":"IF(AK2=\"Entregado\",\"\",IF(X2=\"24hrs\",\"\",IF(X2=\"48hrs\",\"Entregado\",CONSOLIDADO!S2)))","v":""},{"$f":"IF(AO2=\"Entregado\",M2,\"\")","v":""},{"$f":"IF(AK2=\"Entregado\",\"\",IF(OR(X2=\"24hrs\",X2=\"48hrs\"),\"\",IF(X2=\"72hrs\",\"Entregado\",CONSOLIDADO!S2)))","v":""},{"$f":"IF(AQ2=\"Entregado\",M2,\"\")","v":""},{"$f":"IF(AK2=\"Entregado\",\"\",IF(OR(X2=\"24hrs\",X2=\"48hrs\",X2=\"72hrs\"),\"\",IF(X2=\"+72hrs\",\"Entregado\",CONSOLIDADO!S2)))","v":""},{"$f":"IF(M2=\"\",\"\",M2)","v":45805},{"$f":"IF(AG2=\"Devuelto\",AG2,N2)","v":"Entregado"},{"$f":"1+0","v":1},{"$f":"IF(X2=\"24hrs\",1,0)","v":1},{"$f":"IF(X2=\"48hrs\",1,0)","v":0},{"$f":"IF(X2=\"72hrs\",1,0)","v":0},{"$f":"IF(X2=\"+72hrs\",1,0)","v":0},{"$f":"IF(X2=\"En Ruta\",1,0)","v":0},{"$f":"IF(X2=\"Motivado\",1,0)","v":0},{"$f":"IF(OR(N2=\"devuelto\",N2=\"siniestro\"),\"Nulo\",IF(OR(X2=\"24hrs\",X2=\"48hrs\"),\"A Tiempo\",IF(OR(X2=\"en ruta\",X2=\"motivado\"),\"No Entregado\",\"Fuera de Tiempo\")))","v":"A Tiempo"},{"$f":"IF(BA2=\"a tiempo\",1,0)","v":1},{"$f":"IF(BA2=\"fuera de tiempo\",1,0)","v":0},{"$f":"IF(BA2=\"no entregado\",1,0)","v":0},{"$f":"IF(BA2=\"nulo\",1,0)","v":0},{"$f":"IF(V2=\"Lima\",NETWORKDAYS.INTL(D2,M2,11,'Dias Feriados'!$A$1:$A$15),IF(AND(V2=\"provincia\",X2=\"24hrs\"),1,IF(AND(V2=\"provincia\",X2=\"48hrs\"),2,NETWORKDAYS.INTL(D2,M2,11,'Dias Feriados'!$A$1:$A$15))))","v":1}]
["B001667463","May","2025-05-27","2025-05-28","G/I. 030-10132",2,"CHRISTOPHER RYAN UGARTE MUSTO","CALLE CAMINO REAL LT 10 FRENTE A FACULTAD DE VETERINARIA CAMINO REAL","Provincia","CHINCHA","ALTO LARAN","B001667463","2025-05-28","Entregado",9730017528,"F",202508,203201,"Entregado","Dia 1","CARMEL","PROVINCIA",{"$f":"NETWORKDAYS.INTL(D3,M3,11,'Dias Feriados'!$A$1:$A$15)","v":1},"24hrs",22,"NO",null,0.9375,0.94722222222222219,1,"MAGALLANES","2025-05-28",null,null,45804,45805,{"$f":"IF(AS3=\"Devuelto\",\"\",IF(X3=\"24hrs\",\"Entregado\",CONSOLIDADO!S3))","v":"Entregado"},"",{"$f":"IF(AK3=\"Entregado\",\"\",IF(X3=\"24hrs\",\"\",IF(X3=\"48hrs\",\"Entregado\",CONSOLIDADO!S3)))","v":""},"",{"$f":"IF(AK3=\"Entregado\",\"\",IF(OR(X3=\"24hrs\",X3=\"48hrs\"),\"\",IF(X3=\"72hrs\",\"Entregado\",CONSOLIDADO!S3)))","v":""},"",{"$f":"IF(AK3=\"Entregado\",\"\",IF(OR(X3=\"24hrs\",X3=\"48hrs\",X3=\"72hrs\"),\"\",IF(X3=\"+72hrs\",\"Entregado\",CONSOLIDADO!S3)))","v":""},45805,"Entregado",1,1,0,0,0,0,0,"A Tiempo",1,0,0,0,{"$f":"IF(V3=\"Lima\",NETWORKDAYS.INTL(D3,M3,11,'Dias Feriados'!$A$1:$A$15),IF(AND(V3=\"provincia\",X3=\"24hrs\"),1,IF(AND(V3=\"provincia\",X3=\"48hrs\"),2,NETWORKDAYS.INTL(D3,M3,11,'Dias Feriados'!$A$1:$A$15))))","v":1}]
["B001667703","May","2025-05-27","2025-05-28","G/I. 030-10132",3,"SARA LUZ ALCALA VASQUEZ","CL RIVAS 161 PRIMERA CUADR AV AMERICAS","Provincia","CHINCHA","CHINCHA ALTA","B001667703","2025-05-28","Entregado",9730017012,"F",202508,203201,"Entregado","Dia 1","CARMEL","PROVINCIA",{"$f":"NETWORKDAYS.INTL(D4,M4,11,'Dias Feriados'!$A$1:$A$15)","v":1},"24hrs",22,"NO",null,0.9375,0.94722222222222219,1,"MAGALLANES","2025-05-28",null,null,45804,45805,{"$f":"IF(AS4=\"Devuelto\",\"\",IF(X4=\"24hrs\",\"Entregado\",CONSOLIDADO!S4))","v":"Entregado"},"",{"$f":"IF(AK4=\"Entregado\",\"\",IF(X4=\"24hrs\",\"\",IF(X4=\"48hrs\",\"Entregado\",CONSOLIDADO!S4)))","v":""},"",{"$f":"IF(AK4=\"Entregado\",\"\",IF(OR(X4=\"24hrs\",X4=\"48hrs\"),\"\",IF(X4=\"72hrs\",\"Entregado\",CONSOLIDADO!S4)))","v":""},"",{"$f":"IF(AK4=\"Entregado\",\"\",IF(OR(X4=\"24hrs\",X4=\"48hrs\",X4=\"72hrs\"),\"\",IF(X4=\"+72hrs\",\"Entregado\",CONSOLIDADO!S4)))","v":""},45805,"Entregado",1,1,0,0,0,0,0,"A Tiempo",1,0,0,0,{"$f":"IF(V4=\"Lima\",NETWORKDAYS.INTL(D4,M4,11,'Dias Feriados'!$A$1:$A$15),IF(AND(V4=\"provincia\",X4=\"24hrs\"),1,IF(AND(V4=\"provincia\",X4=\"48hrs\"),2,NETWORKDAYS.INTL(D4,M4,11,'Dias Feriados'!$A$1:$A$15))))","v":1}]
["B001667630","May","2025-05-27","2025-05-28","G/I. 030-10132",4,"DARIANNA JANE ESPERANZA TORRES","AAHH LOS FICUS MZNA B LT 16","Provincia","CHINCHA","CHINCHA ALTA","B001667630","2025-05-28","Entregado",9730017017,"F",202508,203201,"Entregado","Dia 1","CARMEL","PROVINCIA",{"$f":"NETWORKDAYS.INTL(D5,M5,11,'Dias Feriados'!$A$1:$A$15)","v":1},"24hrs",22,"NO",null,0.9375,0.94722222222222219,1,"MAGALLANES","2025-05-28",null,null,45804,45805,{"$f":"IF(AS5=\"Devuelto\",\"\",IF(X5=\"24hrs\",\"Entregado\",CONSOLIDADO!S5))","v":"Entregado"},"",{"$f":"IF(AK5=\"Entregado\",\"\",IF(X5=\"24hrs\",\"\",IF(X5=\"48hrs\",\"Entregado\",CONSOLIDADO!S5)))","v":""},"",{"$f":"IF(AK5=\"Entregado\",\"\",IF(OR(X5=\"24hrs\",X5=\"48hrs\"),\"\",IF(X5=\"72hrs\",\"Entregado\",CONSOLIDADO!S5)))","v":""},"",{"$f":"IF(AK5=\"Entregado\",\"\",IF(OR(X5=\"24hrs\",X5=\"48hrs\",X5=\"72hrs\"),\"\",IF(X5=\"+72hrs\",\"Entregado\",CONSOLIDADO!S5)))","v":""},45805,"Entregado",1,1,0,0,0,0,0,"A Tiempo",1,0,0,0,{"$f":"IF(V5=\"Lima\",NETWORKDAYS.INTL(D5,M5,11,'Dias Feriados'!$A$1:$A$15),IF(AND(V5=\"provincia\",X5=\"24hrs\"),1,IF(AND(V5=\"provincia\",X5=\"48hrs\"),2,NETWORKDAYS.INTL(D5,M5,11,'Dias Feriados'!$A$1:$A$15))))","v":1}]
["B001667657","May","2025-05-27","2025-05-28","G/I. 030-10132",5,"ADA ALEJANDRA ALCALA VASQUEZ","RIVAS 161 PRIMERA CUADRA AVENIDA AMERICA","Provincia","CHINCHA","CHINCHA ALTA","B001667657","2025-05-28","Entregado",9730017076,"F",202508,203201,"Entregado","Dia 1","CARMEL","PROVINCIA",{"$f":"NETWORKDAYS.INTL(D6,M6,11,'Dias Feriados'!$A$1:$A$15)","v":1},"24hrs",22,"NO",null,0.9375,0.94722222222222219,1,"MAGALLANES","2025-05-28",null,null,45804,45805,{"$f":"IF(AS6=\"Devuelto\",\"\",IF(X6=\"24hrs\",\"Entregado\",CONSOLIDADO!S6))","v":"Entregado"},"",{"$f":"IF(AK6=\"Entregado\",\"\",IF(X6=\"24hrs\",\"\",IF(X6=\"48hrs\",\"Entregado\",CONSOLIDADO!S6)))","v":""},"",{"$f":"IF(AK6=\"Entregado\",\"\",IF(OR(X6=\"24hrs\",X6=\"48hrs\"),\"\",IF(X6=\"72hrs\",\"Entregado\",CONSOLIDADO!S6)))","v":""},"",{"$f":"IF(AK6=\"Entregado\",\"\",IF(OR(X6=\"24hrs\",X6=\"48hrs\",X6=\"72hrs\"),\"\",IF(X6=\"+72hrs\",\"Entregado\",CONSOLIDADO!S6)))","v":""},45805,"Entregado",1,1,0,0,0,0,0,"A Tiempo",1,0,0,0,{"$f":"IF(V6=\"Lima\",NETWORKDAYS.INTL(D6,M6,11,'Dias Feriados'!$A$1:$A$15),IF(AND(V6=\"provincia\",X6=\"24hrs\"),1,IF(AND(V6=\"provincia\",X6=\"48hrs\"),2,NETWORKDAYS.INTL(D6,M6,11,'Dias Feriados'!$A$1:$A$15))))","v":1}]
["B001667716","May","2025-05-27","2025-05-28","G/I. 030-10132",6,"ROSANA AMPARO QUINTANA ARTEAG","PABLO TASAYCO 170 ENTRADA MAPFRE","Provincia","CHINCHA","CHINCHA ALTA","B001667716","2025-05-28","Entregado",9730017077,"F",202508,203201,"Entregado","Dia 1","CARMEL","PROVINCIA",{"$f":"NETWORKDAYS.INTL(D7,M7,11,'Dias Feriados'!$A$1:$A$15)","v":1},"24hrs",22,"NO",null,0.9375,0.94722222222222219,1,"MAGALLANES","2025-05-28",null,null,45804,45805,{"$f":"IF(AS7=\"Devuelto\",\"\",IF(X7=\"24hrs\",\"Entregado\",CONSOLIDADO!S7))","v":"Entregado"},"",{"$f":"IF(AK7=\"Entregado\",\"\",IF(X7=\"24hrs\",\"\",IF(X7=\"48hrs\",\"Entregado\",CONSOLIDADO!S7)))","v":""},"",{"$f":"IF(AK7=\"Entregado\",\"\",IF(OR(X7=\"24hrs\",X7=\"48hrs\"),\"\",IF(X7=\"72hrs\",\"Entregado\",CONSOLIDADO!S7)))","v":""},"",{"$f":"IF(AK7=\"Entregado\",\"\",IF(OR(X7=\"24hrs\",X7=\"48hrs\",X7=\"72hrs\"),\"\",IF(X7=\"+72hrs\",\"Entregado\",CONSOLIDADO!S7)))","v":""},45805,"Entregado",1,1,0,0,0,0,0,"A Tiempo",1,0,0,0,{"$f":"IF(V7=\"Lima\",NETWORKDAYS.INTL(D7,M7,11,'Dias Feriados'!$A$1:$A$15),IF(AND(V7=\"provincia\",X7=\"24hrs\"),1,IF(AND(V7=\"provincia\",X7=\"48hrs\"),2,NETWORKDAYS.INTL(D7,M7,11,'Dias Feriados'!$A$1:$A$15))))","v":1}]
["B001667594","May","2025-05-27","2025-05-28","G/I. 030-10132",7,"DENISSE CAROLINA MONASI LUJAN","AV UNION 129 ANTES A LA MEDIA ANTES DE LLEGAR A LA MEGA PLAZA","Provincia","CHINCHA","CHINCHA ALTA","B001667594","2025-05-28","Entregado",9730017085,"F",202508,203201,"Entregado","Dia 1","CARMEL","PROVINCIA",{"$f":"NETWORKDAYS.INTL(D8,M8,11,'Dias Feriados'!$A$1:$A$15)","v":1},"24hrs",22,"NO",null,0.9375,0.94722222222222219,1,"MAGALLANES","2025-05-28",null,null,45804,45805,{"$f":"IF(AS8=\"Devuelto\",\"\",IF(X8=\"24hrs\",\"Entregado\",CONSOLIDADO!S8))","v":"Entregado"},"",{"$f":"IF(AK8=\"Entregado\",\"\",IF(X8=\"24hrs\",\"\",IF(X8=\"48hrs\",\"Entregado\",CONSOLIDADO!S8)))","v":""},"",{"$f":"IF(AK8=\"Entregado\",\"\",IF(OR(X8=\"24hrs\",X8=\"48hrs\"),\"\",IF(X8=\"72hrs\",\"Entregado\",CONSOLIDADO!S8)))","v":""},"",{"$f":"IF(AK8=\"Entregado\",\"\",IF(OR(X8=\"24hrs\",X8=\"48hrs\",X8=\"72hrs\"),\"\",IF(X8=\"+72hrs\",\"Entregado\",CONSOLIDADO!S8)))","v":""},45805,"Entregado",1,1,0,0,0,0,0,"A Tiempo",1,0,0,0,{"$f":"IF(V8=\"Lima\",NETWORKDAYS.INTL(D8,M8,11,'Dias Feriados'!$A$1:$A$15),IF(AND(V8=\"provincia\",X8=\"24hrs\"),1,IF(AND(V8=\"provincia\",X8=\"48hrs\"),2,NETWORKDAYS.INTL(D8,M8,11,'Dias Feriados'!$A$1:$A$15))))","v":1}]
["B001667338","May","2025-05-27","2025-05-28","G/I. 030-10132",8,"CRISTHOFER PAUL AURIS GUTIERRE","LOS ANGELES 350 PASANDO LA RENIEC LOS ANGELES EDIFICIO SANTA TERESA","Provincia","CHINCHA","CHINCHA ALTA","B001667338","2025-05-28","Entregado",9730017123,"F",202508,203201,"Entregado","Dia 1","CARMEL","PROVINCIA",{"$f":"NETWORKDAYS.INTL(D9,M9,11,'Dias Feriados'!$A$1:$A$15)","v":1},"24hrs",22,"NO",null,0.9375,0.94722222222222219,1,"MAGALLANES","2025-05-28",null,null,45804,45805,{"$f":"IF(AS9=\"Devuelto\",\"\",IF(X9=\"24hrs\",\"Entregado\",CONSOLIDADO!S9))","v":"Entregado"},"",{"$f":"IF(AK9=\"Entregado\",\"\",IF(X9=\"24hrs\",\"\",IF(X9=\"48hrs\",\"Entregado\",CONSOLIDADO!S9)))","v":""},"",{"$f":"IF(AK9=\"Entregado\",\"\",IF(OR(X9=\"24hrs\",X9=\"48hrs\"),\"\",IF(X9=\"72hrs\",\"Entregado\",CONSOLIDADO!S9)))","v":""},"",{"$f":"IF(AK9=\"Entregado\",\"\",IF(OR(X9=\"24hrs\",X9=\"48hrs\",X9=\"72hrs\"),\"\",IF(X9=\"+72hrs\",\"Entregado\",CONSOLIDADO!S9)))","v":""},45805,"Entregado",1,1,0,0,0,0,0,"A Tiempo",1,0,0,0,{"$f":"IF(V9=\"Lima\",NETWORKDAYS.INTL(D9,M9,11,'Dias Feriados'!$A$1:$A$15),IF(AND(V9=\"provincia\",X9=\"24hrs\"),1,IF(AND(V9=\"provincia\",X9=\"48hrs\"),2,NETWORKDAYS.INTL(D9,M9,11,'Dias Feriados'!$A$1:$A$15))))","v":1}]
["B001667557","May","2025-05-27","2025-05-28","G/I. 030-10132",9,"REBECCA MARIA HERRERA MORALES","URB LAS BEGONIAS PASAJE RIVAS 10A 2DO PISO AL COSTADO DEL SEGURO","Provincia","CHINCHA","CHINCHA ALTA","B001667557","2025-05-28","Entregado",9730017157,"F",202508,203201,"Entregado","Dia 1","CARMEL","PROVINCIA",{"$f":"NETWORKDAYS.INTL(D10,M10,11,'Dias Feriados'!$A$1:$A$15)","v":1},"24hrs",22,"NO",null,0.9375,0.94722222222222219,1,"MAGALLANES","2025-05-28",null,null,45804,45805,{"$f":"IF(AS10=\"Devuelto\",\"\",IF(X10=\"24hrs\",\"Entregado\",CONSOLIDADO!S10))","v":"Entregado"},"",{"$f":"IF(AK10=\"Entregado\",\"\",IF(X10=\"24hrs\",\"\",IF(X10=\"48hrs\",\"Entregado\",CONSOLIDADO!S10)))","v":""},"",{"$f":"IF(AK10=\"Entregado\",\"\",IF(OR(X10=\"24hrs\",X10=\"48hrs\"),\"\",IF(X10=\"72hrs\",\"Entregado\",CONSOLIDADO!S10)))","v":""},"",{"$f":"IF(AK10=\"Entregado\",\"\",IF(OR(X10=\"24hrs\",X10=\"48hrs\",X10=\"72hrs\"),\"\",IF(X10=\"+72hrs\",\"Entregado\",CONSOLIDADO!S10)))","v":""},45805,"Entregado",1,1,0,0,0,0,0,"A Tiempo",1,0,0,0,{"$f":"IF(V10=\"Lima\",NETWORKDAYS.INTL(D10,M10,11,'Dias Feriados'!$A$1:$A$15),IF(AND(V10=\"provincia\",X10=\"24hrs\"),1,IF(AND(V10=\"provincia\",X10=\"48hrs\"),2,NETWORKDAYS.INTL(D10,M10,11,'Dias Feriados'!$A$1:$A$15))))","v":1}]
["B001667637","May","2025-05-27","2025-05-28","G/I. 030-10132",10,"BLANCA ESTELA LEVANO MATIAS","AVSAN IDELFONSO SN COSTADO PASAJE SILESA","Provincia","CHINCHA","CHINCHA ALTA","B001667637","2025-05-28","Entregado",9730017189,"F",202508,203201,"Entregado","Dia 1","CARMEL","PROVINCIA",{"$f":"NETWORKDAYS.INTL(D11,M11,11,'Dias Feriados'!$A$1:$A$15)","v":1},"24hrs",22,"NO",null,0.9375,0.94722222222222219,1,"MAGALLANES","2025-05-28",null,null,45804,45805,{"$f":"IF(AS11=\"Devuelto\",\"\",IF(X11=\"24hrs\",\"Entregado\",CONSOLIDADO!S11))","v":"Entregado"},"",{"$f":"IF(AK11=\"Entregado\",\"\",IF(X11=\"24hrs\",\"\",IF(X11=\"48hrs\",\"Entregado\",CONSOLIDADO!S11)))","v":""},"",{"$f":"IF(AK11=\"Entregado\",\"\",IF(OR(X11=\"24hrs\",X11=\"48hrs\"),\"\",IF(X11=\"72hrs\",\"Entregado\",CONSOLIDADO!S11)))","v":""},"",{"$f":"IF(AK11=\"Entregado\",\"\",IF(OR(X11=\"24hrs\",X11=\"48hrs\",X11=\"72hrs\"),\"\",IF(X11=\"+72hrs\",\"Entregado\",CONSOLIDADO!S11)))","v":""},45805,"Entregado",1,1,0,0,0,0,0,"A Tiempo",1,0,0,0,{"$f":"IF(V11=\"Lima\",NETWORKDAYS.INTL(D11,M11,11,'Dias Feriados'!$A$1:$A$15),IF(AND(V11=\"provincia\",X11=\"24hrs\"),1,IF(AND(V11=\"provincia\",X11=\"48hrs\"),2,NETWORKDAYS.INTL(D11,M11,11,'Dias Feriados'!$A$1:$A$15))))","v":1}]
["B001667722","May","2025-05-27","2025-05-28","G/I. 030-10132",11,"ANTONIA HERMELINDA MONSERRATE","AV AMERICA 347 CHINCHA ALTA","Provincia","CHINCHA","CHINCHA ALTA","B001667722","2025-05-28","Entregado",9730017266,"F",202508,203201,"Entregado","Dia 1","CARMEL","PROVINCIA",{"$f":"NETWORKDAYS.INTL(D12,M12,11,'Dias Feriados'!$A$1:$A$15)","v":1},"24hrs",22,"NO",null,0.9375,0.94722222222222219,1,"MAGALLANES","2025-05-28",null,null,45804,45805,{"$f":"IF(AS12=\"Devuelto\",\"\",IF(X12=\"24hrs\",\"Entregado\",CONSOLIDADO!S12))","v":"Entregado"},"",{"$f":"IF(AK12=\"Entregado\",\"\",IF(X12=\"24hrs\",\"\",IF(X12=\"48hrs\",\"Entregado\",CONSOLIDADO!S12)))","v":""},"",{"$f":"IF(AK12=\"Entregado\",\"\",IF(OR(X12=\"24hrs\",X12=\"48hrs\"),\"\",IF(X12=\"72hrs\",\"Entregado\",CONSOLIDADO!S12)))","v":""},"",{"$f":"IF(AK12=\"Entregado\",\"\",IF(OR(X12=\"24hrs\",X12=\"48hrs\",X12=\"72hrs\"),\"\",IF(X12=\"+72hrs\",\"Entregado\",CONSOLIDADO!S12)))","v":""},45805,"Entregado",1,1,0,0,0,0,0,"A Tiempo",1,0,0,0,{"$f":"IF(V12=\"Lima\",NETWORKDAYS.INTL(D12,M12,11,'Dias Feriados'!$A$1:$A$15),IF(AND(V12=\"provincia\",X12=\"24hrs\"),1,IF(AND(V12=\"provincia\",X12=\"48hrs\"),2,NETWORKDAYS.INTL(D12,M12,11,'Dias Feriados'!$A$1:$A$15))))","v":1}]
["B001667392","May","2025-05-27","2025-05-28","G/I. 030-10132",12,"KATIE ELENA LEVANO DETORRES","PROLO MARISCAL CASTILLA 156 OOL MARIA DE LOS ANGELES","Provincia","CHINCHA","CHINCHA ALTA","B001667392","2025-05-28","Entregado",9730017268,"F",202508,203201,"Entregado","Dia 1","CARMEL","PROVINCIA",{"$f":"NETWORKDAYS.INTL(D13,M13,11,'Dias Feriados'!$A$1:$A$15)","v":1},"24hrs",22,"NO",null,0.9375,0.94722222222222219,1,"MAGALLANES","2025-05-28",null,null,45804,45805,{"$f":"IF(AS13=\"Devuelto\",\"\",IF(X13=\"24hrs\",\"Entregado\",CONSOLIDADO!S13))","v":"Entregado"},"",{"$f":"IF(AK13=\"Entregado\",\"\",IF(X13=\"24hrs\",\"\",IF(X13=\"48hrs\",\"Entregado\",CONSOLIDADO!S13)))","v":""},"",{"$f":"IF(AK13=\"Entregado\",\"\",IF(OR(X13=\"24hrs\",X13=\"48hrs\"),\"\",IF(X13=\"72hrs\",\"Entregado\",CONSOLIDADO!S13)))","v":""},"",{"$f":"IF(AK13=\"Entregado\",\"\",IF(OR(X13=\"24hrs\",X13=\"48hrs\",X13=\"72hrs\"),\"\",IF(X13=\"+72hrs\",\"Entregado\",CONSOLIDADO!S13)))","v":""},45805,"Entregado",1,1,0,0,0,0,0,"A Tiempo",1,0,0,0,{"$f":"IF(V13=\"Lima\",NETWORKDAYS.INTL(D13,M13,11,'Dias Feriados'!$A$1:$A$15),IF(AND(V13=\"provincia\",X13=\"24hrs\"),1,IF(AND(V13=\"provincia\",X13=\"48hrs\"),2,NETWORKDAYS.INTL(D13,M13,11,'Dias Feriados'!$A$1:$A$15))))","v":1}]
["B001668222","May","2025-05-27","2025-05-28","G/I. 030-10132",13,"GUILLIANA TORRES DE LA CRUZ","CALLE ERNESTO VELIT RUIZ 348 B POR EL HOSPEDAJE RICARDOS","Provincia","CHINCHA","CHINCHA ALTA","B001668222","2025-05-28","Entregado",9730017280,"F",202508,203201,"Entregado","Dia 1","CARMEL","PROVINCIA",{"$f":"NETWORKDAYS.INTL(D14,M14,11,'Dias Feriados'!$A$1:$A$15)","v":1},"24hrs",22,"NO",null,0.9375,0.94722222222222219,1,"MAGALLANES","2025-05-28",null,null,45804,45805,{"$f":"IF(AS14=\"Devuelto\",\"\",IF(X14=\"24hrs\",\"Entregado\",CONSOLIDADO!S14))","v":"Entregado"},"",{"$f":"IF(AK14=\"Entregado\",\"\",IF(X14=\"24hrs\",\"\",IF(X14=\"48hrs\",\"Entregado\",CONSOLIDADO!S14)))","v":""},"",{"$f":"IF(AK14=\"Entregado\",\"\",IF(OR(X14=\"24hrs\",X14=\"48hrs\"),\"\",IF(X14=\"72hrs\",\"Entregado\",CONSOLIDADO!S14)))","v":""},"",{"$f":"IF(AK14=\"Entregado\",\"\",IF(OR(X14=\"24hrs\",X14=\"48hrs\",X14=\"72hrs\"),\"\",IF(X14=\"+72hrs\",\"Entregado\",CONSOLIDADO!S14)))","v":""},45805,"Entregado",1,1,0,0,0,0,0,"A Tiempo",1,0,0,0,{"$f":"IF(V14=\"Lima\",NETWORKDAYS.INTL(D14,M14,11,'Dias Feriados'!$A$1:$A$15),IF(AND(V14=\"provincia\",X14=\"24hrs\"),1,IF(AND(V14=\"provincia\",X14=\"48hrs\"),2,NETWORKDAYS.INTL(D14,M14,11,'Dias Feriados'!$A$1:$A$15))))","v":1}]
["B001667528","May","2025-05-27","2025-05-28","G/I. 030-10132",14,"EDITH ROCIO TRILLO GARCIA","ANTIGUO MERCADO 3ER PUERTA 134 MERCADILLO EN LA PUERTA 3","Provincia","CHINCHA","CHINCHA ALTA","B001667528","2025-05-28","Entregado",9730017293,"F",202508,203201,"Entregado","Dia 1","CARMEL","PROVINCIA",{"$f":"NETWORKDAYS.INTL(D15,M15,11,'Dias Feriados'!$A$1:$A$15)","v":1},"24hrs",22,"NO",null,0.9375,0.94722222222222219,1,"MAGALLANES","2025-05-28",null,null,45804,45805,{"$f":"IF(AS15=\"Devuelto\",\"\",IF(X15=\"24hrs\",\"Entregado\",CONSOLIDADO!S15))","v":"Entregado"},"",{"$f":"IF(AK15=\"Entregado\",\"\",IF(X15=\"24hrs\",\"\",IF(X15=\"48hrs\",\"Entregado\",CONSOLIDADO!S15)))","v":""},"",{"$f":"IF(AK15=\"Entregado\",\"\",IF(OR(X15=\"24hrs\",X15=\"48hrs\"),\"\",IF(X15=\"72hrs\",\"Entregado\",CONSOLIDADO!S15)))","v":""},"",{"$f":"IF(AK15=\"Entregado\",\"\",IF(OR(X15=\"24hrs\",X15=\"48hrs\",X15=\"72hrs\"),\"\",IF(X15=\"+72hrs\",\"Entregado\",CONSOLIDADO!S15)))","v":""},45805,"Entregado",1,1,0,0,0,0,0,"A Tiempo",1,0,0,0,{"$f":"IF(V15=\"Lima\",NETWORKDAYS.INTL(D15,M15,11,'Dias Feriados'!$A$1:$A$15),IF(AND(V15=\"provincia\",X15=\"24hrs\"),1,IF(AND(V15=\"provincia\",X15=\"48hrs\"),2,NETWORKDAYS.INTL(D15,M15,11,'Dias Feriados'!$A$1:$A$15))))","v":1}]
["B001667460","May","2025-05-27","2025-05-28","G/I. 030-10132",15,"JHENNY ROSARIO OCHOA CHACALTAN","JR JUNIN 412 A 4 CDRAS DE LA PLAZA DE ARMAS","Provincia","CHINCHA","CHINCHA ALTA","B001667460","2025-05-28","Entregado",9730017315,"F",202508,203201,"Entregado","Dia 1","CARMEL","PROVINCIA",{"$f":"NETWORKDAYS.INTL(D16,M16,11,'Dias Feriados'!$A$1:$A$15)","v":1},"24hrs",22,"NO",null,0.9375,0.94722222222222219,1,"MAGALLANES","2025-05-28",null,null,45804,45805,{"$f":"IF(AS16=\"Devuelto\",\"\",IF(X16=\"24hrs\",\"Entregado\",CONSOLIDADO!S16))","v":"Entregado"},"",{"$f":"IF(AK16=\"Entregado\",\"\",IF(X16=\"24hrs\",\"\",IF(X16=\"48hrs\",\"Entregado\",CONSOLIDADO!S16)))","v":""},"",{"$f":"IF(AK16=\"Entregado\",\"\",IF(OR(X16=\"24hrs\",X16=\"48hrs\"),\"\",IF(X16=\"72hrs\",\"Entregado\",CONSOLIDADO!S16)))","v":""},"",{"$f":"IF(AK16=\"Entregado\",\"\",IF(OR(X16=\"24hrs\",X16=\"48hrs\",X16=\"72hrs\"),\"\",IF(X16=\"+72hrs\",\"Entregado\",CONSOLIDADO!S16)))","v":""},45805,"Entregado",1,1,0,0,0,0,0,"A Tiempo",1,0,0,0,{"$f":"IF(V16=\"Lima\",NETWORKDAYS.INTL(D16,M16,11,'Dias Feriados'!$A$1:$A$15),IF(AND(V16=\"provincia\",X16=\"24hrs\"),1,IF(AND(V16=\"provincia\",X16=\"48hrs\"),2,NETWORKDAYS.INTL(D16,M16,11,'Dias Feriados'!$A$1:$A$15))))","v":1}]
["B001667414","May","2025-05-27","2025-05-28","G/I. 030-10132",16,"LUCY LILIANA RUIZ CARDENAS","SAN AGUSTIN MZ Z LT 4 FRT A LA IGLESIA EVANGELICA UPIS","Provincia","CHINCHA","CHINCHA ALTA","B001667414","2025-05-28","Entregado",9730017356,"F",202508,203201,"Entregado","Dia 1","CARMEL","PROVINCIA",{"$f":"NETWORKDAYS.INTL(D17,M17,11,'Dias Feriados'!$A$1:$A$15)","v":1},"24hrs",22,"NO",null,0.9375,0.94722222222222219,1,"MAGALLANES","2025-05-28",null,null,45804,45805,{"$f":"IF(AS17=\"Devuelto\",\"\",IF(X17=\"24hrs\",\"Entregado\",CONSOLIDADO!S17))","v":"Entregado"},"",{"$f":"IF(AK17=\"Entregado\",\"\",IF(X17=\"24hrs\",\"\",IF(X17=\"48hrs\",\"Entregado\",CONSOLIDADO!S17)))","v":""},"",{"$f":"IF(AK17=\"Entregado\",\"\",IF(OR(X17=\"24hrs\",X17=\"48hrs\"),\"\",IF(X17=\"72hrs\",\"Entregado\",CONSOLIDADO!S17)))","v":""},"",{"$f":"IF(AK17=\"Entregado\",\"\",IF(OR(X17=\"24hrs\",X17=\"48hrs\",X17=\"72hrs\"),\"\",IF(X17=\"+72hrs\",\"Entregado\",CONSOLIDADO!S17)))","v":""},45805,"Entregado",1,1,0,0,0,0,0,"A Tiempo",1,0,0,0,{"$f":"IF(V17=\"Lima\",NETWORKDAYS.INTL(D17,M17,11,'Dias Feriados'!$A$1:$A$15),IF(AND(V17=\"provincia\",X17=\"24hrs\"),1,IF(AND(V17=\"provincia\",X17=\"48hrs\"),2,NETWORKDAYS.INTL(D17,M17,11,'Dias Feriados'!$A$1:$A$15))))","v":1}]
["B001667457","May","2025-05-27","2025-05-28","G/I. 030-10132",17,"MARIA ROXANA VILLAMARES TASAYC","AMERICA 199 LT 1 POR EL PEDAGOGICO DE CHINCHA","Provincia","CHINCHA","CHINCHA ALTA","B001667457","2025-05-28","Entregado",9730017423,"F",202508,203201,"Entregado","Dia 1","CARMEL","PROVINCIA",{"$f":"NETWORKDAYS.INTL(D18,M18,11,'Dias Feriados'!$A$1:$A$15)","v":1},"24hrs",22,"NO",null,0.9375,0.94722222222222219,1,"MAGALLANES","2025-05-28",null,null,45804,45805,{"$f":"IF(AS18=\"Devuelto\",\"\",IF(X18=\"24hrs\",\"Entregado\",CONSOLIDADO!S18))","v":"Entregado"},"",{"$f":"IF(AK18=\"Entregado\",\"\",IF(X18=\"24hrs\",\"\",IF(X18=\"48hrs\",\"Entregado\",CONSOLIDADO!S18)))","v":""},"",{"$f":"IF(AK18=\"Entregado\",\"\",IF(OR(X18=\"24hrs\",X18=\"48hrs\"),\"\",IF(X18=\"72hrs\",\"Entregado\",CONSOLIDADO!S18)))","v":""},"",{"$f":"IF(AK18=\"Entregado\",\"\",IF(OR(X18=\"24hrs\",X18=\"48hrs\",X18=\"72hrs\"),\"\",IF(X18=\"+72hrs\",\"Entregado\",CONSOLIDADO!S18)))","v":""},45805,"Entregado",1,1,0,0,0,0,0,"A Tiempo",1,0,0,0,{"$f":"IF(V18=\"Lima\",NETWORKDAYS.INTL(D18,M18,11,'Dias Feriados'!$A$1:$A$15),IF(AND(V18=\"provincia\",X18=\"24hrs\"),1,IF(AND(V18=\"provincia\",X18=\"48hrs\"),2,NETWORKDAYS.INTL(D18,M18,11,'Dias Feriados'!$A$1:$A$15))))","v":1}]
["B001667663","May","2025-05-27","2025-05-28","G/I. 030-10132",18,"ANALI PAOLA CAMPOS RODRIGUEZ","AV ARGENTINA MZ I LOTE 7 IGLESIA MISIONERA","Provincia","CHINCHA","CHINCHA ALTA","B001667663","2025-05-28","Entregado",9730017592,"F",202508,203201,"Entregado","Dia 1","CARMEL","PROVINCIA",{"$f":"NETWORKDAYS.INTL(D19,M19,11,'Dias Feriados'!$A$1:$A$15)","v":1},"24hrs",22,"NO",null,0.9375,0.94722222222222219,1,"MAGALLANES","2025-05-28",null,null,45804,45805,{"$f":"IF(AS19=\"Devuelto\",\"\",IF(X19=\"24hrs\",\"Entregado\",CONSOLIDADO!S19))","v":"Entregado"},"",{"$f":"IF(AK19=\"Entregado\",\"\",IF(X19=\"24hrs\",\"\",IF(X19=\"48hrs\",\"Entregado\",CONSOLIDADO!S19)))","v":""},"",{"$f":"IF(AK19=\"Entregado\",\"\",IF(OR(X19=\"24hrs\",X19=\"48hrs\"),\"\",IF(X19=\"72hrs\",\"Entregado\",CONSOLIDADO!S19)))","v":""},"",{"$f":"IF(AK19=\"Entregado\",\"\",IF(OR(X19=\"24hrs\",X19=\"48hrs\",X19=\"72hrs\"),\"\",IF(X19=\"+72hrs\",\"Entregado\",CONSOLIDADO!S19)))","v":""},45805,"Entregado",1,1,0,0,0,0,0,"A Tiempo",1,0,0,0,{"$f":"IF(V19=\"Lima\",NETWORKDAYS.INTL(D19,M19,11,'Dias Feriados'!$A$1:$A$15),IF(AND(V19=\"provincia\",X19=\"24hrs\"),1,IF(AND(V19=\"provincia\",X19=\"48hrs\"),2,NETWORKDAYS.INTL(D19,M19,11,'Dias Feriados'!$A$1:$A$15))))","v":1}]
["B001667400","May","2025-05-27","2025-05-28","G/I. 030-10132",19,"MERLLI EDITH ROMERO VILCA","AV LUIS MASSARO INTERIOR 2 579 ENTRE JUNIN Y CALLE GRAU","Provincia","CHINCHA","CHINCHA ALTA","B001667400","2025-05-28","Entregado",9730017607,"F",202508,203201,"Entregado","Dia 1","CARMEL","PROVINCIA",{"$f":"NETWORKDAYS.INTL(D20,M20,11,'Dias Feriados'!$A$1:$A$15)","v":1},"24hrs",22,"NO",null,0.9375,0.94722222222222219,1,"MAGALLANES","2025-05-28",null,null,45804,45805,{"$f":"IF(AS20=\"Devuelto\",\"\",IF(X20=\"24hrs\",\"Entregado\",CONSOLIDADO!S20))","v":"Entregado"},"",{"$f":"IF(AK20=\"Entregado\",\"\",IF(X20=\"24hrs\",\"\",IF(X20=\"48hrs\",\"Entregado\",CONSOLIDADO!S20)))","v":""},"",{"$f":"IF(AK20=\"Entregado\",\"\",IF(OR(X20=\"24hrs\",X20=\"48hrs\"),\"\",IF(X20=\"72hrs\",\"Entregado\",CONSOLIDADO!S20)))","v":""},"",{"$f":"IF(AK20=\"Entregado\",\"\",IF(OR(X20=\"24hrs\",X20=\"48hrs\",X20=\"72hrs\"),\"\",IF(X20=\"+72hrs\",\"Entregado\",CONSOLIDADO!S20)))","v":""},45805,"Entregado",1,1,0,0,0,0,0,"A Tiempo",1,0,0,0,{"$f":"IF(V20=\"Lima\",NETWORKDAYS.INTL(D20,M20,11,'Dias Feriados'!$A$1:$A$15),IF(AND(V20=\"provincia\",X20=\"24hrs\"),1,IF(AND(V20=\"provincia\",X20=\"48hrs\"),2,NETWORKDAYS.INTL(D20,M20,11,'Dias Feriados'!$A$1:$A$15))))","v":1}]
["B001667513","May","2025-05-27","2025-05-28","G/I. 030-10132",20,"JOSSELIN FIORELLA SIGUAS TORRE","CENTRO POBLADO BUENAVENTURA LT 15 COST CONDOMINIO CABALLERIZAS SAN JOSE","Provincia","CHINCHA","EL CARMEN","B001667513",null,"En Ruta",9730017140,"F",202508,203201,"En Ruta","Dia 1","CARMEL","PROVINCIA",{"$f":"NETWORKDAYS.INTL(D21,M21,11,'Dias Feriados'!$A$1:$A$15)","v":-39255},"En Ruta",22,"NO",null,0.9375,0.94722222222222219,1,"MAGALLANES","2025-05-28",null,null,45804,"",{"$f":"IF(AS21=\"Devuelto\",\"\",IF(X21=\"24hrs\",\"Entregado\",CONSOLIDADO!S21))","v":"En Ruta"},"",{"$f":"IF(AK21=\"Entregado\",\"\",IF(X21=\"24hrs\",\"\",IF(X21=\"48hrs\",\"Entregado\",CONSOLIDADO!S21)))","v":"En Ruta"},"",{"$f":"IF(AK21=\"Entregado\",\"\",IF(OR(X21=\"24hrs\",X21=\"48hrs\"),\"\",IF(X21=\"72hrs\",\"Entregado\",CONSOLIDADO!S21)))","v":"En Ruta"},"",{"$f":"IF(AK21=\"Entregado\",\"\",IF(OR(X21=\"24hrs\",X21=\"48hrs\",X21=\"72hrs\"),\"\",IF(X21=\"+72hrs\",\"Entregado\",CONSOLIDADO!S21)))","v":"En Ruta"},"","En Ruta",1,0,0,0,0,1,0,"No Entregado",0,0,1,0,{"$f":"IF(V21=\"Lima\",NETWORKDAYS.INTL(D21,M21,11,'Dias Feriados'!$A$1:$A$15),IF(AND(V21=\"provincia\",X21=\"24hrs\"),1,IF(AND(V21=\"provincia\",X21=\"48hrs\"),2,NETWORKDAYS.INTL(D21,M21,11,'Dias Feriados'!$A$1:$A$15))))","v":-39255}]
["B001667398","May","2025-05-27","2025-05-28","G/I. 030-10132",21,"NARDA DE BELEN RONCEROS","CENTRO POBLADO SAN JOSE MZ B LT 19 CENTRO MEDICO SAN JOSE","Provincia","CHINCHA","EL CARMEN","B001667398",null,"En Ruta",9730017167,"F",202508,203201,"En Ruta","Dia 1","CARMEL","PROVINCIA",{"$f":"NETWORKDAYS.INTL(D22,M22,11,'Dias Feriados'!$A$1:$A$15)","v":-39255},"En Ruta",22,"NO",null,0.9375,0.94722222222222219,1,"MAGALLANES","2025-05-28",null,null,45804,"",{"$f":"IF(AS22=\"Devuelto\",\"\",IF(X22=\"24hrs\",\"Entregado\",CONSOLIDADO!S22))","v":"En Ruta"},"",{"$f":"IF(AK22=\"Entregado\",\"\",IF(X22=\"24hrs\",\"\",IF(X22=\"48hrs\",\"Entregado\",CONSOLIDADO!S22)))","v":"En Ruta"},"",{"$f":"IF(AK22=\"Entregado\",\"\",IF(OR(X22=\"24hrs\",X22=\"48hrs\"),\"\",IF(X22=\"72hrs\",\"Entregado\",CONSOLIDADO!S22)))","v":"En Ruta"},"",{"$f":"IF(AK22=\"Entregado\",\"\",IF(OR(X22=\"24hrs\",X22=\"48hrs\",X22=\"72hrs\"),\"\",IF(X22=\"+72hrs\",\"Entregado\",CONSOLIDADO!S22)))","v":"En Ruta"},"","En Ruta",1,0,0,0,0,1,0,"No Entregado",0,0,1,0,{"$f":"IF(V22=\"Lima\",NETWORKDAYS.INTL(D22,M22,11,'Dias Feriados'!$A$1:$A$15),IF(AND(V22=\"provincia\",X22=\"24hrs\"),1,IF(AND(V22=\"provincia\",X22=\"48hrs\"),2,NETWORKDAYS.INTL(D22,M22,11,'Dias Feriados'!$A$1:$A$15))))","v":-39255}]
["B001667595","May","2025-05-27","2025-05-28","G/I. 030-10132",22,"MARIA VICTORIA BOHORQUEZ DE RO","CP SAN JOSE MZB LT 19 COSTADO DE LA POSTA","Provincia","CHINCHA","EL CARMEN","B001667595",null,"En Ruta",9730017196,"F",202508,203201,"En Ruta","Dia 1","CARMEL","PROVINCIA",{"$f":"NETWORKDAYS.INTL(D23,M23,11,'Dias Feriados'!$A$1:$A$15)","v":-39255},"En Ruta",22,"NO",null,0.9375,0.94722222222222219,1,"MAGALLANES","2025-05-28",null,null,45804,"",{"$f":"IF(AS23=\"Devuelto\",\"\",IF(X23=\"24hrs\",\"Entregado\",CONSOLIDADO!S23))","v":"En Ruta"},"",{"$f":"IF(AK23=\"Entregado\",\"\",IF(X23=\"24hrs\",\"\",IF(X23=\"48hrs\",\"Entregado\",CONSOLIDADO!S23)))","v":"En Ruta"},"",{"$f":"IF(AK23=\"Entregado\",\"\",IF(OR(X23=\"24hrs\",X23=\"48hrs\"),\"\",IF(X23=\"72hrs\",\"Entregado\",CONSOLIDADO!S23)))","v":"En Ruta"},"",{"$f":"IF(AK23=\"Entregado\",\"\",IF(OR(X23=\"24hrs\",X23=\"48hrs\",X23=\"72hrs\"),\"\",IF(X23=\"+72hrs\",\"Entregado\",CONSOLIDADO!S23)))","v":"En Ruta"},"","En Ruta",1,0,0,0,0,1,0,"No Entregado",0,0,1,0,{"$f":"IF(V23=\"Lima\",NETWORKDAYS.INTL(D23,M23,11,'Dias Feriados'!$A$1:$A$15),IF(AND(V23=\"provincia\",X23=\"24hrs\"),1,IF(AND(V23=\"provincia\",X23=\"48hrs\"),2,NETWORKDAYS.INTL(D23,M23,11,'Dias Feriados'!$A$1:$A$15))))","v":-39255}]
["B001667541","May","2025-05-27","2025-05-28","G/I. 030-10132",23,"ANJELI DAYANA QUISPE SIGUAS","CP SAN JOSE MZ B LT 80 ESPALDA COL INICIAL","Provincia","CHINCHA","EL CARMEN","B001667541",null,"En Ruta",9730017283,"F",202508,203201,"En Ruta","Dia 1","CARMEL","PROVINCIA",{"$f":"NETWORKDAYS.INTL(D24,M24,11,'Dias Feriados'!$A$1:$A$15)","v":-39255},"En Ruta",22,"NO",null,0.9375,0.94722222222222219,1,"MAGALLANES","2025-05-28",null,null,45804,"",{"$f":"IF(AS24=\"Devuelto\",\"\",IF(X24=\"24hrs\",\"Entregado\",CONSOLIDADO!S24))","v":"En Ruta"},"",{"$f":"IF(AK24=\"Entregado\",\"\",IF(X24=\"24hrs\",\"\",IF(X24=\"48hrs\",\"Entregado\",CONSOLIDADO!S24)))","v":"En Ruta"},"",{"$f":"IF(AK24=\"Entregado\",\"\",IF(OR(X24=\"24hrs\",X24=\"48hrs\"),\"\",IF(X24=\"72hrs\",\"Entregado\",CONSOLIDADO!S24)))","v":"En Ruta"},"",{"$f":"IF(AK24=\"Entregado\",\"\",IF(OR(X24=\"24hrs\",X24=\"48hrs\",X24=\"72hrs\"),\"\",IF(X24=\"+72hrs\",\"Entregado\",CONSOLIDADO!S24)))","v":"En Ruta"},"","En Ruta",1,0,0,0,0,1,0,"No Entregado",0,0,1,0,{"$f":"IF(V24=\"Lima\",NETWORKDAYS.INTL(D24,M24,11,'Dias Feriados'!$A$1:$A$15),IF(AND(V24=\"provincia\",X24=\"24hrs\"),1,IF(AND(V24=\"provincia\",X24=\"48hrs\"),2,NETWORKDAYS.INTL(D24,M24,11,'Dias Feriados'!$A$1:$A$15))))","v":-39255}]
["B001667510","May","2025-05-27","2025-05-28","G/I. 030-10132",24,"LEYDI YESENIA ANAMPA HUACAHUAS","CALLE PRINCIPAL MZ B LT 80 DETRAS DEL COLEGIO INICIAL 240 EL CARMEN CP SAN JOSE","Provincia","CHINCHA","EL CARMEN","B001667510",null,"En Ruta",9730017323,"F",202508,203201,"En Ruta","Dia 1","CARMEL","PROVINCIA",{"$f":"NETWORKDAYS.INTL(D25,M25,11,'Dias Feriados'!$A$1:$A$15)","v":-39255},"En Ruta",22,"NO",null,0.9375,0.94722222222222219,1,"MAGALLANES","2025-05-28",null,null,45804,"",{"$f":"IF(AS25=\"Devuelto\",\"\",IF(X25=\"24hrs\",\"Entregado\",CONSOLIDADO!S25))","v":"En Ruta"},"",{"$f":"IF(AK25=\"Entregado\",\"\",IF(X25=\"24hrs\",\"\",IF(X25=\"48hrs\",\"Entregado\",CONSOLIDADO!S25)))","v":"En Ruta"},"",{"$f":"IF(AK25=\"Entregado\",\"\",IF(OR(X25=\"24hrs\",X25=\"48hrs\"),\"\",IF(X25=\"72hrs\",\"Entregado\",CONSOLIDADO!S25)))","v":"En Ruta"},"",{"$f":"IF(AK25=\"Entregado\",\"\",IF(OR(X25=\"24hrs\",X25=\"48hrs\",X25=\"72hrs\"),\"\",IF(X25=\"+72hrs\",\"Entregado\",CONSOLIDADO!S25)))","v":"En Ruta"},"","En Ruta",1,0,0,0,0,1,0,"No Entregado",0,0,1,0,{"$f":"IF(V25=\"Lima\",NETWORKDAYS.INTL(D25,M25,11,'Dias Feriados'!$A$1:$A$15),IF(AND(V25=\"provincia\",X25=\"24hrs\"),1,IF(AND(V25=\"provincia\",X25=\"48hrs\"),2,NETWORKDAYS.INTL(D25,M25,11,'Dias Feriados'!$A$1:$A$15))))","v":-39255}]
["B001667489","May","2025-05-27","2025-05-28","G/I. 030-10132",25,"NARDA JANET MEJIA CASTRILLON","CL CARRILLO 121 FRENTE COLEGIO INICIAL 256","Provincia","CHINCHA","EL CARMEN","B001667489",null,"En Ruta",9730017399,"F",202508,203201,"En Ruta","Dia 1","CARMEL","PROVINCIA",{"$f":"NETWORKDAYS.INTL(D26,M26,11,'Dias Feriados'!$A$1:$A$15)","v":-39255},"En Ruta",22,"NO",null,0.9375,0.94722222222222219,1,"MAGALLANES","2025-05-28",null,null,45804,"",{"$f":"IF(AS26=\"Devuelto\",\"\",IF(X26=\"24hrs\",\"Entregado\",CONSOLIDADO!S26))","v":"En Ruta"},"",{"$f":"IF(AK26=\"Entregado\",\"\",IF(X26=\"24hrs\",\"\",IF(X26=\"48hrs\",\"Entregado\",CONSOLIDADO!S26)))","v":"En Ruta"},"",{"$f":"IF(AK26=\"Entregado\",\"\",IF(OR(X26=\"24hrs\",X26=\"48hrs\"),\"\",IF(X26=\"72hrs\",\"Entregado\",CONSOLIDADO!S26)))","v":"En Ruta"},"",{"$f":"IF(AK26=\"Entregado\",\"\",IF(OR(X26=\"24hrs\",X26=\"48hrs\",X26=\"72hrs\"),\"\",IF(X26=\"+72hrs\",\"Entregado\",CONSOLIDADO!S26)))","v":"En Ruta"},"","En Ruta",1,0,0,0,0,1,0,"No Entregado",0,0,1,0,{"$f":"IF(V26=\"Lima\",NETWORKDAYS.INTL(D26,M26,11,'Dias Feriados'!$A$1:$A$15),IF(AND(V26=\"provincia\",X26=\"24hrs\"),1,IF(AND(V26=\"provincia\",X26=\"48hrs\"),2,NETWORKDAYS.INTL(D26,M26,11,'Dias Feriados'!$A$1:$A$15))))","v":-39255}]
["B001667407","May","2025-05-27","2025-05-28","G/I. 030-10132",26,"SELENE BOHORQUEZ RAMOS","PLAZA DE ARMAS 308 RESTAURANTE DE ODALI DISTRITO DE EL CARMEN","Provincia","CHINCHA","EL CARMEN","B001667407","2025-05-28","Entregado",9730017432,"F",202508,203201,"Entregado","Dia 1","CARMEL","PROVINCIA",{"$f":"NETWORKDAYS.INTL(D27,M27,11,'Dias Feriados'!$A$1:$A$15)","v":1},"24hrs",22,"NO",null,0.9375,0.94722222222222219,1,"MAGALLANES","2025-05-28",null,null,45804,45805,{"$f":"IF(AS27=\"Devuelto\",\"\",IF(X27=\"24hrs\",\"Entregado\",CONSOLIDADO!S27))","v":"Entregado"},"",{"$f":"IF(AK27=\"Entregado\",\"\",IF(X27=\"24hrs\",\"\",IF(X27=\"48hrs\",\"Entregado\",CONSOLIDADO!S27)))","v":""},"",{"$f":"IF(AK27=\"Entregado\",\"\",IF(OR(X27=\"24hrs\",X27=\"48hrs\"),\"\",IF(X27=\"72hrs\",\"Entregado\",CONSOLIDADO!S27)))","v":""},"",{"$f":"IF(AK27=\"Entregado\",\"\",IF(OR(X27=\"24hrs\",X27=\"48hrs\",X27=\"72hrs\"),\"\",IF(X27=\"+72hrs\",\"Entregado\",CONSOLIDADO!S27)))","v":""},45805,"Entregado",1,1,0,0,0,0,0,"A Tiempo",1,0,0,0,{"$f":"IF(V27=\"Lima\",NETWORKDAYS.INTL(D27,M27,11,'Dias Feriados'!$A$1:$A$15),IF(AND(V27=\"provincia\",X27=\"24hrs\"),1,IF(AND(V27=\"provincia\",X27=\"48hrs\"),2,NETWORKDAYS.INTL(D27,M27,11,'Dias Feriados'!$A$1:$A$15))))","v":1}]
["B001667501","May","2025-05-27","2025-05-28","G/I. 030-10132",27,"MILAGROS ANGELINA VILLA CABRER","MARISCAL CASTILLA 2 MZ B LT LOTE ESPALDA DEL COLEGIO MELCHORITA","Provincia","CHINCHA","GROCIO PRADO","B001667501","2025-05-28","Entregado",9730017031,"F",202508,203201,"Entregado","Dia 1","CARMEL","PROVINCIA",{"$f":"NETWORKDAYS.INTL(D28,M28,11,'Dias Feriados'!$A$1:$A$15)","v":1},"24hrs",22,"NO",null,0.9375,0.94722222222222219,1,"MAGALLANES","2025-05-28",null,null,45804,45805,{"$f":"IF(AS28=\"Devuelto\",\"\",IF(X28=\"24hrs\",\"Entregado\",CONSOLIDADO!S28))","v":"Entregado"},"",{"$f":"IF(AK28=\"Entregado\",\"\",IF(X28=\"24hrs\",\"\",IF(X28=\"48hrs\",\"Entregado\",CONSOLIDADO!S28)))","v":""},"",{"$f":"IF(AK28=\"Entregado\",\"\",IF(OR(X28=\"24hrs\",X28=\"48hrs\"),\"\",IF(X28=\"72hrs\",\"Entregado\",CONSOLIDADO!S28)))","v":""},"",{"$f":"IF(AK28=\"Entregado\",\"\",IF(OR(X28=\"24hrs\",X28=\"48hrs\",X28=\"72hrs\"),\"\",IF(X28=\"+72hrs\",\"Entregado\",CONSOLIDADO!S28)))","v":""},45805,"Entregado",1,1,0,0,0,0,0,"A Tiempo",1,0,0,0,{"$f":"IF(V28=\"Lima\",NETWORKDAYS.INTL(D28,M28,11,'Dias Feriados'!$A$1:$A$15),IF(AND(V28=\"provincia\",X28=\"24hrs\"),1,IF(AND(V28=\"provincia\",X28=\"48hrs\"),2,NETWORKDAYS.INTL(D28,M28,11,'Dias Feriados'!$A$1:$A$15))))","v":1}]
["B001667477","May","2025-05-27","2025-05-28","G/I. 030-10132",28,"MARELLA CHAVEZ FAJARDO","CL SIMON BOLIVAR MZ C LT 33 ESTADIO DE CHINCHA URB MAGISTERIAL","Provincia","CHINCHA","PUEBLO NUEVO","B001667477","2025-05-28","Entregado",9730017011,"F",202508,203201,"Entregado","Dia 1","CARMEL","PROVINCIA",{"$f":"NETWORKDAYS.INTL(D29,M29,11,'Dias Feriados'!$A$1:$A$15)","v":1},"24hrs",22,"NO",null,0.9375,0.94722222222222219,1,"MAGALLANES","2025-05-28",null,null,45804,45805,{"$f":"IF(AS29=\"Devuelto\",\"\",IF(X29=\"24hrs\",\"Entregado\",CONSOLIDADO!S29))","v":"Entregado"},"",{"$f":"IF(AK29=\"Entregado\",\"\",IF(X29=\"24hrs\",\"\",IF(X29=\"48hrs\",\"Entregado\",CONSOLIDADO!S29)))","v":""},"",{"$f":"IF(AK29=\"Entregado\",\"\",IF(OR(X29=\"24hrs\",X29=\"48hrs\"),\"\",IF(X29=\"72hrs\",\"Entregado\",CONSOLIDADO!S29)))","v":""},"",{"$f":"IF(AK29=\"Entregado\",\"\",IF(OR(X29=\"24hrs\",X29=\"48hrs\",X29=\"72hrs\"),\"\",IF(X29=\"+72hrs\",\"Entregado\",CONSOLIDADO!S29)))","v":""},45805,"Entregado",1,1,0,0,0,0,0,"A Tiempo",1,0,0,0,{"$f":"IF(V29=\"Lima\",NETWORKDAYS.INTL(D29,M29,11,'Dias Feriados'!$A$1:$A$15),IF(AND(V29=\"provincia\",X29=\"24hrs\"),1,IF(AND(V29=\"provincia\",X29=\"48hrs\"),2,NETWORKDAYS.INTL(D29,M29,11,'Dias Feriados'!$A$1:$A$15))))","v":1}]
["B001667372","May","2025-05-27","2025-05-28","G/I. 030-10132",29,"SHIRLEY CAMILLA MANSILLA CORDO","CL SAN ISIDRO PUEBLO NUEVO 1100 FRENTE AL PARQUE DE LA REVOLUCION","Provincia","CHINCHA","PUEBLO NUEVO","B001667372","2025-05-28","Entregado",9730017044,"F",202508,203201,"Entregado","Dia 1","CARMEL","PROVINCIA",{"$f":"NETWORKDAYS.INTL(D30,M30,11,'Dias Feriados'!$A$1:$A$15)","v":1},"24hrs",22,"NO",null,0.9375,0.94722222222222219,1,"MAGALLANES","2025-05-28",null,null,45804,45805,{"$f":"IF(AS30=\"Devuelto\",\"\",IF(X30=\"24hrs\",\"Entregado\",CONSOLIDADO!S30))","v":"Entregado"},"",{"$f":"IF(AK30=\"Entregado\",\"\",IF(X30=\"24hrs\",\"\",IF(X30=\"48hrs\",\"Entregado\",CONSOLIDADO!S30)))","v":""},"",{"$f":"IF(AK30=\"Entregado\",\"\",IF(OR(X30=\"24hrs\",X30=\"48hrs\"),\"\",IF(X30=\"72hrs\",\"Entregado\",CONSOLIDADO!S30)))","v":""},"",{"$f":"IF(AK30=\"Entregado\",\"\",IF(OR(X30=\"24hrs\",X30=\"48hrs\",X30=\"72hrs\"),\"\",IF(X30=\"+72hrs\",\"Entregado\",CONSOLIDADO!S30)))","v":""},45805,"Entregado",1,1,0,0,0,0,0,"A Tiempo",1,0,0,0,{"$f":"IF(V30=\"Lima\",NETWORKDAYS.INTL(D30,M30,11,'Dias Feriados'!$A$1:$A$15),IF(AND(V30=\"provincia\",X30=\"24hrs\"),1,IF(AND(V30=\"provincia\",X30=\"48hrs\"),2,NETWORKDAYS.INTL(D30,M30,11,'Dias Feriados'!$A$1:$A$15))))","v":1}]
["B001667480","May","2025-05-27","2025-05-28","G/I. 030-10132",30,"MARIA DEL CARMEN PEREZ LEVANO","TECHO PROPIO 1 MZ N LT 16 POR EL TECNOLOGICO LOS VINEDOS N 16","Provincia","CHINCHA","PUEBLO NUEVO","B001667480","2025-05-28","Entregado",9730017138,"F",202508,203201,"Entregado","Dia 1","CARMEL","PROVINCIA",{"$f":"NETWORKDAYS.INTL(D31,M31,11,'Dias Feriados'!$A$1:$A$15)","v":1},"24hrs",22,"NO",null,0.9375,0.94722222222222219,1,"MAGALLANES","2025-05-28",null,null,45804,45805,{"$f":"IF(AS31=\"Devuelto\",\"\",IF(X31=\"24hrs\",\"Entregado\",CONSOLIDADO!S31))","v":"Entregado"},"",{"$f":"IF(AK31=\"Entregado\",\"\",IF(X31=\"24hrs\",\"\",IF(X31=\"48hrs\",\"Entregado\",CONSOLIDADO!S31)))","v":""},"",{"$f":"IF(AK31=\"Entregado\",\"\",IF(OR(X31=\"24hrs\",X31=\"48hrs\"),\"\",IF(X31=\"72hrs\",\"Entregado\",CONSOLIDADO!S31)))","v":""},"",{"$f":"IF(AK31=\"Entregado\",\"\",IF(OR(X31=\"24hrs\",X31=\"48hrs\",X31=\"72hrs\"),\"\",IF(X31=\"+72hrs\",\"Entregado\",CONSOLIDADO!S31)))","v":""},45805,"Entregado",1,1,0,0,0,0,0,"A Tiempo",1,0,0,0,{"$f":"IF(V31=\"Lima\",NETWORKDAYS.INTL(D31,M31,11,'Dias Feriados'!$A$1:$A$15),IF(AND(V31=\"provincia\",X31=\"24hrs\"),1,IF(AND(V31=\"provincia\",X31=\"48hrs\"),2,NETWORKDAYS.INTL(D31,M31,11,'Dias Feriados'!$A$1:$A$15))))","v":1}]
["B001667760","May","2025-05-27","2025-05-28","G/I. 030-10132",31,"MARIA ANTONIA GALVEZ ENRIQUEZ","CL CUZCO MZCH LT 10A MICAELA BASTIDA PANADERIA BOSEDAL","Provincia","CHINCHA","PUEBLO NUEVO","B001667760","2025-05-28","Entregado",9730017142,"F",202508,203201,"Entregado","Dia 1","CARMEL","PROVINCIA",{"$f":"NETWORKDAYS.INTL(D32,M32,11,'Dias Feriados'!$A$1:$A$15)","v":1},"24hrs",22,"NO",null,0.9375,0.94722222222222219,1,"MAGALLANES","2025-05-28",null,null,45804,45805,{"$f":"IF(AS32=\"Devuelto\",\"\",IF(X32=\"24hrs\",\"Entregado\",CONSOLIDADO!S32))","v":"Entregado"},"",{"$f":"IF(AK32=\"Entregado\",\"\",IF(X32=\"24hrs\",\"\",IF(X32=\"48hrs\",\"Entregado\",CONSOLIDADO!S32)))","v":""},"",{"$f":"IF(AK32=\"Entregado\",\"\",IF(OR(X32=\"24hrs\",X32=\"48hrs\"),\"\",IF(X32=\"72hrs\",\"Entregado\",CONSOLIDADO!S32)))","v":""},"",{"$f":"IF(AK32=\"Entregado\",\"\",IF(OR(X32=\"24hrs\",X32=\"48hrs\",X32=\"72hrs\"),\"\",IF(X32=\"+72hrs\",\"Entregado\",CONSOLIDADO!S32)))","v":""},45805,"Entregado",1,1,0,0,0,0,0,"A Tiempo",1,0,0,0,{"$f":"IF(V32=\"Lima\",NETWORKDAYS.INTL(D32,M32,11,'Dias Feriados'!$A$1:$A$15),IF(AND(V32=\"provincia\",X32=\"24hrs\"),1,IF(AND(V32=\"provincia\",X32=\"48hrs\"),2,NETWORKDAYS.INTL(D32,M32,11,'Dias Feriados'!$A$1:$A$15))))","v":1}]
["B001667668","May","2025-05-27","2025-05-28","G/I. 030-10132",32,"ESTHER DANISA VELAZCO MOLINA","BUENAVENTURA MZB LT 6 POR LA PISTA CARRETERA ALTO LARAN","Provincia","CHINCHA","PUEBLO NUEVO","B001667668","2025-05-28","Entregado",9730017149,"F",202508,203201,"Entregado","Dia 1","CARMEL","PROVINCIA",{"$f":"NETWORKDAYS.INTL(D33,M33,11,'Dias Feriados'!$A$1:$A$15)","v":1},"24hrs",22,"NO",null,0.9375,0.94722222222222219,1,"MAGALLANES","2025-05-28",null,null,45804,45805,{"$f":"IF(AS33=\"Devuelto\",\"\",IF(X33=\"24hrs\",\"Entregado\",CONSOLIDADO!S33))","v":"Entregado"},"",{"$f":"IF(AK33=\"Entregado\",\"\",IF(X33=\"24hrs\",\"\",IF(X33=\"48hrs\",\"Entregado\",CONSOLIDADO!S33)))","v":""},"",{"$f":"IF(AK33=\"Entregado\",\"\",IF(OR(X33=\"24hrs\",X33=\"48hrs\"),\"\",IF(X33=\"72hrs\",\"Entregado\",CONSOLIDADO!S33)))","v":""},"",{"$f":"IF(AK33=\"Entregado\",\"\",IF(OR(X33=\"24hrs\",X33=\"48hrs\",X33=\"72hrs\"),\"\",IF(X33=\"+72hrs\",\"Entregado\",CONSOLIDADO!S33)))","v":""},45805,"Entregado",1,1,0,0,0,0,0,"A Tiempo",1,0,0,0,{"$f":"IF(V33=\"Lima\",NETWORKDAYS.INTL(D33,M33,11,'Dias Feriados'!$A$1:$A$15),IF(AND(V33=\"provincia\",X33=\"24hrs\"),1,IF(AND(V33=\"provincia\",X33=\"48hrs\"),2,NETWORKDAYS.INTL(D33,M33,11,'Dias Feriados'!$A$1:$A$15))))","v":1}]
["B001667644","May","2025-05-27","2025-05-28","G/I. 030-10132",33,"JOVITA CLAUDETTE FRIAS ASCONA","AV VICTOR ANDRES BELAUNDE 341 A MEDIA CUADRA DE NOTARIA MORON","Provincia","CHINCHA","PUEBLO NUEVO","B001667644","2025-05-28","Entregado",9730017169,"F",202508,203201,"Entregado","Dia 1","CARMEL","PROVINCIA",{"$f":"NETWORKDAYS.INTL(D34,M34,11,'Dias Feriados'!$A$1:$A$15)","v":1},"24hrs",22,"NO",null,0.9375,0.94722222222222219,1,"MAGALLANES","2025-05-28",null,null,45804,45805,{"$f":"IF(AS34=\"Devuelto\",\"\",IF(X34=\"24hrs\",\"Entregado\",CONSOLIDADO!S34))","v":"Entregado"},"",{"$f":"IF(AK34=\"Entregado\",\"\",IF(X34=\"24hrs\",\"\",IF(X34=\"48hrs\",\"Entregado\",CONSOLIDADO!S34)))","v":""},"",{"$f":"IF(AK34=\"Entregado\",\"\",IF(OR(X34=\"24hrs\",X34=\"48hrs\"),\"\",IF(X34=\"72hrs\",\"Entregado\",CONSOLIDADO!S34)))","v":""},"",{"$f":"IF(AK34=\"Entregado\",\"\",IF(OR(X34=\"24hrs\",X34=\"48hrs\",X34=\"72hrs\"),\"\",IF(X34=\"+72hrs\",\"Entregado\",CONSOLIDADO!S34)))","v":""},45805,"Entregado",1,1,0,0,0,0,0,"A Tiempo",1,0,0,0,{"$f":"IF(V34=\"Lima\",NETWORKDAYS.INTL(D34,M34,11,'Dias Feriados'!$A$1:$A$15),IF(AND(V34=\"provincia\",X34=\"24hrs\"),1,IF(AND(V34=\"provincia\",X34=\"48hrs\"),2,NETWORKDAYS.INTL(D34,M34,11,'Dias Feriados'!$A$1:$A$15))))","v":1}]
["B001668095","May","2025-05-27","2025-05-28","G/I. 030-10132",34,"NAYERLY DELPILAR AYONA MURICHE","LEN DE VIVERO MZ HLT 06 COL CAIROS PQ SANTA ROSA","Provincia","CHINCHA","PUEBLO NUEVO","B001668095",null,"En Ruta",9730017179,"F",202508,203201,"En Ruta","Dia 1","CARMEL","PROVINCIA",{"$f":"NETWORKDAYS.INTL(D35,M35,11,'Dias Feriados'!$A$1:$A$15)","v":-39255},"En Ruta",22,"NO",null,0.9375,0.94722222222222219,1,"MAGALLANES","2025-05-28",null,null,45804,"",{"$f":"IF(AS35=\"Devuelto\",\"\",IF(X35=\"24hrs\",\"Entregado\",CONSOLIDADO!S35))","v":"En Ruta"},"",{"$f":"IF(AK35=\"Entregado\",\"\",IF(X35=\"24hrs\",\"\",IF(X35=\"48hrs\",\"Entregado\",CONSOLIDADO!S35)))","v":"En Ruta"},"",{"$f":"IF(AK35=\"Entregado\",\"\",IF(OR(X35=\"24hrs\",X35=\"48hrs\"),\"\",IF(X35=\"72hrs\",\"Entregado\",CONSOLIDADO!S35)))","v":"En Ruta"},"",{"$f":"IF(AK35=\"Entregado\",\"\",IF(OR(X35=\"24hrs\",X35=\"48hrs\",X35=\"72hrs\"),\"\",IF(X35=\"+72hrs\",\"Entregado\",CONSOLIDADO!S35)))","v":"En Ruta"},"","En Ruta",1,0,0,0,0,1,0,"No Entregado",0,0,1,0,{"$f":"IF(V35=\"Lima\",NETWORKDAYS.INTL(D35,M35,11,'Dias Feriados'!$A$1:$A$15),IF(AND(V35=\"provincia\",X35=\"24hrs\"),1,IF(AND(V35=\"provincia\",X35=\"48hrs\"),2,NETWORKDAYS.INTL(D35,M35,11,'Dias Feriados'!$A$1:$A$15))))","v":-39255}]
["B001668350","May","2025-05-27","2025-05-28","G/I. 030-10132",35,"MARIA ESTHER ORE VILLA","URB MAGISTERIAL MZ D LT 17 FRENTE AL ESTADIO","Provincia","CHINCHA","PUEBLO NUEVO","B001668350","2025-05-28","Entregado",9730017204,"F",202508,203201,"Entregado","Dia 1","CARMEL","PROVINCIA",{"$f":"NETWORKDAYS.INTL(D36,M36,11,'Dias Feriados'!$A$1:$A$15)","v":1},"24hrs",22,"NO",null,0.9375,0.94722222222222219,1,"MAGALLANES","2025-05-28",null,null,45804,45805,{"$f":"IF(AS36=\"Devuelto\",\"\",IF(X36=\"24hrs\",\"Entregado\",CONSOLIDADO!S36))","v":"Entregado"},"",{"$f":"IF(AK36=\"Entregado\",\"\",IF(X36=\"24hrs\",\"\",IF(X36=\"48hrs\",\"Entregado\",CONSOLIDADO!S36)))","v":""},"",{"$f":"IF(AK36=\"Entregado\",\"\",IF(OR(X36=\"24hrs\",X36=\"48hrs\"),\"\",IF(X36=\"72hrs\",\"Entregado\",CONSOLIDADO!S36)))","v":""},"",{"$f":"IF(AK36=\"Entregado\",\"\",IF(OR(X36=\"24hrs\",X36=\"48hrs\",X36=\"72hrs\"),\"\",IF(X36=\"+72hrs\",\"Entregado\",CONSOLIDADO!S36)))","v":""},45805,"Entregado",1,1,0,0,0,0,0,"A Tiempo",1,0,0,0,{"$f":"IF(V36=\"Lima\",NETWORKDAYS.INTL(D36,M36,11,'Dias Feriados'!$A$1:$A$15),IF(AND(V36=\"provincia\",X36=\"24hrs\"),1,IF(AND(V36=\"provincia\",X36=\"48hrs\"),2,NETWORKDAYS.INTL(D36,M36,11,'Dias Feriados'!$A$1:$A$15))))","v":1}]
["B001667709","May","2025-05-27","2025-05-28","G/I. 030-10132",36,"MILUSKA ANGELICA HUERTAS TIPIC","JR SANTA ROSA 1021 PAR DE LA REVOLUCION","Provincia","CHINCHA","PUEBLO NUEVO","B001667709","2025-05-28","Entregado",9730017385,"F",202508,203201,"Entregado","Dia 1","CARMEL","PROVINCIA",{"$f":"NETWORKDAYS.INTL(D37,M37,11,'Dias Feriados'!$A$1:$A$15)","v":1},"24hrs",22,"NO",null,0.9375,0.94722222222222219,1,"MAGALLANES","2025-05-28",null,null,45804,45805,{"$f":"IF(AS37=\"Devuelto\",\"\",IF(X37=\"24hrs\",\"Entregado\",CONSOLIDADO!S37))","v":"Entregado"},"",{"$f":"IF(AK37=\"Entregado\",\"\",IF(X37=\"24hrs\",\"\",IF(X37=\"48hrs\",\"Entregado\",CONSOLIDADO!S37)))","v":""},"",{"$f":"IF(AK37=\"Entregado\",\"\",IF(OR(X37=\"24hrs\",X37=\"48hrs\"),\"\",IF(X37=\"72hrs\",\"Entregado\",CONSOLIDADO!S37)))","v":""},"",{"$f":"IF(AK37=\"Entregado\",\"\",IF(OR(X37=\"24hrs\",X37=\"48hrs\",X37=\"72hrs\"),\"\",IF(X37=\"+72hrs\",\"Entregado\",CONSOLIDADO!S37)))","v":""},45805,"Entregado",1,1,0,0,0,0,0,"A Tiempo",1,0,0,0,{"$f":"IF(V37=\"Lima\",NETWORKDAYS.INTL(D37,M37,11,'Dias Feriados'!$A$1:$A$15),IF(AND(V37=\"provincia\",X37=\"24hrs\"),1,IF(AND(V37=\"provincia\",X37=\"48hrs\"),2,NETWORKDAYS.INTL(D37,M37,11,'Dias Feriados'!$A$1:$A$15))))","v":1}]
["B001667410","May","2025-05-27","2025-05-28","G/I. 030-10132",37,"LUISA MARIA LHY CASTELLANO","JR ICA 840 FRENTE AL COLEGIO 2 DE MAYO","Provincia","CHINCHA","PUEBLO NUEVO","B001667410","2025-05-28","Entregado",9730017513,"F",202508,203201,"Entregado","Dia 1","CARMEL","PROVINCIA",{"$f":"NETWORKDAYS.INTL(D38,M38,11,'Dias Feriados'!$A$1:$A$15)","v":1},"24hrs",22,"NO",null,0.9375,0.94722222222222219,1,"MAGALLANES","2025-05-28",null,null,45804,45805,{"$f":"IF(AS38=\"Devuelto\",\"\",IF(X38=\"24hrs\",\"Entregado\",CONSOLIDADO!S38))","v":"Entregado"},"",{"$f":"IF(AK38=\"Entregado\",\"\",IF(X38=\"24hrs\",\"\",IF(X38=\"48hrs\",\"Entregado\",CONSOLIDADO!S38)))","v":""},"",{"$f":"IF(AK38=\"Entregado\",\"\",IF(OR(X38=\"24hrs\",X38=\"48hrs\"),\"\",IF(X38=\"72hrs\",\"Entregado\",CONSOLIDADO!S38)))","v":""},"",{"$f":"IF(AK38=\"Entregado\",\"\",IF(OR(X38=\"24hrs\",X38=\"48hrs\",X38=\"72hrs\"),\"\",IF(X38=\"+72hrs\",\"Entregado\",CONSOLIDADO!S38)))","v":""},45805,"Entregado",1,1,0,0,0,0,0,"A Tiempo",1,0,0,0,{"$f":"IF(V38=\"Lima\",NETWORKDAYS.INTL(D38,M38,11,'Dias Feriados'!$A$1:$A$15),IF(AND(V38=\"provincia\",X38=\"24hrs\"),1,IF(AND(V38=\"provincia\",X38=\"48hrs\"),2,NETWORKDAYS.INTL(D38,M38,11,'Dias Feriados'!$A$1:$A$15))))","v":1}]
["B001667753","May","2025-05-27","2025-05-28","G/I. 030-10132",38,"MIRIAN ESTHER FLORES MANRIQUE","AV JOSE CRESPRO Y CASTILLO 601","Provincia","CHINCHA","PUEBLO NUEVO","B001667753",null,"En Ruta",9730017517,"F",202508,203201,"En Ruta","Dia 1","CARMEL","PROVINCIA",{"$f":"NETWORKDAYS.INTL(D39,M39,11,'Dias Feriados'!$A$1:$A$15)","v":-39255},"En Ruta",22,"NO",null,0.9375,0.94722222222222219,1,"MAGALLANES","2025-05-28",null,null,45804,"",{"$f":"IF(AS39=\"Devuelto\",\"\",IF(X39=\"24hrs\",\"Entregado\",CONSOLIDADO!S39))","v":"En Ruta"},"",{"$f":"IF(AK39=\"Entregado\",\"\",IF(X39=\"24hrs\",\"\",IF(X39=\"48hrs\",\"Entregado\",CONSOLIDADO!S39)))","v":"En Ruta"},"",{"$f":"IF(AK39=\"Entregado\",\"\",IF(OR(X39=\"24hrs\",X39=\"48hrs\"),\"\",IF(X39=\"72hrs\",\"Entregado\",CONSOLIDADO!S39)))","v":"En Ruta"},"",{"$f":"IF(AK39=\"Entregado\",\"\",IF(OR(X39=\"24hrs\",X39=\"48hrs\",X39=\"72hrs\"),\"\",IF(X39=\"+72hrs\",\"Entregado\",CONSOLIDADO!S39)))","v":"En Ruta"},"","En Ruta",1,0,0,0,0,1,0,"No Entregado",0,0,1,0,{"$f":"IF(V39=\"Lima\",NETWORKDAYS.INTL(D39,M39,11,'Dias Feriados'!$A$1:$A$15),IF(AND(V39=\"provincia\",X39=\"24hrs\"),1,IF(AND(V39=\"provincia\",X39=\"48hrs\"),2,NETWORKDAYS.INTL(D39,M39,11,'Dias Feriados'!$A$1:$A$15))))","v":-39255}]
["B001667334","May","2025-05-27","2025-05-28","G/I. 030-10132",39,"MELISSA DEL PILAR CHAVEZ TRELL","PASAJE SANTA ROSA 25 1CDRA SALON REINO TESTIGOS DE JEHOVA","Provincia","CHINCHA","SUNAMPE","B001667334","2025-05-28","Entregado",9730017047,"F",202508,203201,"Entregado","Dia 1","CARMEL","PROVINCIA",{"$f":"NETWORKDAYS.INTL(D40,M40,11,'Dias Feriados'!$A$1:$A$15)","v":1},"24hrs",22,"NO",null,0.9375,0.94722222222222219,1,"MAGALLANES","2025-05-28",null,null,45804,45805,{"$f":"IF(AS40=\"Devuelto\",\"\",IF(X40=\"24hrs\",\"Entregado\",CONSOLIDADO!S40))","v":"Entregado"},"",{"$f":"IF(AK40=\"Entregado\",\"\",IF(X40=\"24hrs\",\"\",IF(X40=\"48hrs\",\"Entregado\",CONSOLIDADO!S40)))","v":""},"",{"$f":"IF(AK40=\"Entregado\",\"\",IF(OR(X40=\"24hrs\",X40=\"48hrs\"),\"\",IF(X40=\"72hrs\",\"Entregado\",CONSOLIDADO!S40)))","v":""},"",{"$f":"IF(AK40=\"Entregado\",\"\",IF(OR(X40=\"24hrs\",X40=\"48hrs\",X40=\"72hrs\"),\"\",IF(X40=\"+72hrs\",\"Entregado\",CONSOLIDADO!S40)))","v":""},45805,"Entregado",1,1,0,0,0,0,0,"A Tiempo",1,0,0,0,{"$f":"IF(V40=\"Lima\",NETWORKDAYS.INTL(D40,M40,11,'Dias Feriados'!$A$1:$A$15),IF(AND(V40=\"provincia\",X40=\"24hrs\"),1,IF(AND(V40=\"provincia\",X40=\"48hrs\"),2,NETWORKDAYS.INTL(D40,M40,11,'Dias Feriados'!$A$1:$A$15))))","v":1}]
["B001667602","May","2025-05-27","2025-05-28","G/I. 030-10132",40,"BETZABE SAMANTHA PAMPAS FLORES","CLLE SAN ALEJANDRO SN COSTADO DEL RESTAURANTE LA CASONA EL BOSQUE","Provincia","CHINCHA","SUNAMPE","B001667602","2025-05-28","Entregado",9730017199,"F",202508,203201,"Entregado","Dia 1","CARMEL","PROVINCIA",{"$f":"NETWORKDAYS.INTL(D41,M41,11,'Dias Feriados'!$A$1:$A$15)","v":1},"24hrs",22,"NO",null,0.9375,0.94722222222222219,1,"MAGALLANES","2025-05-28",null,null,45804,45805,{"$f":"IF(AS41=\"Devuelto\",\"\",IF(X41=\"24hrs\",\"Entregado\",CONSOLIDADO!S41))","v":"Entregado"},"",{"$f":"IF(AK41=\"Entregado\",\"\",IF(X41=\"24hrs\",\"\",IF(X41=\"48hrs\",\"Entregado\",CONSOLIDADO!S41)))","v":""},"",{"$f":"IF(AK41=\"Entregado\",\"\",IF(OR(X41=\"24hrs\",X41=\"48hrs\"),\"\",IF(X41=\"72hrs\",\"Entregado\",CONSOLIDADO!S41)))","v":""},"",{"$f":"IF(AK41=\"Entregado\",\"\",IF(OR(X41=\"24hrs\",X41=\"48hrs\",X41=\"72hrs\"),\"\",IF(X41=\"+72hrs\",\"Entregado\",CONSOLIDADO!S41)))","v":""},45805,"Entregado",1,1,0,0,0,0,0,"A Tiempo",1,0,0,0,{"$f":"IF(V41=\"Lima\",NETWORKDAYS.INTL(D41,M41,11,'Dias Feriados'!$A$1:$A$15),IF(AND(V41=\"provincia\",X41=\"24hrs\"),1,IF(AND(V41=\"provincia\",X41=\"48hrs\"),2,NETWORKDAYS.INTL(D41,M41,11,'Dias Feriados'!$A$1:$A$15))))","v":1}]
["B001667381","May","2025-05-27","2025-05-28","G/I. 030-10132",41,"MILAGRO YOHANA SOTELO MESIAS","JR INDEPENDENCIA 266 PAR JUEGOS AGROPECUARIA CAMOTE","Provincia","CHINCHA","SUNAMPE","B001667381","2025-05-28","Entregado",9730017234,"F",202508,203201,"Entregado","Dia 1","CARMEL","PROVINCIA",{"$f":"NETWORKDAYS.INTL(D42,M42,11,'Dias Feriados'!$A$1:$A$15)","v":1},"24hrs",22,"NO",null,0.9375,0.94722222222222219,1,"MAGALLANES","2025-05-28",null,null,45804,45805,{"$f":"IF(AS42=\"Devuelto\",\"\",IF(X42=\"24hrs\",\"Entregado\",CONSOLIDADO!S42))","v":"Entregado"},"",{"$f":"IF(AK42=\"Entregado\",\"\",IF(X42=\"24hrs\",\"\",IF(X42=\"48hrs\",\"Entregado\",CONSOLIDADO!S42)))","v":""},"",{"$f":"IF(AK42=\"Entregado\",\"\",IF(OR(X42=\"24hrs\",X42=\"48hrs\"),\"\",IF(X42=\"72hrs\",\"Entregado\",CONSOLIDADO!S42)))","v":""},"",{"$f":"IF(AK42=\"Entregado\",\"\",IF(OR(X42=\"24hrs\",X42=\"48hrs\",X42=\"72hrs\"),\"\",IF(X42=\"+72hrs\",\"Entregado\",CONSOLIDADO!S42)))","v":""},45805,"Entregado",1,1,0,0,0,0,0,"A Tiempo",1,0,0,0,{"$f":"IF(V42=\"Lima\",NETWORKDAYS.INTL(D42,M42,11,'Dias Feriados'!$A$1:$A$15),IF(AND(V42=\"provincia\",X42=\"24hrs\"),1,IF(AND(V42=\"provincia\",X42=\"48hrs\"),2,NETWORKDAYS.INTL(D42,M42,11,'Dias Feriados'!$A$1:$A$15))))","v":1}]
["B001667609","May","2025-05-27","2025-05-28","G/I. 030-10132",42,"ANA LISSETH SARAVIA MUNANTE","AV FATIMA COST DE LA VIA SAN VICENTE","Provincia","CHINCHA","SUNAMPE","B001667609",null,"En Ruta",9730017285,"F",202508,203201,"En Ruta","Dia 1","CARMEL","PROVINCIA",{"$f":"NETWORKDAYS.INTL(D43,M43,11,'Dias Feriados'!$A$1:$A$15)","v":-39255},"En Ruta",22,"NO",null,0.9375,0.94722222222222219,1,"MAGALLANES","2025-05-28",null,null,45804,"",{"$f":"IF(AS43=\"Devuelto\",\"\",IF(X43=\"24hrs\",\"Entregado\",CONSOLIDADO!S43))","v":"En Ruta"},"",{"$f":"IF(AK43=\"Entregado\",\"\",IF(X43=\"24hrs\",\"\",IF(X43=\"48hrs\",\"Entregado\",CONSOLIDADO!S43)))","v":"En Ruta"},"",{"$f":"IF(AK43=\"Entregado\",\"\",IF(OR(X43=\"24hrs\",X43=\"48hrs\"),\"\",IF(X43=\"72hrs\",\"Entregado\",CONSOLIDADO!S43)))","v":"En Ruta"},"",{"$f":"IF(AK43=\"Entregado\",\"\",IF(OR(X43=\"24hrs\",X43=\"48hrs\",X43=\"72hrs\"),\"\",IF(X43=\"+72hrs\",\"Entregado\",CONSOLIDADO!S43)))","v":"En Ruta"},"","En Ruta",1,0,0,0,0,1,0,"No Entregado",0,0,1,0,{"$f":"IF(V43=\"Lima\",NETWORKDAYS.INTL(D43,M43,11,'Dias Feriados'!$A$1:$A$15),IF(AND(V43=\"provincia\",X43=\"24hrs\"),1,IF(AND(V43=\"provincia\",X43=\"48hrs\"),2,NETWORKDAYS.INTL(D43,M43,11,'Dias Feriados'!$A$1:$A$15))))","v":-39255}]
["B001667431","May","2025-05-27","2025-05-28","G/I. 030-10132",43,"MARIA JULIA LEVANO DEALMEYDA","AV SAN IDELFONSO N 340 PASANDO MAESTROS CHINCHAS","Provincia","CHINCHA","SUNAMPE","B001667431","2025-05-28","Entregado",9730017332,"F",202508,203201,"Entregado","Dia 1","CARMEL","PROVINCIA",{"$f":"NETWORKDAYS.INTL(D44,M44,11,'Dias Feriados'!$A$1:$A$15)","v":1},"24hrs",22,"NO",null,0.9375,0.94722222222222219,1,"MAGALLANES","2025-05-28",null,null,45804,45805,{"$f":"IF(AS44=\"Devuelto\",\"\",IF(X44=\"24hrs\",\"Entregado\",CONSOLIDADO!S44))","v":"Entregado"},"",{"$f":"IF(AK44=\"Entregado\",\"\",IF(X44=\"24hrs\",\"\",IF(X44=\"48hrs\",\"Entregado\",CONSOLIDADO!S44)))","v":""},"",{"$f":"IF(AK44=\"Entregado\",\"\",IF(OR(X44=\"24hrs\",X44=\"48hrs\"),\"\",IF(X44=\"72hrs\",\"Entregado\",CONSOLIDADO!S44)))","v":""},"",{"$f":"IF(AK44=\"Entregado\",\"\",IF(OR(X44=\"24hrs\",X44=\"48hrs\",X44=\"72hrs\"),\"\",IF(X44=\"+72hrs\",\"Entregado\",CONSOLIDADO!S44)))","v":""},45805,"Entregado",1,1,0,0,0,0,0,"A Tiempo",1,0,0,0,{"$f":"IF(V44=\"Lima\",NETWORKDAYS.INTL(D44,M44,11,'Dias Feriados'!$A$1:$A$15),IF(AND(V44=\"provincia\",X44=\"24hrs\"),1,IF(AND(V44=\"provincia\",X44=\"48hrs\"),2,NETWORKDAYS.INTL(D44,M44,11,'Dias Feriados'!$A$1:$A$15))))","v":1}]
["B001667409","May","2025-05-27","2025-05-28","G/I. 030-10132",44,"JESSICA MONTOYA CARDENAS","AV PRINCIPAL HUACA GRANDE 11 ANTES DE CASA CLUB","Provincia","CHINCHA","SUNAMPE","B001667409","2025-05-28","Entregado",9730017340,"F",202508,203201,"Entregado","Dia 1","CARMEL","PROVINCIA",{"$f":"NETWORKDAYS.INTL(D45,M45,11,'Dias Feriados'!$A$1:$A$15)","v":1},"24hrs",22,"NO",null,0.9375,0.94722222222222219,1,"MAGALLANES","2025-05-28",null,null,45804,45805,{"$f":"IF(AS45=\"Devuelto\",\"\",IF(X45=\"24hrs\",\"Entregado\",CONSOLIDADO!S45))","v":"Entregado"},"",{"$f":"IF(AK45=\"Entregado\",\"\",IF(X45=\"24hrs\",\"\",IF(X45=\"48hrs\",\"Entregado\",CONSOLIDADO!S45)))","v":""},"",{"$f":"IF(AK45=\"Entregado\",\"\",IF(OR(X45=\"24hrs\",X45=\"48hrs\"),\"\",IF(X45=\"72hrs\",\"Entregado\",CONSOLIDADO!S45)))","v":""},"",{"$f":"IF(AK45=\"Entregado\",\"\",IF(OR(X45=\"24hrs\",X45=\"48hrs\",X45=\"72hrs\"),\"\",IF(X45=\"+72hrs\",\"Entregado\",CONSOLIDADO!S45)))","v":""},45805,"Entregado",1,1,0,0,0,0,0,"A Tiempo",1,0,0,0,{"$f":"IF(V45=\"Lima\",NETWORKDAYS.INTL(D45,M45,11,'Dias Feriados'!$A$1:$A$15),IF(AND(V45=\"provincia\",X45=\"24hrs\"),1,IF(AND(V45=\"provincia\",X45=\"48hrs\"),2,NETWORKDAYS.INTL(D45,M45,11,'Dias Feriados'!$A$1:$A$15))))","v":1}]
["B001668149","May","2025-05-27","2025-05-28","G/I. 030-10132",45,"CARMEN ESTEFANI ATUNCAR HUALLA","AV SAN IGNACIO INTERIOR 1 141 POR LA PLAZA DE ARMAS","Provincia","CHINCHA","SUNAMPE","B001668149","2025-05-28","Entregado",9730017391,"F",202508,203201,"Entregado","Dia 1","CARMEL","PROVINCIA",{"$f":"NETWORKDAYS.INTL(D46,M46,11,'Dias Feriados'!$A$1:$A$15)","v":1},"24hrs",22,"NO",null,0.9375,0.94722222222222219,1,"MAGALLANES","2025-05-28",null,null,45804,45805,{"$f":"IF(AS46=\"Devuelto\",\"\",IF(X46=\"24hrs\",\"Entregado\",CONSOLIDADO!S46))","v":"Entregado"},"",{"$f":"IF(AK46=\"Entregado\",\"\",IF(X46=\"24hrs\",\"\",IF(X46=\"48hrs\",\"Entregado\",CONSOLIDADO!S46)))","v":""},"",{"$f":"IF(AK46=\"Entregado\",\"\",IF(OR(X46=\"24hrs\",X46=\"48hrs\"),\"\",IF(X46=\"72hrs\",\"Entregado\",CONSOLIDADO!S46)))","v":""},"",{"$f":"IF(AK46=\"Entregado\",\"\",IF(OR(X46=\"24hrs\",X46=\"48hrs\",X46=\"72hrs\"),\"\",IF(X46=\"+72hrs\",\"Entregado\",CONSOLIDADO!S46)))","v":""},45805,"Entregado",1,1,0,0,0,0,0,"A Tiempo",1,0,0,0,{"$f":"IF(V46=\"Lima\",NETWORKDAYS.INTL(D46,M46,11,'Dias Feriados'!$A$1:$A$15),IF(AND(V46=\"provincia\",X46=\"24hrs\"),1,IF(AND(V46=\"provincia\",X46=\"48hrs\"),2,NETWORKDAYS.INTL(D46,M46,11,'Dias Feriados'!$A$1:$A$15))))","v":1}]
["B001667604","May","2025-05-27","2025-05-28","G/I. 030-10132",46,"FREDESVINDA VICTORIA CASIANO R","JR SAN MARTIN 126 A 5 ESQUINAS","Provincia","CHINCHA","SUNAMPE","B001667604","2025-05-28","Entregado",9730017545,"F",202508,203201,"Entregado","Dia 1","CARMEL","PROVINCIA",{"$f":"NETWORKDAYS.INTL(D47,M47,11,'Dias Feriados'!$A$1:$A$15)","v":1},"24hrs",22,"NO",null,0.9375,0.94722222222222219,1,"CRUCES CHO","2025-05-28",null,null,45804,45805,{"$f":"IF(AS47=\"Devuelto\",\"\",IF(X47=\"24hrs\",\"Entregado\",CONSOLIDADO!S47))","v":"Entregado"},"",{"$f":"IF(AK47=\"Entregado\",\"\",IF(X47=\"24hrs\",\"\",IF(X47=\"48hrs\",\"Entregado\",CONSOLIDADO!S47)))","v":""},"",{"$f":"IF(AK47=\"Entregado\",\"\",IF(OR(X47=\"24hrs\",X47=\"48hrs\"),\"\",IF(X47=\"72hrs\",\"Entregado\",CONSOLIDADO!S47)))","v":""},"",{"$f":"IF(AK47=\"Entregado\",\"\",IF(OR(X47=\"24hrs\",X47=\"48hrs\",X47=\"72hrs\"),\"\",IF(X47=\"+72hrs\",\"Entregado\",CONSOLIDADO!S47)))","v":""},45805,"Entregado",1,1,0,0,0,0,0,"A Tiempo",1,0,0,0,{"$f":"IF(V47=\"Lima\",NETWORKDAYS.INTL(D47,M47,11,'Dias Feriados'!$A$1:$A$15),IF(AND(V47=\"provincia\",X47=\"24hrs\"),1,IF(AND(V47=\"provincia\",X47=\"48hrs\"),2,NETWORKDAYS.INTL(D47,M47,11,'Dias Feriados'!$A$1:$A$15))))","v":1}]
["B001667613","May","2025-05-27","2025-05-28","G/I. 030-10132",47,"YANIRA ALEXANDRA CHACALTANA PA","URB SAN JOAQUIN O2 III ETAPA ESPALDAS DEL COL OLINDA","Provincia","ICA","ICA","B001667613",null,"En Ruta",9730017008,"F",202508,203201,"En Ruta","Dia 1","CARMEL","PROVINCIA",{"$f":"NETWORKDAYS.INTL(D48,M48,11,'Dias Feriados'!$A$1:$A$15)","v":-39255},"En Ruta",22,"NO",null,0.9375,0.94722222222222219,1,"CRUCES CHO","2025-05-28",null,null,45804,"",{"$f":"IF(AS48=\"Devuelto\",\"\",IF(X48=\"24hrs\",\"Entregado\",CONSOLIDADO!S48))","v":"En Ruta"},"",{"$f":"IF(AK48=\"Entregado\",\"\",IF(X48=\"24hrs\",\"\",IF(X48=\"48hrs\",\"Entregado\",CONSOLIDADO!S48)))","v":"En Ruta"},"",{"$f":"IF(AK48=\"Entregado\",\"\",IF(OR(X48=\"24hrs\",X48=\"48hrs\"),\"\",IF(X48=\"72hrs\",\"Entregado\",CONSOLIDADO!S48)))","v":"En Ruta"},"",{"$f":"IF(AK48=\"Entregado\",\"\",IF(OR(X48=\"24hrs\",X48=\"48hrs\",X48=\"72hrs\"),\"\",IF(X48=\"+72hrs\",\"Entregado\",CONSOLIDADO!S48)))","v":"En Ruta"},"","En Ruta",1,0,0,0,0,1,0,"No Entregado",0,0,1,0,{"$f":"IF(V48=\"Lima\",NETWORKDAYS.INTL(D48,M48,11,'Dias Feriados'!$A$1:$A$15),IF(AND(V48=\"provincia\",X48=\"24hrs\"),1,IF(AND(V48=\"provincia\",X48=\"48hrs\"),2,NETWORKDAYS.INTL(D48,M48,11,'Dias Feriados'!$A$1:$A$15))))","v":-39255}]
["B001667615","May","2025-05-27","2025-05-28","G/I. 030-10132",48,"ROSA ESPERANZA MOLINA GUERRA","URB SAN JOAQUN A 7 1ERET PRIMERA LOZA","Provincia","ICA","ICA","B001667615",null,"En Ruta",9730017030,"F",202508,203201,"En Ruta","Dia 1","CARMEL","PROVINCIA",{"$f":"NETWORKDAYS.INTL(D49,M49,11,'Dias Feriados'!$A$1:$A$15)","v":-39255},"En Ruta",22,"NO",null,0.9375,0.94722222222222219,1,"CRUCES CHO","2025-05-28",null,null,45804,"",{"$f":"IF(AS49=\"Devuelto\",\"\",IF(X49=\"24hrs\",\"Entregado\",CONSOLIDADO!S49))","v":"En Ruta"},"",{"$f":"IF(AK49=\"Entregado\",\"\",IF(X49=\"24hrs\",\"\",IF(X49=\"48hrs\",\"Entregado\",CONSOLIDADO!S49)))","v":"En Ruta"},"",{"$f":"IF(AK49=\"Entregado\",\"\",IF(OR(X49=\"24hrs\",X49=\"48hrs\"),\"\",IF(X49=\"72hrs\",\"Entregado\",CONSOLIDADO!S49)))","v":"En Ruta"},"",{"$f":"IF(AK49=\"Entregado\",\"\",IF(OR(X49=\"24hrs\",X49=\"48hrs\",X49=\"72hrs\"),\"\",IF(X49=\"+72hrs\",\"Entregado\",CONSOLIDADO!S49)))","v":"En Ruta"},"","En Ruta",1,0,0,0,0,1,0,"No Entregado",0,0,1,0,{"$f":"IF(V49=\"Lima\",NETWORKDAYS.INTL(D49,M49,11,'Dias Feriados'!$A$1:$A$15),IF(AND(V49=\"provincia\",X49=\"24hrs\"),1,IF(AND(V49=\"provincia\",X49=\"48hrs\"),2,NETWORKDAYS.INTL(D49,M49,11,'Dias Feriados'!$A$1:$A$15))))","v":-39255}]
["B001667483","May","2025-05-27","2025-05-28","G/I. 030-10132",49,"MERY ESTEFANY GARAVITO YAURICA","AYACUCHO 129 POR EL BANCO INTERBANK GALERIA ICATOP PLAZA STAND 07","Provincia","ICA","ICA","B001667483",null,"En Ruta",9730017037,"F",202508,203201,"En Ruta","Dia 1","CARMEL","PROVINCIA",{"$f":"NETWORKDAYS.INTL(D50,M50,11,'Dias Feriados'!$A$1:$A$15)","v":-39255},"En Ruta",22,"NO",null,0.9375,0.94722222222222219,1,"CRUCES CHO","2025-05-28",null,null,45804,"",{"$f":"IF(AS50=\"Devuelto\",\"\",IF(X50=\"24hrs\",\"Entregado\",CONSOLIDADO!S50))","v":"En Ruta"},"",{"$f":"IF(AK50=\"Entregado\",\"\",IF(X50=\"24hrs\",\"\",IF(X50=\"48hrs\",\"Entregado\",CONSOLIDADO!S50)))","v":"En Ruta"},"",{"$f":"IF(AK50=\"Entregado\",\"\",IF(OR(X50=\"24hrs\",X50=\"48hrs\"),\"\",IF(X50=\"72hrs\",\"Entregado\",CONSOLIDADO!S50)))","v":"En Ruta"},"",{"$f":"IF(AK50=\"Entregado\",\"\",IF(OR(X50=\"24hrs\",X50=\"48hrs\",X50=\"72hrs\"),\"\",IF(X50=\"+72hrs\",\"Entregado\",CONSOLIDADO!S50)))","v":"En Ruta"},"","En Ruta",1,0,0,0,0,1,0,"No Entregado",0,0,1,0,{"$f":"IF(V50=\"Lima\",NETWORKDAYS.INTL(D50,M50,11,'Dias Feriados'!$A$1:$A$15),IF(AND(V50=\"provincia\",X50=\"24hrs\"),1,IF(AND(V50=\"provincia\",X50=\"48hrs\"),2,NETWORKDAYS.INTL(D50,M50,11,'Dias Feriados'!$A$1:$A$15))))","v":-39255}]
["B001667694","May","2025-05-27","2025-05-28","G/I. 030-10132",50,"MARIA LUISA URIBE BALBIN","URBANIZACION EL CARMEN D 3 ANTIGUA PANAMERICANA","Provincia","ICA","ICA","B001667694",null,"En Ruta",9730017039,"F",202508,203201,"En Ruta","Dia 1","CARMEL","PROVINCIA",{"$f":"NETWORKDAYS.INTL(D51,M51,11,'Dias Feriados'!$A$1:$A$15)","v":-39255},"En Ruta",22,"NO",null,0.9375,0.94722222222222219,1,"CRUCES CHO","2025-05-28",null,null,45804,"",{"$f":"IF(AS51=\"Devuelto\",\"\",IF(X51=\"24hrs\",\"Entregado\",CONSOLIDADO!S51))","v":"En Ruta"},"",{"$f":"IF(AK51=\"Entregado\",\"\",IF(X51=\"24hrs\",\"\",IF(X51=\"48hrs\",\"Entregado\",CONSOLIDADO!S51)))","v":"En Ruta"},"",{"$f":"IF(AK51=\"Entregado\",\"\",IF(OR(X51=\"24hrs\",X51=\"48hrs\"),\"\",IF(X51=\"72hrs\",\"Entregado\",CONSOLIDADO!S51)))","v":"En Ruta"},"",{"$f":"IF(AK51=\"Entregado\",\"\",IF(OR(X51=\"24hrs\",X51=\"48hrs\",X51=\"72hrs\"),\"\",IF(X51=\"+72hrs\",\"Entregado\",CONSOLIDADO!S51)))","v":"En Ruta"},"","En Ruta",1,0,0,0,0,1,0,"No Entregado",0,0,1,0,{"$f":"IF(V51=\"Lima\",NETWORKDAYS.INTL(D51,M51,11,'Dias Feriados'!$A$1:$A$15),IF(AND(V51=\"provincia\",X51=\"24hrs\"),1,IF(AND(V51=\"provincia\",X51=\"48hrs\"),2,NETWORKDAYS.INTL(D51,M51,11,'Dias Feriados'!$A$1:$A$15))))","v":-39255}]
["B001667511","May","2025-05-27","2025-05-28","G/I. 030-10132",51,"GIOVANNA JENIFFER ESPINOZA ECO","RESIDENCIAL SAN CARLOS MZ O LOTE 39 PRIMER PARQUE FRENTE TELEFONO PUBLICO","Provincia","ICA","ICA","B001667511",null,"En Ruta",9730017040,"F",202508,203201,"En Ruta","Dia 1","CARMEL","PROVINCIA",{"$f":"NETWORKDAYS.INTL(D52,M52,11,'Dias Feriados'!$A$1:$A$15)","v":-39255},"En Ruta",22,"NO",null,0.9375,0.94722222222222219,1,"CRUCES CHO","2025-05-28",null,null,45804,"",{"$f":"IF(AS52=\"Devuelto\",\"\",IF(X52=\"24hrs\",\"Entregado\",CONSOLIDADO!S52))","v":"En Ruta"},"",{"$f":"IF(AK52=\"Entregado\",\"\",IF(X52=\"24hrs\",\"\",IF(X52=\"48hrs\",\"Entregado\",CONSOLIDADO!S52)))","v":"En Ruta"},"",{"$f":"IF(AK52=\"Entregado\",\"\",IF(OR(X52=\"24hrs\",X52=\"48hrs\"),\"\",IF(X52=\"72hrs\",\"Entregado\",CONSOLIDADO!S52)))","v":"En Ruta"},"",{"$f":"IF(AK52=\"Entregado\",\"\",IF(OR(X52=\"24hrs\",X52=\"48hrs\",X52=\"72hrs\"),\"\",IF(X52=\"+72hrs\",\"Entregado\",CONSOLIDADO!S52)))","v":"En Ruta"},"","En Ruta",1,0,0,0,0,1,0,"No Entregado",0,0,1,0,{"$f":"IF(V52=\"Lima\",NETWORKDAYS.INTL(D52,M52,11,'Dias Feriados'!$A$1:$A$15),IF(AND(V52=\"provincia\",X52=\"24hrs\"),1,IF(AND(V52=\"provincia\",X52=\"48hrs\"),2,NETWORKDAYS.INTL(D52,M52,11,'Dias Feriados'!$A$1:$A$15))))","v":-39255}]
["B001667676","May","2025-05-27","2025-05-28","G/I. 030-10132",52,"ANA MARIA GUTIERREZ GUTIERREZ","URB LOS VINEDOS DE STA MARIA F17 MERCADO ARENALES","Provincia","ICA","ICA","B001667676",null,"En Ruta",9730017062,"F",202508,203201,"En Ruta","Dia 1","CARMEL","PROVINCIA",{"$f":"NETWORKDAYS.INTL(D53,M53,11,'Dias Feriados'!$A$1:$A$15)","v":-39255},"En Ruta",22,"NO",null,0.9375,0.94722222222222219,1,"CRUCES CHO","2025-05-28",null,null,45804,"",{"$f":"IF(AS53=\"Devuelto\",\"\",IF(X53=\"24hrs\",\"Entregado\",CONSOLIDADO!S53))","v":"En Ruta"},"",{"$f":"IF(AK53=\"Entregado\",\"\",IF(X53=\"24hrs\",\"\",IF(X53=\"48hrs\",\"Entregado\",CONSOLIDADO!S53)))","v":"En Ruta"},"",{"$f":"IF(AK53=\"Entregado\",\"\",IF(OR(X53=\"24hrs\",X53=\"48hrs\"),\"\",IF(X53=\"72hrs\",\"Entregado\",CONSOLIDADO!S53)))","v":"En Ruta"},"",{"$f":"IF(AK53=\"Entregado\",\"\",IF(OR(X53=\"24hrs\",X53=\"48hrs\",X53=\"72hrs\"),\"\",IF(X53=\"+72hrs\",\"Entregado\",CONSOLIDADO!S53)))","v":"En Ruta"},"","En Ruta",1,0,0,0,0,1,0,"No Entregado",0,0,1,0,{"$f":"IF(V53=\"Lima\",NETWORKDAYS.INTL(D53,M53,11,'Dias Feriados'!$A$1:$A$15),IF(AND(V53=\"provincia\",X53=\"24hrs\"),1,IF(AND(V53=\"provincia\",X53=\"48hrs\"),2,NETWORKDAYS.INTL(D53,M53,11,'Dias Feriados'!$A$1:$A$15))))","v":-39255}]
["B001667941","May","2025-05-27","2025-05-28","G/I. 030-10132",53,"MONICA BEATRIZ ARIAS QUISPE","CL JUAN JOSE SALAS 275 URB SAN MIGUEL","Provincia","ICA","ICA","B001667941",null,"En Ruta",9730017066,"F",202508,203201,"En Ruta","Dia 1","CARMEL","PROVINCIA",{"$f":"NETWORKDAYS.INTL(D54,M54,11,'Dias Feriados'!$A$1:$A$15)","v":-39255},"En Ruta",22,"NO",null,0.9375,0.94722222222222219,1,"CRUCES CHO","2025-05-28",null,null,45804,"",{"$f":"IF(AS54=\"Devuelto\",\"\",IF(X54=\"24hrs\",\"Entregado\",CONSOLIDADO!S54))","v":"En Ruta"},"",{"$f":"IF(AK54=\"Entregado\",\"\",IF(X54=\"24hrs\",\"\",IF(X54=\"48hrs\",\"Entregado\",CONSOLIDADO!S54)))","v":"En Ruta"},"",{"$f":"IF(AK54=\"Entregado\",\"\",IF(OR(X54=\"24hrs\",X54=\"48hrs\"),\"\",IF(X54=\"72hrs\",\"Entregado\",CONSOLIDADO!S54)))","v":"En Ruta"},"",{"$f":"IF(AK54=\"Entregado\",\"\",IF(OR(X54=\"24hrs\",X54=\"48hrs\",X54=\"72hrs\"),\"\",IF(X54=\"+72hrs\",\"Entregado\",CONSOLIDADO!S54)))","v":"En Ruta"},"","En Ruta",1,0,0,0,0,1,0,"No Entregado",0,0,1,0,{"$f":"IF(V54=\"Lima\",NETWORKDAYS.INTL(D54,M54,11,'Dias Feriados'!$A$1:$A$15),IF(AND(V54=\"provincia\",X54=\"24hrs\"),1,IF(AND(V54=\"provincia\",X54=\"48hrs\"),2,NETWORKDAYS.INTL(D54,M54,11,'Dias Feriados'!$A$1:$A$15))))","v":-39255}]
["B001667365","May","2025-05-27","2025-05-28","G/I. 030-10132",54,"DIANA CLEMENTINA ZEVALLOS ESPI","SANTA MARIA MZ C LT 3 FRENTE A HOTEL SANTA MARIA URB SANTA MARIA","Provincia","ICA","ICA","B001667365",null,"En Ruta",9730017070,"F",202508,203201,"En Ruta","Dia 1","CARMEL","PROVINCIA",{"$f":"NETWORKDAYS.INTL(D55,M55,11,'Dias Feriados'!$A$1:$A$15)","v":-39255},"En Ruta",22,"NO",null,0.9375,0.94722222222222219,1,"CRUCES CHO","2025-05-28",null,null,45804,"",{"$f":"IF(AS55=\"Devuelto\",\"\",IF(X55=\"24hrs\",\"Entregado\",CONSOLIDADO!S55))","v":"En Ruta"},"",{"$f":"IF(AK55=\"Entregado\",\"\",IF(X55=\"24hrs\",\"\",IF(X55=\"48hrs\",\"Entregado\",CONSOLIDADO!S55)))","v":"En Ruta"},"",{"$f":"IF(AK55=\"Entregado\",\"\",IF(OR(X55=\"24hrs\",X55=\"48hrs\"),\"\",IF(X55=\"72hrs\",\"Entregado\",CONSOLIDADO!S55)))","v":"En Ruta"},"",{"$f":"IF(AK55=\"Entregado\",\"\",IF(OR(X55=\"24hrs\",X55=\"48hrs\",X55=\"72hrs\"),\"\",IF(X55=\"+72hrs\",\"Entregado\",CONSOLIDADO!S55)))","v":"En Ruta"},"","En Ruta",1,0,0,0,0,1,0,"No Entregado",0,0,1,0,{"$f":"IF(V55=\"Lima\",NETWORKDAYS.INTL(D55,M55,11,'Dias Feriados'!$A$1:$A$15),IF(AND(V55=\"provincia\",X55=\"24hrs\"),1,IF(AND(V55=\"provincia\",X55=\"48hrs\"),2,NETWORKDAYS.INTL(D55,M55,11,'Dias Feriados'!$A$1:$A$15))))","v":-39255}]
["B001667412","May","2025-05-27","2025-05-28","G/I. 030-10132",55,"CLAUDIA RAMOS AVELLANEDA","CALLE AYACUCHO 7MA CDRA CERCA A LA IGLECIA LOUREN","Provincia","ICA","ICA","B001667412",null,"En Ruta",9730017071,"F",202508,203201,"En Ruta","Dia 1","CARMEL","PROVINCIA",{"$f":"NETWORKDAYS.INTL(D56,M56,11,'Dias Feriados'!$A$1:$A$15)","v":-39255},"En Ruta",22,"NO",null,0.9375,0.94722222222222219,1,"CRUCES CHO","2025-05-28",null,null,45804,"",{"$f":"IF(AS56=\"Devuelto\",\"\",IF(X56=\"24hrs\",\"Entregado\",CONSOLIDADO!S56))","v":"En Ruta"},"",{"$f":"IF(AK56=\"Entregado\",\"\",IF(X56=\"24hrs\",\"\",IF(X56=\"48hrs\",\"Entregado\",CONSOLIDADO!S56)))","v":"En Ruta"},"",{"$f":"IF(AK56=\"Entregado\",\"\",IF(OR(X56=\"24hrs\",X56=\"48hrs\"),\"\",IF(X56=\"72hrs\",\"Entregado\",CONSOLIDADO!S56)))","v":"En Ruta"},"",{"$f":"IF(AK56=\"Entregado\",\"\",IF(OR(X56=\"24hrs\",X56=\"48hrs\",X56=\"72hrs\"),\"\",IF(X56=\"+72hrs\",\"Entregado\",CONSOLIDADO!S56)))","v":"En Ruta"},"","En Ruta",1,0,0,0,0,1,0,"No Entregado",0,0,1,0,{"$f":"IF(V56=\"Lima\",NETWORKDAYS.INTL(D56,M56,11,'Dias Feriados'!$A$1:$A$15),IF(AND(V56=\"provincia\",X56=\"24hrs\"),1,IF(AND(V56=\"provincia\",X56=\"48hrs\"),2,NETWORKDAYS.INTL(D56,M56,11,'Dias Feriados'!$A$1:$A$15))))","v":-39255}]
["B001667949","May","2025-05-27","2025-05-28","G/I. 030-10132",56,"MILAGROS ROSARIO RAMOS RAMOS","SANTA ROSA 189 INGRESAR X HOTEL ROMA 3ER ROMPEMUELLE SAN JOAQUIN VIEJO SANTA ROSA","Provincia","ICA","ICA","B001667949",null,"En Ruta",9730017072,"F",202508,203201,"En Ruta","Dia 1","CARMEL","PROVINCIA",{"$f":"NETWORKDAYS.INTL(D57,M57,11,'Dias Feriados'!$A$1:$A$15)","v":-39255},"En Ruta",22,"NO",null,0.9375,0.94722222222222219,1,"CRUCES CHO","2025-05-28",null,null,45804,"",{"$f":"IF(AS57=\"Devuelto\",\"\",IF(X57=\"24hrs\",\"Entregado\",CONSOLIDADO!S57))","v":"En Ruta"},"",{"$f":"IF(AK57=\"Entregado\",\"\",IF(X57=\"24hrs\",\"\",IF(X57=\"48hrs\",\"Entregado\",CONSOLIDADO!S57)))","v":"En Ruta"},"",{"$f":"IF(AK57=\"Entregado\",\"\",IF(OR(X57=\"24hrs\",X57=\"48hrs\"),\"\",IF(X57=\"72hrs\",\"Entregado\",CONSOLIDADO!S57)))","v":"En Ruta"},"",{"$f":"IF(AK57=\"Entregado\",\"\",IF(OR(X57=\"24hrs\",X57=\"48hrs\",X57=\"72hrs\"),\"\",IF(X57=\"+72hrs\",\"Entregado\",CONSOLIDADO!S57)))","v":"En Ruta"},"","En Ruta",1,0,0,0,0,1,0,"No Entregado",0,0,1,0,{"$f":"IF(V57=\"Lima\",NETWORKDAYS.INTL(D57,M57,11,'Dias Feriados'!$A$1:$A$15),IF(AND(V57=\"provincia\",X57=\"24hrs\"),1,IF(AND(V57=\"provincia\",X57=\"48hrs\"),2,NETWORKDAYS.INTL(D57,M57,11,'Dias Feriados'!$A$1:$A$15))))","v":-39255}]
["B001667631","May","2025-05-27","2025-05-28","G/I. 030-10132",57,"PEGGY ORIETA OSORIO SAN","URB LAS CAFIARIMAS F 13 ETAPA 1 ET 1 FRENTE A LA LOZA DEPORTIVA ICA","Provincia","ICA","ICA","B001667631",null,"En Ruta",9730017074,"F",202508,203201,"En Ruta","Dia 1","CARMEL","PROVINCIA",{"$f":"NETWORKDAYS.INTL(D58,M58,11,'Dias Feriados'!$A$1:$A$15)","v":-39255},"En Ruta",22,"NO",null,0.9375,0.94722222222222219,1,"CRUCES CHO","2025-05-28",null,null,45804,"",{"$f":"IF(AS58=\"Devuelto\",\"\",IF(X58=\"24hrs\",\"Entregado\",CONSOLIDADO!S58))","v":"En Ruta"},"",{"$f":"IF(AK58=\"Entregado\",\"\",IF(X58=\"24hrs\",\"\",IF(X58=\"48hrs\",\"Entregado\",CONSOLIDADO!S58)))","v":"En Ruta"},"",{"$f":"IF(AK58=\"Entregado\",\"\",IF(OR(X58=\"24hrs\",X58=\"48hrs\"),\"\",IF(X58=\"72hrs\",\"Entregado\",CONSOLIDADO!S58)))","v":"En Ruta"},"",{"$f":"IF(AK58=\"Entregado\",\"\",IF(OR(X58=\"24hrs\",X58=\"48hrs\",X58=\"72hrs\"),\"\",IF(X58=\"+72hrs\",\"Entregado\",CONSOLIDADO!S58)))","v":"En Ruta"},"","En Ruta",1,0,0,0,0,1,0,"No Entregado",0,0,1,0,{"$f":"IF(V58=\"Lima\",NETWORKDAYS.INTL(D58,M58,11,'Dias Feriados'!$A$1:$A$15),IF(AND(V58=\"provincia\",X58=\"24hrs\"),1,IF(AND(V58=\"provincia\",X58=\"48hrs\"),2,NETWORKDAYS.INTL(D58,M58,11,'Dias Feriados'!$A$1:$A$15))))","v":-39255}]
["B001668184","May","2025-05-27","2025-05-28","G/I. 030-10132",58,"JADE AIRANA BARRIOS CUTIPA","AV SAN MARTIN 245 FRENTE A OESHLE","Provincia","ICA","ICA","B001668184",null,"En Ruta",9730017079,"F",202508,203201,"En Ruta","Dia 1","CARMEL","PROVINCIA",{"$f":"NETWORKDAYS.INTL(D59,M59,11,'Dias Feriados'!$A$1:$A$15)","v":-39255},"En Ruta",22,"NO",null,0.9375,0.94722222222222219,1,"CRUCES CHO","2025-05-28",null,null,45804,"",{"$f":"IF(AS59=\"Devuelto\",\"\",IF(X59=\"24hrs\",\"Entregado\",CONSOLIDADO!S59))","v":"En Ruta"},"",{"$f":"IF(AK59=\"Entregado\",\"\",IF(X59=\"24hrs\",\"\",IF(X59=\"48hrs\",\"Entregado\",CONSOLIDADO!S59)))","v":"En Ruta"},"",{"$f":"IF(AK59=\"Entregado\",\"\",IF(OR(X59=\"24hrs\",X59=\"48hrs\"),\"\",IF(X59=\"72hrs\",\"Entregado\",CONSOLIDADO!S59)))","v":"En Ruta"},"",{"$f":"IF(AK59=\"Entregado\",\"\",IF(OR(X59=\"24hrs\",X59=\"48hrs\",X59=\"72hrs\"),\"\",IF(X59=\"+72hrs\",\"Entregado\",CONSOLIDADO!S59)))","v":"En Ruta"},"","En Ruta",1,0,0,0,0,1,0,"No Entregado",0,0,1,0,{"$f":"IF(V59=\"Lima\",NETWORKDAYS.INTL(D59,M59,11,'Dias Feriados'!$A$1:$A$15),IF(AND(V59=\"provincia\",X59=\"24hrs\"),1,IF(AND(V59=\"provincia\",X59=\"48hrs\"),2,NETWORKDAYS.INTL(D59,M59,11,'Dias Feriados'!$A$1:$A$15))))","v":-39255}]
["B001667785","May","2025-05-27","2025-05-28","G/I. 030-10132",59,"ROSARIO DOMITILA KUQUIAN ANICA","LA PALMA J4 CASI AL FINAL DEL COLEGIO TORIBIO POLO URBANIZACION","Provincia","ICA","ICA","B001667785",null,"En Ruta",9730017082,"F",202508,203201,"En Ruta","Dia 1","CARMEL","PROVINCIA",{"$f":"NETWORKDAYS.INTL(D60,M60,11,'Dias Feriados'!$A$1:$A$15)","v":-39255},"En Ruta",22,"NO",null,0.9375,0.94722222222222219,1,"CRUCES CHO","2025-05-28",null,null,45804,"",{"$f":"IF(AS60=\"Devuelto\",\"\",IF(X60=\"24hrs\",\"Entregado\",CONSOLIDADO!S60))","v":"En Ruta"},"",{"$f":"IF(AK60=\"Entregado\",\"\",IF(X60=\"24hrs\",\"\",IF(X60=\"48hrs\",\"Entregado\",CONSOLIDADO!S60)))","v":"En Ruta"},"",{"$f":"IF(AK60=\"Entregado\",\"\",IF(OR(X60=\"24hrs\",X60=\"48hrs\"),\"\",IF(X60=\"72hrs\",\"Entregado\",CONSOLIDADO!S60)))","v":"En Ruta"},"",{"$f":"IF(AK60=\"Entregado\",\"\",IF(OR(X60=\"24hrs\",X60=\"48hrs\",X60=\"72hrs\"),\"\",IF(X60=\"+72hrs\",\"Entregado\",CONSOLIDADO!S60)))","v":"En Ruta"},"","En Ruta",1,0,0,0,0,1,0,"No Entregado",0,0,1,0,{"$f":"IF(V60=\"Lima\",NETWORKDAYS.INTL(D60,M60,11,'Dias Feriados'!$A$1:$A$15),IF(AND(V60=\"provincia\",X60=\"24hrs\"),1,IF(AND(V60=\"provincia\",X60=\"48hrs\"),2,NETWORKDAYS.INTL(D60,M60,11,'Dias Feriados'!$A$1:$A$15))))","v":-39255}]
["B001667347","May","2025-05-27","2025-05-28","G/I. 030-10132",60,"DENNIS ROXANA MUNARRIZ PALOMIN","RINCONADA DE HUACACHINA E 15 3 ETAPA COSTADO COLEGIO SANTISIMO JESUS","Provincia","ICA","ICA","B001667347",null,"En Ruta",9730017083,"F",202508,203201,"En Ruta","Dia 1","CARMEL","PROVINCIA",{"$f":"NETWORKDAYS.INTL(D61,M61,11,'Dias Feriados'!$A$1:$A$15)","v":-39255},"En Ruta",22,"NO",null,0.9375,0.94722222222222219,1,"CRUCES CHO","2025-05-28",null,null,45804,"",{"$f":"IF(AS61=\"Devuelto\",\"\",IF(X61=\"24hrs\",\"Entregado\",CONSOLIDADO!S61))","v":"En Ruta"},"",{"$f":"IF(AK61=\"Entregado\",\"\",IF(X61=\"24hrs\",\"\",IF(X61=\"48hrs\",\"Entregado\",CONSOLIDADO!S61)))","v":"En Ruta"},"",{"$f":"IF(AK61=\"Entregado\",\"\",IF(OR(X61=\"24hrs\",X61=\"48hrs\"),\"\",IF(X61=\"72hrs\",\"Entregado\",CONSOLIDADO!S61)))","v":"En Ruta"},"",{"$f":"IF(AK61=\"Entregado\",\"\",IF(OR(X61=\"24hrs\",X61=\"48hrs\",X61=\"72hrs\"),\"\",IF(X61=\"+72hrs\",\"Entregado\",CONSOLIDADO!S61)))","v":"En Ruta"},"","En Ruta",1,0,0,0,0,1,0,"No Entregado",0,0,1,0,{"$f":"IF(V61=\"Lima\",NETWORKDAYS.INTL(D61,M61,11,'Dias Feriados'!$A$1:$A$15),IF(AND(V61=\"provincia\",X61=\"24hrs\"),1,IF(AND(V61=\"provincia\",X61=\"48hrs\"),2,NETWORKDAYS.INTL(D61,M61,11,'Dias Feriados'!$A$1:$A$15))))","v":-39255}]
["B001667539","May","2025-05-27","2025-05-28","G/I. 030-10132",61,"JESSEN ELIZABETH ROSAS VIZARRE","URB SANTO DOMINGO DE GUZMAN K 31 CASA VERDE DE 1 PISO EN EL PARQUE","Provincia","ICA","ICA","B001667539",null,"En Ruta",9730017084,"F",202508,203201,"En Ruta","Dia 1","CARMEL","PROVINCIA",{"$f":"NETWORKDAYS.INTL(D62,M62,11,'Dias Feriados'!$A$1:$A$15)","v":-39255},"En Ruta",22,"NO",null,0.9375,0.94722222222222219,1,"CRUCES CHO","2025-05-28",null,null,45804,"",{"$f":"IF(AS62=\"Devuelto\",\"\",IF(X62=\"24hrs\",\"Entregado\",CONSOLIDADO!S62))","v":"En Ruta"},"",{"$f":"IF(AK62=\"Entregado\",\"\",IF(X62=\"24hrs\",\"\",IF(X62=\"48hrs\",\"Entregado\",CONSOLIDADO!S62)))","v":"En Ruta"},"",{"$f":"IF(AK62=\"Entregado\",\"\",IF(OR(X62=\"24hrs\",X62=\"48hrs\"),\"\",IF(X62=\"72hrs\",\"Entregado\",CONSOLIDADO!S62)))","v":"En Ruta"},"",{"$f":"IF(AK62=\"Entregado\",\"\",IF(OR(X62=\"24hrs\",X62=\"48hrs\",X62=\"72hrs\"),\"\",IF(X62=\"+72hrs\",\"Entregado\",CONSOLIDADO!S62)))","v":"En Ruta"},"","En Ruta",1,0,0,0,0,1,0,"No Entregado",0,0,1,0,{"$f":"IF(V62=\"Lima\",NETWORKDAYS.INTL(D62,M62,11,'Dias Feriados'!$A$1:$A$15),IF(AND(V62=\"provincia\",X62=\"24hrs\"),1,IF(AND(V62=\"provincia\",X62=\"48hrs\"),2,NETWORKDAYS.INTL(D62,M62,11,'Dias Feriados'!$A$1:$A$15))))","v":-39255}]
["B001667769","May","2025-05-27","2025-05-28","G/I. 030-10132",62,"MARTHA MARLENI HUANCAHUARI CAS","URB PALAZUELOS MZ N F LT 15 A UNA ESQUINA D E UNA FERRETERIA","Provincia","ICA","ICA","B001667769",null,"En Ruta",9730017087,"F",202508,203201,"En Ruta","Dia 1","CARMEL","PROVINCIA",{"$f":"NETWORKDAYS.INTL(D63,M63,11,'Dias Feriados'!$A$1:$A$15)","v":-39255},"En Ruta",22,"NO",null,0.9375,0.94722222222222219,1,"CRUCES CHO","2025-05-28",null,null,45804,"",{"$f":"IF(AS63=\"Devuelto\",\"\",IF(X63=\"24hrs\",\"Entregado\",CONSOLIDADO!S63))","v":"En Ruta"},"",{"$f":"IF(AK63=\"Entregado\",\"\",IF(X63=\"24hrs\",\"\",IF(X63=\"48hrs\",\"Entregado\",CONSOLIDADO!S63)))","v":"En Ruta"},"",{"$f":"IF(AK63=\"Entregado\",\"\",IF(OR(X63=\"24hrs\",X63=\"48hrs\"),\"\",IF(X63=\"72hrs\",\"Entregado\",CONSOLIDADO!S63)))","v":"En Ruta"},"",{"$f":"IF(AK63=\"Entregado\",\"\",IF(OR(X63=\"24hrs\",X63=\"48hrs\",X63=\"72hrs\"),\"\",IF(X63=\"+72hrs\",\"Entregado\",CONSOLIDADO!S63)))","v":"En Ruta"},"","En Ruta",1,0,0,0,0,1,0,"No Entregado",0,0,1,0,{"$f":"IF(V63=\"Lima\",NETWORKDAYS.INTL(D63,M63,11,'Dias Feriados'!$A$1:$A$15),IF(AND(V63=\"provincia\",X63=\"24hrs\"),1,IF(AND(V63=\"provincia\",X63=\"48hrs\"),2,NETWORKDAYS.INTL(D63,M63,11,'Dias Feriados'!$A$1:$A$15))))","v":-39255}]
["B001667730","May","2025-05-27","2025-05-28","G/I. 030-10132",63,"JUANA RUTH ACUNA GRADOS","MARCONA D 04 URB STO DOMINGO","Provincia","ICA","ICA","B001667730",null,"En Ruta",9730017094,"F",202508,203201,"En Ruta","Dia 1","CARMEL","PROVINCIA",{"$f":"NETWORKDAYS.INTL(D64,M64,11,'Dias Feriados'!$A$1:$A$15)","v":-39255},"En Ruta",22,"NO",null,0.9375,0.94722222222222219,1,"CRUCES CHO","2025-05-28",null,null,45804,"",{"$f":"IF(AS64=\"Devuelto\",\"\",IF(X64=\"24hrs\",\"Entregado\",CONSOLIDADO!S64))","v":"En Ruta"},"",{"$f":"IF(AK64=\"Entregado\",\"\",IF(X64=\"24hrs\",\"\",IF(X64=\"48hrs\",\"Entregado\",CONSOLIDADO!S64)))","v":"En Ruta"},"",{"$f":"IF(AK64=\"Entregado\",\"\",IF(OR(X64=\"24hrs\",X64=\"48hrs\"),\"\",IF(X64=\"72hrs\",\"Entregado\",CONSOLIDADO!S64)))","v":"En Ruta"},"",{"$f":"IF(AK64=\"Entregado\",\"\",IF(OR(X64=\"24hrs\",X64=\"48hrs\",X64=\"72hrs\"),\"\",IF(X64=\"+72hrs\",\"Entregado\",CONSOLIDADO!S64)))","v":"En Ruta"},"","En Ruta",1,0,0,0,0,1,0,"No Entregado",0,0,1,0,{"$f":"IF(V64=\"Lima\",NETWORKDAYS.INTL(D64,M64,11,'Dias Feriados'!$A$1:$A$15),IF(AND(V64=\"provincia\",X64=\"24hrs\"),1,IF(AND(V64=\"provincia\",X64=\"48hrs\"),2,NETWORKDAYS.INTL(D64,M64,11,'Dias Feriados'!$A$1:$A$15))))","v":-39255}]
["B001667711",{"$f":"TEXT(C65,\"mmm\")","v":"May"},"2025-05-27","2025-05-28","G/I. 030-10132",64,"CARMEN ROSA CENTURION CHAVEZ","LAS DUNAS MZ E LT 05 CERCA AL GRIFO URB SAN JOAQUIN","Provincia","ICA","ICA","B001667711",null,"En Ruta",9730017099,"F",202508,203201,"En Ruta","Dia 1","CARMEL","PROVINCIA",{"$f":"NETWORKDAYS.INTL(D65,M65,11,'Dias Feriados'!$A$1:$A$15)","v":-39255},"En Ruta",22,"NO",null,0.9375,0.94722222222222219,1,"CRUCES CHO",{"$f":"DATEVALUE(D65)","v":"2025-05-28"},null,null,{"$f":"C65","v":45804},{"$f":"IF(AK65=\"Entregado\",M65,\"\")","v":""},{"$f":"IF(AS65=\"Devuelto\",\"\",IF(X65=\"24hrs\",\"Entregado\",CONSOLIDADO!S65))","v":"En Ruta"},{"$f":"IF(AM65=\"Entregado\",M65,\"\")","v":""},{"$f":"IF(AK65=\"Entregado\",\"\",IF(X65=\"24hrs\",\"\",IF(X65=\"48hrs\",\"Entregado\",CONSOLIDADO!S65)))","v":"En Ruta"},{"$f":"IF(AO65=\"Entregado\",M65,\"\")","v":""},{"$f":"IF(AK65=\"Entregado\",\"\",IF(OR(X65=\"24hrs\",X65=\"48hrs\"),\"\",IF(X65=\"72hrs\",\"Entregado\",CONSOLIDADO!S65)))","v":"En Ruta"},{"$f":"IF(AQ65=\"Entregado\",M65,\"\")","v":""},{"$f":"IF(AK65=\"Entregado\",\"\",IF(OR(X65=\"24hrs\",X65=\"48hrs\",X65=\"72hrs\"),\"\",IF(X65=\"+72hrs\",\"Entregado\",CONSOLIDADO!S65)))","v":"En Ruta"},{"$f":"IF(M65=\"\",\"\",M65)","v":""},{"$f":"IF(AG65=\"Devuelto\",AG65,N65)","v":"En Ruta"},{"$f":"1+0","v":1},0,0,0,0,1,0,"No Entregado",0,0,1,0,{"$f":"IF(V65=\"Lima\",NETWORKDAYS.INTL(D65,M65,11,'Dias Feriados'!$A$1:$A$15),IF(AND(V65=\"provincia\",X65=\"24hrs\"),1,IF(AND(V65=\"provincia\",X65=\"48hrs\"),2,NETWORKDAYS.INTL(D65,M65,11,'Dias Feriados'!$A$1:$A$15))))","v":-39255}]
["B001667475","May","2025-05-27","2025-05-28","G/I. 030-10132",65,"CELEDONIA QUISPE MALDONADO","LA PALMA B38 A LA ESPALDA DE LA PLAZUELA ICA","Provincia","ICA","ICA","B001667475",null,"En Ruta",9730017112,"F",202508,203201,"En Ruta","Dia 1",{"$f":"IF(MID(R66,1,2)=\"10\",\"PACIFIKA\",IF(MID(R66,1,2)=\"20\",\"CARMEL\",\"EMPLEADOS\"))","v":"CARMEL"},{"$f":"IF(I66=\"LIMA\",\"LIMA\",\"PROVINCIA\")","v":"PROVINCIA"},{"$f":"NETWORKDAYS.INTL(D66,M66,11,'Dias Feriados'!$A$1:$A$15)","v":-39255},{"$f":"IF(OR(M66=\"\",M66=\"En Ruta\"),\"En Ruta\",IF(M66=\"Motivado\",\"Motivado\",IF(W66<=1,\"24hrs\",IF(W66=2,\"48hrs\",IF(W66=3,\"72hrs\",\"+72hrs\")))))","v":"En Ruta"},{"$f":"WEEKNUM(C66)","v":22},"NO",null,0.9375,0.94722222222222219,1,"CRUCES CHO","2025-05-28",null,null,45804,"",{"$f":"IF(AS66=\"Devuelto\",\"\",IF(X66=\"24hrs\",\"Entregado\",CONSOLIDADO!S66))","v":"En Ruta"},"",{"$f":"IF(AK66=\"Entregado\",\"\",IF(X66=\"24hrs\",\"\",IF(X66=\"48hrs\",\"Entregado\",CONSOLIDADO!S66)))","v":"En Ruta"},"",{"$f":"IF(AK66=\"Entregado\",\"\",IF(OR(X66=\"24hrs\",X66=\"48hrs\"),\"\",IF(X66=\"72hrs\",\"Entregado\",CONSOLIDADO!S66)))","v":"En Ruta"},"",{"$f":"IF(AK66=\"Entregado\",\"\",IF(OR(X66=\"24hrs\",X66=\"48hrs\",X66=\"72hrs\"),\"\",IF(X66=\"+72hrs\",\"Entregado\",CONSOLIDADO!S66)))","v":"En Ruta"},"","En Ruta",1,{"$f":"IF(X66=\"24hrs\",1,0)","v":0},{"$f":"IF(X66=\"48hrs\",1,0)","v":0},{"$f":"IF(X66=\"72hrs\",1,0)","v":0},{"$f":"IF(X66=\"+72hrs\",1,0)","v":0},{"$f":"IF(X66=\"En Ruta\",1,0)","v":1},{"$f":"IF(X66=\"Motivado\",1,0)","v":0},{"$f":"IF(OR(N66=\"devuelto\",N66=\"siniestro\"),\"Nulo\",IF(OR(X66=\"24hrs\",X66=\"48hrs\"),\"A Tiempo\",IF(OR(X66=\"en ruta\",X66=\"motivado\"),\"No Entregado\",\"Fuera de Tiempo\")))","v":"No Entregado"},{"$f":"IF(BA66=\"a tiempo\",1,0)","v":0},{"$f":"IF(BA66=\"fuera de tiempo\",1,0)","v":0},{"$f":"IF(BA66=\"no entregado\",1,0)","v":1},{"$f":"IF(BA66=\"nulo\",1,0)","v":0},{"$f":"IF(V66=\"Lima\",NETWORKDAYS.INTL(D66,M66,11,'Dias Feriados'!$A$1:$A$15),IF(AND(V66=\"provincia\",X66=\"24hrs\"),1,IF(AND(V66=\"provincia\",X66=\"48hrs\"),2,NETWORKDAYS.INTL(D66,M66,11,'Dias Feriados'!$A$1:$A$15))))","v":-39255}]
["B001667767","May","2025-05-27","2025-05-28","G/I. 030-10132",66,"NELBA MARIA GUILLEN QUIJANDRIA","SAN JOAQUIN E 31 1RA ET POR EL CRUCE DE SAN JUANQUIN","Provincia","ICA","ICA","B001667767",null,"En Ruta",9730017113,"F",202508,203201,"En Ruta","Dia 1","CARMEL","PROVINCIA",{"$f":"NETWORKDAYS.INTL(D67,M67,11,'Dias Feriados'!$A$1:$A$15)","v":-39255},"En Ruta",22,"NO",null,0.9375,0.94722222222222219,1,"CRUCES CHO","2025-05-28",null,null,45804,"",{"$f":"IF(AS67=\"Devuelto\",\"\",IF(X67=\"24hrs\",\"Entregado\",CONSOLIDADO!S67))","v":"En Ruta"},"",{"$f":"IF(AK67=\"Entregado\",\"\",IF(X67=\"24hrs\",\"\",IF(X67=\"48hrs\",\"Entregado\",CONSOLIDADO!S67)))","v":"En Ruta"},"",{"$f":"IF(AK67=\"Entregado\",\"\",IF(OR(X67=\"24hrs\",X67=\"48hrs\"),\"\",IF(X67=\"72hrs\",\"Entregado\",CONSOLIDADO!S67)))","v":"En Ruta"},"",{"$f":"IF(AK67=\"Entregado\",\"\",IF(OR(X67=\"24hrs\",X67=\"48hrs\",X67=\"72hrs\"),\"\",IF(X67=\"+72hrs\",\"Entregado\",CONSOLIDADO!S67)))","v":"En Ruta"},"","En Ruta",1,0,0,0,0,1,0,"No Entregado",0,0,1,0,{"$f":"IF(V67=\"Lima\",NETWORKDAYS.INTL(D67,M67,11,'Dias Feriados'!$A$1:$A$15),IF(AND(V67=\"provincia\",X67=\"24hrs\"),1,IF(AND(V67=\"provincia\",X67=\"48hrs\"),2,NETWORKDAYS.INTL(D67,M67,11,'Dias Feriados'!$A$1:$A$15))))","v":-39255}]
["B001667721","May","2025-05-27","2025-05-28","G/I. 030-10132",67,"AMELIA ROSA LLERENA HILARIO","CASERIO SAN MARTIN DE PORRAS V 13 CAMINO A SAN JUAN ANTES DE FONAVI","Provincia","ICA","ICA","B001667721",null,"En Ruta",9730017115,"F",202508,203201,"En Ruta","Dia 1","CARMEL","PROVINCIA",{"$f":"NETWORKDAYS.INTL(D68,M68,11,'Dias Feriados'!$A$1:$A$15)","v":-39255},"En Ruta",22,"NO",null,0.9375,0.94722222222222219,1,"CRUCES CHO","2025-05-28",null,null,45804,"",{"$f":"IF(AS68=\"Devuelto\",\"\",IF(X68=\"24hrs\",\"Entregado\",CONSOLIDADO!S68))","v":"En Ruta"},"",{"$f":"IF(AK68=\"Entregado\",\"\",IF(X68=\"24hrs\",\"\",IF(X68=\"48hrs\",\"Entregado\",CONSOLIDADO!S68)))","v":"En Ruta"},"",{"$f":"IF(AK68=\"Entregado\",\"\",IF(OR(X68=\"24hrs\",X68=\"48hrs\"),\"\",IF(X68=\"72hrs\",\"Entregado\",CONSOLIDADO!S68)))","v":"En Ruta"},"",{"$f":"IF(AK68=\"Entregado\",\"\",IF(OR(X68=\"24hrs\",X68=\"48hrs\",X68=\"72hrs\"),\"\",IF(X68=\"+72hrs\",\"Entregado\",CONSOLIDADO!S68)))","v":"En Ruta"},"","En Ruta",1,0,0,0,0,1,0,"No Entregado",0,0,1,0,{"$f":"IF(V68=\"Lima\",NETWORKDAYS.INTL(D68,M68,11,'Dias Feriados'!$A$1:$A$15),IF(AND(V68=\"provincia\",X68=\"24hrs\"),1,IF(AND(V68=\"provincia\",X68=\"48hrs\"),2,NETWORKDAYS.INTL(D68,M68,11,'Dias Feriados'!$A$1:$A$15))))","v":-39255}]
["B001667697","May","2025-05-27","2025-05-28","G/I. 030-10132",68,"MEY LEM DEL ROSARIO KOC CABRER","CALLE JOSE GALVEZ EGUSQUIZA 101 COSTADO POLLERIA MONCHI URBANIZACION SAN JOAQUIN ETAPA 1","Provincia","ICA","ICA","B001667697",null,"En Ruta",9730017117,"F",202508,203201,"En Ruta","Dia 1","CARMEL","PROVINCIA",{"$f":"NETWORKDAYS.INTL(D69,M69,11,'Dias Feriados'!$A$1:$A$15)","v":-39255},"En Ruta",22,"NO",null,0.9375,0.94722222222222219,1,"CRUCES CHO","2025-05-28",null,null,45804,"",{"$f":"IF(AS69=\"Devuelto\",\"\",IF(X69=\"24hrs\",\"Entregado\",CONSOLIDADO!S69))","v":"En Ruta"},"",{"$f":"IF(AK69=\"Entregado\",\"\",IF(X69=\"24hrs\",\"\",IF(X69=\"48hrs\",\"Entregado\",CONSOLIDADO!S69)))","v":"En Ruta"},"",{"$f":"IF(AK69=\"Entregado\",\"\",IF(OR(X69=\"24hrs\",X69=\"48hrs\"),\"\",IF(X69=\"72hrs\",\"Entregado\",CONSOLIDADO!S69)))","v":"En Ruta"},"",{"$f":"IF(AK69=\"Entregado\",\"\",IF(OR(X69=\"24hrs\",X69=\"48hrs\",X69=\"72hrs\"),\"\",IF(X69=\"+72hrs\",\"Entregado\",CONSOLIDADO!S69)))","v":"En Ruta"},"","En Ruta",1,0,0,0,0,1,0,"No Entregado",0,0,1,0,{"$f":"IF(V69=\"Lima\",NETWORKDAYS.INTL(D69,M69,11,'Dias Feriados'!$A$1:$A$15),IF(AND(V69=\"provincia\",X69=\"24hrs\"),1,IF(AND(V69=\"provincia\",X69=\"48hrs\"),2,NETWORKDAYS.INTL(D69,M69,11,'Dias Feriados'!$A$1:$A$15))))","v":-39255}]
["B001667478","May","2025-05-27","2025-05-28","G/I. 030-10132",69,"ANA FLAVIA GARAVITO COSSIO","EDIFICIO SANTA LUCIA DPTO 202 202 MZ C29 A MEDIA CUADRA DE ICATOM LOS FICUS DE LUREN","Provincia","ICA","ICA","B001667478",null,"En Ruta",9730017118,"F",202508,203201,"En Ruta","Dia 1","CARMEL","PROVINCIA",{"$f":"NETWORKDAYS.INTL(D70,M70,11,'Dias Feriados'!$A$1:$A$15)","v":-39255},"En Ruta",22,"NO",null,0.9375,0.94722222222222219,1,"CRUCES CHO","2025-05-28",null,null,45804,"",{"$f":"IF(AS70=\"Devuelto\",\"\",IF(X70=\"24hrs\",\"Entregado\",CONSOLIDADO!S70))","v":"En Ruta"},"",{"$f":"IF(AK70=\"Entregado\",\"\",IF(X70=\"24hrs\",\"\",IF(X70=\"48hrs\",\"Entregado\",CONSOLIDADO!S70)))","v":"En Ruta"},"",{"$f":"IF(AK70=\"Entregado\",\"\",IF(OR(X70=\"24hrs\",X70=\"48hrs\"),\"\",IF(X70=\"72hrs\",\"Entregado\",CONSOLIDADO!S70)))","v":"En Ruta"},"",{"$f":"IF(AK70=\"Entregado\",\"\",IF(OR(X70=\"24hrs\",X70=\"48hrs\",X70=\"72hrs\"),\"\",IF(X70=\"+72hrs\",\"Entregado\",CONSOLIDADO!S70)))","v":"En Ruta"},"","En Ruta",1,0,0,0,0,1,0,"No Entregado",0,0,1,0,{"$f":"IF(V70=\"Lima\",NETWORKDAYS.INTL(D70,M70,11,'Dias Feriados'!$A$1:$A$15),IF(AND(V70=\"provincia\",X70=\"24hrs\"),1,IF(AND(V70=\"provincia\",X70=\"48hrs\"),2,NETWORKDAYS.INTL(D70,M70,11,'Dias Feriados'!$A$1:$A$15))))","v":-39255}]
["B001667585","May","2025-05-27","2025-05-28","G/I. 030-10132",70,"ROSA TORIBIA CALCINA CARI","POR ALTA TENSION MZ D LT 17 ULTIMO PARADERO A 3 CDRAS TEPRO ECOLOGICO","Provincia","ICA","ICA","B001667585",null,"En Ruta",9730017120,"F",202508,203201,"En Ruta","Dia 1","CARMEL","PROVINCIA",{"$f":"NETWORKDAYS.INTL(D71,M71,11,'Dias Feriados'!$A$1:$A$15)","v":-39255},"En Ruta",22,"NO",null,0.9375,0.94722222222222219,1,"CRUCES CHO","2025-05-28",null,null,45804,"",{"$f":"IF(AS71=\"Devuelto\",\"\",IF(X71=\"24hrs\",\"Entregado\",CONSOLIDADO!S71))","v":"En Ruta"},"",{"$f":"IF(AK71=\"Entregado\",\"\",IF(X71=\"24hrs\",\"\",IF(X71=\"48hrs\",\"Entregado\",CONSOLIDADO!S71)))","v":"En Ruta"},"",{"$f":"IF(AK71=\"Entregado\",\"\",IF(OR(X71=\"24hrs\",X71=\"48hrs\"),\"\",IF(X71=\"72hrs\",\"Entregado\",CONSOLIDADO!S71)))","v":"En Ruta"},"",{"$f":"IF(AK71=\"Entregado\",\"\",IF(OR(X71=\"24hrs\",X71=\"48hrs\",X71=\"72hrs\"),\"\",IF(X71=\"+72hrs\",\"Entregado\",CONSOLIDADO!S71)))","v":"En Ruta"},"","En Ruta",1,0,0,0,0,1,0,"No Entregado",0,0,1,0,{"$f":"IF(V71=\"Lima\",NETWORKDAYS.INTL(D71,M71,11,'Dias Feriados'!$A$1:$A$15),IF(AND(V71=\"provincia\",X71=\"24hrs\"),1,IF(AND(V71=\"provincia\",X71=\"48hrs\"),2,NETWORKDAYS.INTL(D71,M71,11,'Dias Feriados'!$A$1:$A$15))))","v":-39255}]
["B001667494","May","2025-05-27","2025-05-28","G/I. 030-10132",71,"JHANNET MILAGROS VARGAS RAMOS","ALFONSO UGARTE MZ K LT 1A CASERIO SAN MARTIN DE PORRAS","Provincia","ICA","ICA","B001667494",null,"En Ruta",9730017127,"F",202508,203201,"En Ruta","Dia 1","CARMEL","PROVINCIA",{"$f":"NETWORKDAYS.INTL(D72,M72,11,'Dias Feriados'!$A$1:$A$15)","v":-39255},"En Ruta",22,"NO",null,0.9375,0.94722222222222219,1,"CRUCES CHO","2025-05-28",null,null,45804,"",{"$f":"IF(AS72=\"Devuelto\",\"\",IF(X72=\"24hrs\",\"Entregado\",CONSOLIDADO!S72))","v":"En Ruta"},"",{"$f":"IF(AK72=\"Entregado\",\"\",IF(X72=\"24hrs\",\"\",IF(X72=\"48hrs\",\"Entregado\",CONSOLIDADO!S72)))","v":"En Ruta"},"",{"$f":"IF(AK72=\"Entregado\",\"\",IF(OR(X72=\"24hrs\",X72=\"48hrs\"),\"\",IF(X72=\"72hrs\",\"Entregado\",CONSOLIDADO!S72)))","v":"En Ruta"},"",{"$f":"IF(AK72=\"Entregado\",\"\",IF(OR(X72=\"24hrs\",X72=\"48hrs\",X72=\"72hrs\"),\"\",IF(X72=\"+72hrs\",\"Entregado\",CONSOLIDADO!S72)))","v":"En Ruta"},"","En Ruta",1,0,0,0,0,1,0,"No Entregado",0,0,1,0,{"$f":"IF(V72=\"Lima\",NETWORKDAYS.INTL(D72,M72,11,'Dias Feriados'!$A$1:$A$15),IF(AND(V72=\"provincia\",X72=\"24hrs\"),1,IF(AND(V72=\"provincia\",X72=\"48hrs\"),2,NETWORKDAYS.INTL(D72,M72,11,'Dias Feriados'!$A$1:$A$15))))","v":-39255}]
["B001667339","May","2025-05-27","2025-05-28","G/I. 030-10132",72,"LUZ YANET DONAYRE QUIJAITE","CASUARINAS MZ B LT 26 BAJADA DE CASUARINAS A LA IZQUIERDA URB CASUARINAS","Provincia","ICA","ICA","B001667339",null,"En Ruta",9730017128,"F",202508,203201,"En Ruta","Dia 1","CARMEL","PROVINCIA",{"$f":"NETWORKDAYS.INTL(D73,M73,11,'Dias Feriados'!$A$1:$A$15)","v":-39255},"En Ruta",22,"NO",null,0.9375,0.94722222222222219,1,"CRUCES CHO","2025-05-28",null,null,45804,"",{"$f":"IF(AS73=\"Devuelto\",\"\",IF(X73=\"24hrs\",\"Entregado\",CONSOLIDADO!S73))","v":"En Ruta"},"",{"$f":"IF(AK73=\"Entregado\",\"\",IF(X73=\"24hrs\",\"\",IF(X73=\"48hrs\",\"Entregado\",CONSOLIDADO!S73)))","v":"En Ruta"},"",{"$f":"IF(AK73=\"Entregado\",\"\",IF(OR(X73=\"24hrs\",X73=\"48hrs\"),\"\",IF(X73=\"72hrs\",\"Entregado\",CONSOLIDADO!S73)))","v":"En Ruta"},"",{"$f":"IF(AK73=\"Entregado\",\"\",IF(OR(X73=\"24hrs\",X73=\"48hrs\",X73=\"72hrs\"),\"\",IF(X73=\"+72hrs\",\"Entregado\",CONSOLIDADO!S73)))","v":"En Ruta"},"","En Ruta",1,0,0,0,0,1,0,"No Entregado",0,0,1,0,{"$f":"IF(V73=\"Lima\",NETWORKDAYS.INTL(D73,M73,11,'Dias Feriados'!$A$1:$A$15),IF(AND(V73=\"provincia\",X73=\"24hrs\"),1,IF(AND(V73=\"provincia\",X73=\"48hrs\"),2,NETWORKDAYS.INTL(D73,M73,11,'Dias Feriados'!$A$1:$A$15))))","v":-39255}]
["B001667766","May","2025-05-27","2025-05-28","G/I. 030-10132",73,"ALONDRA CAROLINA PRADA YEREN","MIRADOR DESANTA ROSA A15 CEMENTERIO SARAJA MERCADO ARENALES","Provincia","ICA","ICA","B001667766",null,"En Ruta",9730017129,"F",202508,203201,"En Ruta","Dia 1","CARMEL","PROVINCIA",{"$f":"NETWORKDAYS.INTL(D74,M74,11,'Dias Feriados'!$A$1:$A$15)","v":-39255},"En Ruta",22,"NO",null,0.9375,0.94722222222222219,1,"CRUCES CHO","2025-05-28",null,null,45804,"",{"$f":"IF(AS74=\"Devuelto\",\"\",IF(X74=\"24hrs\",\"Entregado\",CONSOLIDADO!S74))","v":"En Ruta"},"",{"$f":"IF(AK74=\"Entregado\",\"\",IF(X74=\"24hrs\",\"\",IF(X74=\"48hrs\",\"Entregado\",CONSOLIDADO!S74)))","v":"En Ruta"},"",{"$f":"IF(AK74=\"Entregado\",\"\",IF(OR(X74=\"24hrs\",X74=\"48hrs\"),\"\",IF(X74=\"72hrs\",\"Entregado\",CONSOLIDADO!S74)))","v":"En Ruta"},"",{"$f":"IF(AK74=\"Entregado\",\"\",IF(OR(X74=\"24hrs\",X74=\"48hrs\",X74=\"72hrs\"),\"\",IF(X74=\"+72hrs\",\"Entregado\",CONSOLIDADO!S74)))","v":"En Ruta"},"","En Ruta",1,0,0,0,0,1,0,"No Entregado",0,0,1,0,{"$f":"IF(V74=\"Lima\",NETWORKDAYS.INTL(D74,M74,11,'Dias Feriados'!$A$1:$A$15),IF(AND(V74=\"provincia\",X74=\"24hrs\"),1,IF(AND(V74=\"provincia\",X74=\"48hrs\"),2,NETWORKDAYS.INTL(D74,M74,11,'Dias Feriados'!$A$1:$A$15))))","v":-39255}]
["B001667506","May","2025-05-27","2025-05-28","G/I. 030-10132",74,"OLGA JULIA GONZALES NIETO","COMATRANA LOS GRIMALDOS LT 5 SAN PABLO EL","Provincia","ICA","ICA","B001667506",null,"En Ruta",9730017130,"F",202508,203201,"En Ruta","Dia 1","CARMEL","PROVINCIA",{"$f":"NETWORKDAYS.INTL(D75,M75,11,'Dias Feriados'!$A$1:$A$15)","v":-39255},"En Ruta",22,"NO",null,0.9375,0.94722222222222219,1,"CRUCES CHO","2025-05-28",null,null,45804,"",{"$f":"IF(AS75=\"Devuelto\",\"\",IF(X75=\"24hrs\",\"Entregado\",CONSOLIDADO!S75))","v":"En Ruta"},"",{"$f":"IF(AK75=\"Entregado\",\"\",IF(X75=\"24hrs\",\"\",IF(X75=\"48hrs\",\"Entregado\",CONSOLIDADO!S75)))","v":"En Ruta"},"",{"$f":"IF(AK75=\"Entregado\",\"\",IF(OR(X75=\"24hrs\",X75=\"48hrs\"),\"\",IF(X75=\"72hrs\",\"Entregado\",CONSOLIDADO!S75)))","v":"En Ruta"},"",{"$f":"IF(AK75=\"Entregado\",\"\",IF(OR(X75=\"24hrs\",X75=\"48hrs\",X75=\"72hrs\"),\"\",IF(X75=\"+72hrs\",\"Entregado\",CONSOLIDADO!S75)))","v":"En Ruta"},"","En Ruta",1,0,0,0,0,1,0,"No Entregado",0,0,1,0,{"$f":"IF(V75=\"Lima\",NETWORKDAYS.INTL(D75,M75,11,'Dias Feriados'!$A$1:$A$15),IF(AND(V75=\"provincia\",X75=\"24hrs\"),1,IF(AND(V75=\"provincia\",X75=\"48hrs\"),2,NETWORKDAYS.INTL(D75,M75,11,'Dias Feriados'!$A$1:$A$15))))","v":-39255}]
["B001667660","May","2025-05-27","2025-05-28","G/I. 030-10132",75,"VALERIA CECILIA AGUILAR CARBAJ","AV LOS JUAREZ 121 Y22 ANTES DE LA ANTENA DE CELULAR COMATRANA","Provincia","ICA","ICA","B001667660",null,"En Ruta",9730017131,"F",202508,203201,"En Ruta","Dia 1","CARMEL","PROVINCIA",{"$f":"NETWORKDAYS.INTL(D76,M76,11,'Dias Feriados'!$A$1:$A$15)","v":-39255},"En Ruta",22,"NO",null,0.9375,0.94722222222222219,1,"CRUCES CHO","2025-05-28",null,null,45804,"",{"$f":"IF(AS76=\"Devuelto\",\"\",IF(X76=\"24hrs\",\"Entregado\",CONSOLIDADO!S76))","v":"En Ruta"},"",{"$f":"IF(AK76=\"Entregado\",\"\",IF(X76=\"24hrs\",\"\",IF(X76=\"48hrs\",\"Entregado\",CONSOLIDADO!S76)))","v":"En Ruta"},"",{"$f":"IF(AK76=\"Entregado\",\"\",IF(OR(X76=\"24hrs\",X76=\"48hrs\"),\"\",IF(X76=\"72hrs\",\"Entregado\",CONSOLIDADO!S76)))","v":"En Ruta"},"",{"$f":"IF(AK76=\"Entregado\",\"\",IF(OR(X76=\"24hrs\",X76=\"48hrs\",X76=\"72hrs\"),\"\",IF(X76=\"+72hrs\",\"Entregado\",CONSOLIDADO!S76)))","v":"En Ruta"},"","En Ruta",1,0,0,0,0,1,0,"No Entregado",0,0,1,0,{"$f":"IF(V76=\"Lima\",NETWORKDAYS.INTL(D76,M76,11,'Dias Feriados'!$A$1:$A$15),IF(AND(V76=\"provincia\",X76=\"24hrs\"),1,IF(AND(V76=\"provincia\",X76=\"48hrs\"),2,NETWORKDAYS.INTL(D76,M76,11,'Dias Feriados'!$A$1:$A$15))))","v":-39255}]
["B001668273","May","2025-05-27","2025-05-28","G/I. 030-10132",76,"SABINA MARILU GALVEZ DE YAMASH","LOS VINEDOS D 25 POR EL HOTEL PRINCESS POR EL HOTEL PRINCESS","Provincia","ICA","ICA","B001668273",null,"En Ruta",9730017136,"F",202508,203201,"En Ruta","Dia 1","CARMEL","PROVINCIA",{"$f":"NETWORKDAYS.INTL(D77,M77,11,'Dias Feriados'!$A$1:$A$15)","v":-39255},"En Ruta",22,"NO",null,0.9375,0.94722222222222219,1,"CRUCES CHO","2025-05-28",null,null,45804,"",{"$f":"IF(AS77=\"Devuelto\",\"\",IF(X77=\"24hrs\",\"Entregado\",CONSOLIDADO!S77))","v":"En Ruta"},"",{"$f":"IF(AK77=\"Entregado\",\"\",IF(X77=\"24hrs\",\"\",IF(X77=\"48hrs\",\"Entregado\",CONSOLIDADO!S77)))","v":"En Ruta"},"",{"$f":"IF(AK77=\"Entregado\",\"\",IF(OR(X77=\"24hrs\",X77=\"48hrs\"),\"\",IF(X77=\"72hrs\",\"Entregado\",CONSOLIDADO!S77)))","v":"En Ruta"},"",{"$f":"IF(AK77=\"Entregado\",\"\",IF(OR(X77=\"24hrs\",X77=\"48hrs\",X77=\"72hrs\"),\"\",IF(X77=\"+72hrs\",\"Entregado\",CONSOLIDADO!S77)))","v":"En Ruta"},"","En Ruta",1,0,0,0,0,1,0,"No Entregado",0,0,1,0,{"$f":"IF(V77=\"Lima\",NETWORKDAYS.INTL(D77,M77,11,'Dias Feriados'!$A$1:$A$15),IF(AND(V77=\"provincia\",X77=\"24hrs\"),1,IF(AND(V77=\"provincia\",X77=\"48hrs\"),2,NETWORKDAYS.INTL(D77,M77,11,'Dias Feriados'!$A$1:$A$15))))","v":-39255}]
["B001667396","May","2025-05-27","2025-05-28","G/I. 030-10132",77,"DEYVIS LUIS FERREL HUALPA","COMDOMIO VILLA EL GUAYABO MZ E LT 12 ENTRADA DE LA VICTORIA CONDOMINIO VILLA EL GUAYABO","Provincia","ICA","ICA","B001667396",null,"En Ruta",9730017139,"F",202508,203201,"En Ruta","Dia 1","CARMEL","PROVINCIA",{"$f":"NETWORKDAYS.INTL(D78,M78,11,'Dias Feriados'!$A$1:$A$15)","v":-39255},"En Ruta",22,"NO",null,0.9375,0.94722222222222219,1,"CRUCES CHO","2025-05-28",null,null,45804,"",{"$f":"IF(AS78=\"Devuelto\",\"\",IF(X78=\"24hrs\",\"Entregado\",CONSOLIDADO!S78))","v":"En Ruta"},"",{"$f":"IF(AK78=\"Entregado\",\"\",IF(X78=\"24hrs\",\"\",IF(X78=\"48hrs\",\"Entregado\",CONSOLIDADO!S78)))","v":"En Ruta"},"",{"$f":"IF(AK78=\"Entregado\",\"\",IF(OR(X78=\"24hrs\",X78=\"48hrs\"),\"\",IF(X78=\"72hrs\",\"Entregado\",CONSOLIDADO!S78)))","v":"En Ruta"},"",{"$f":"IF(AK78=\"Entregado\",\"\",IF(OR(X78=\"24hrs\",X78=\"48hrs\",X78=\"72hrs\"),\"\",IF(X78=\"+72hrs\",\"Entregado\",CONSOLIDADO!S78)))","v":"En Ruta"},"","En Ruta",1,0,0,0,0,1,0,"No Entregado",0,0,1,0,{"$f":"IF(V78=\"Lima\",NETWORKDAYS.INTL(D78,M78,11,'Dias Feriados'!$A$1:$A$15),IF(AND(V78=\"provincia\",X78=\"24hrs\"),1,IF(AND(V78=\"provincia\",X78=\"48hrs\"),2,NETWORKDAYS.INTL(D78,M78,11,'Dias Feriados'!$A$1:$A$15))))","v":-39255}]
["B001667354","May","2025-05-27","2025-05-28","G/I. 030-10132",78,"MELISSA MABEL TITO ORMENO","URB SAN JOAQUIN 1 ETP MZ R LT 16 PASANDO EL RESERVORIO A MEDIA CUADRA","Provincia","ICA","ICA","B001667354",null,"En Ruta",9730017147,"F",202508,203201,"En Ruta","Dia 1","CARMEL","PROVINCIA",{"$f":"NETWORKDAYS.INTL(D79,M79,11,'Dias Feriados'!$A$1:$A$15)","v":-39255},"En Ruta",22,"NO",null,0.9375,0.94722222222222219,1,"CRUCES CHO","2025-05-28",null,null,45804,"",{"$f":"IF(AS79=\"Devuelto\",\"\",IF(X79=\"24hrs\",\"Entregado\",CONSOLIDADO!S79))","v":"En Ruta"},"",{"$f":"IF(AK79=\"Entregado\",\"\",IF(X79=\"24hrs\",\"\",IF(X79=\"48hrs\",\"Entregado\",CONSOLIDADO!S79)))","v":"En Ruta"},"",{"$f":"IF(AK79=\"Entregado\",\"\",IF(OR(X79=\"24hrs\",X79=\"48hrs\"),\"\",IF(X79=\"72hrs\",\"Entregado\",CONSOLIDADO!S79)))","v":"En Ruta"},"",{"$f":"IF(AK79=\"Entregado\",\"\",IF(OR(X79=\"24hrs\",X79=\"48hrs\",X79=\"72hrs\"),\"\",IF(X79=\"+72hrs\",\"Entregado\",CONSOLIDADO!S79)))","v":"En Ruta"},"","En Ruta",1,0,0,0,0,1,0,"No Entregado",0,0,1,0,{"$f":"IF(V79=\"Lima\",NETWORKDAYS.INTL(D79,M79,11,'Dias Feriados'!$A$1:$A$15),IF(AND(V79=\"provincia\",X79=\"24hrs\"),1,IF(AND(V79=\"provincia\",X79=\"48hrs\"),2,NETWORKDAYS.INTL(D79,M79,11,'Dias Feriados'!$A$1:$A$15))))","v":-39255}]
["B001667623","May","2025-05-27","2025-05-28","G/I. 030-10132",79,"MARY LUPE CABRERA URIBE","URB SAN JOAQUIN G 11 ET 1 ANTES DEL COL JULIO C TELLO","Provincia","ICA","ICA","B001667623",null,"En Ruta",9730017159,"F",202508,203201,"En Ruta","Dia 1","CARMEL","PROVINCIA",{"$f":"NETWORKDAYS.INTL(D80,M80,11,'Dias Feriados'!$A$1:$A$15)","v":-39255},"En Ruta",22,"NO",null,0.9375,0.94722222222222219,1,"CRUCES CHO","2025-05-28",null,null,45804,"",{"$f":"IF(AS80=\"Devuelto\",\"\",IF(X80=\"24hrs\",\"Entregado\",CONSOLIDADO!S80))","v":"En Ruta"},"",{"$f":"IF(AK80=\"Entregado\",\"\",IF(X80=\"24hrs\",\"\",IF(X80=\"48hrs\",\"Entregado\",CONSOLIDADO!S80)))","v":"En Ruta"},"",{"$f":"IF(AK80=\"Entregado\",\"\",IF(OR(X80=\"24hrs\",X80=\"48hrs\"),\"\",IF(X80=\"72hrs\",\"Entregado\",CONSOLIDADO!S80)))","v":"En Ruta"},"",{"$f":"IF(AK80=\"Entregado\",\"\",IF(OR(X80=\"24hrs\",X80=\"48hrs\",X80=\"72hrs\"),\"\",IF(X80=\"+72hrs\",\"Entregado\",CONSOLIDADO!S80)))","v":"En Ruta"},"","En Ruta",1,0,0,0,0,1,0,"No Entregado",0,0,1,0,{"$f":"IF(V80=\"Lima\",NETWORKDAYS.INTL(D80,M80,11,'Dias Feriados'!$A$1:$A$15),IF(AND(V80=\"provincia\",X80=\"24hrs\"),1,IF(AND(V80=\"provincia\",X80=\"48hrs\"),2,NETWORKDAYS.INTL(D80,M80,11,'Dias Feriados'!$A$1:$A$15))))","v":-39255}]
["B001667796","May","2025-05-27","2025-05-28","G/I. 030-10132",80,"SANDY ARACELY PARIONA VASQUEZ","HUANUCO 371 RESTAURAN TONO Y VERONICA SERCADO DE ICA","Provincia","ICA","ICA","B001667796",null,"En Ruta",9730017164,"F",202508,203201,"En Ruta","Dia 1","CARMEL","PROVINCIA",{"$f":"NETWORKDAYS.INTL(D81,M81,11,'Dias Feriados'!$A$1:$A$15)","v":-39255},"En Ruta",22,"NO",null,0.9375,0.94722222222222219,1,"CRUCES CHO","2025-05-28",null,null,45804,"",{"$f":"IF(AS81=\"Devuelto\",\"\",IF(X81=\"24hrs\",\"Entregado\",CONSOLIDADO!S81))","v":"En Ruta"},"",{"$f":"IF(AK81=\"Entregado\",\"\",IF(X81=\"24hrs\",\"\",IF(X81=\"48hrs\",\"Entregado\",CONSOLIDADO!S81)))","v":"En Ruta"},"",{"$f":"IF(AK81=\"Entregado\",\"\",IF(OR(X81=\"24hrs\",X81=\"48hrs\"),\"\",IF(X81=\"72hrs\",\"Entregado\",CONSOLIDADO!S81)))","v":"En Ruta"},"",{"$f":"IF(AK81=\"Entregado\",\"\",IF(OR(X81=\"24hrs\",X81=\"48hrs\",X81=\"72hrs\"),\"\",IF(X81=\"+72hrs\",\"Entregado\",CONSOLIDADO!S81)))","v":"En Ruta"},"","En Ruta",1,0,0,0,0,1,0,"No Entregado",0,0,1,0,{"$f":"IF(V81=\"Lima\",NETWORKDAYS.INTL(D81,M81,11,'Dias Feriados'!$A$1:$A$15),IF(AND(V81=\"provincia\",X81=\"24hrs\"),1,IF(AND(V81=\"provincia\",X81=\"48hrs\"),2,NETWORKDAYS.INTL(D81,M81,11,'Dias Feriados'!$A$1:$A$15))))","v":-39255}]
["B001667454","May","2025-05-27","2025-05-28","G/I. 030-10132",81,"FABIOLA ARLET TORRES AQUIJE","SOL DE ICA LOS PORTALES 11 NG17 ENTRADA CENTRO RECREACIONAL","Provincia","ICA","ICA","B001667454",null,"En Ruta",9730017165,"F",202508,203201,"En Ruta","Dia 1","CARMEL","PROVINCIA",{"$f":"NETWORKDAYS.INTL(D82,M82,11,'Dias Feriados'!$A$1:$A$15)","v":-39255},"En Ruta",22,"NO",null,0.9375,0.94722222222222219,1,"CRUCES CHO","2025-05-28",null,null,45804,"",{"$f":"IF(AS82=\"Devuelto\",\"\",IF(X82=\"24hrs\",\"Entregado\",CONSOLIDADO!S82))","v":"En Ruta"},"",{"$f":"IF(AK82=\"Entregado\",\"\",IF(X82=\"24hrs\",\"\",IF(X82=\"48hrs\",\"Entregado\",CONSOLIDADO!S82)))","v":"En Ruta"},"",{"$f":"IF(AK82=\"Entregado\",\"\",IF(OR(X82=\"24hrs\",X82=\"48hrs\"),\"\",IF(X82=\"72hrs\",\"Entregado\",CONSOLIDADO!S82)))","v":"En Ruta"},"",{"$f":"IF(AK82=\"Entregado\",\"\",IF(OR(X82=\"24hrs\",X82=\"48hrs\",X82=\"72hrs\"),\"\",IF(X82=\"+72hrs\",\"Entregado\",CONSOLIDADO!S82)))","v":"En Ruta"},"","En Ruta",1,0,0,0,0,1,0,"No Entregado",0,0,1,0,{"$f":"IF(V82=\"Lima\",NETWORKDAYS.INTL(D82,M82,11,'Dias Feriados'!$A$1:$A$15),IF(AND(V82=\"provincia\",X82=\"24hrs\"),1,IF(AND(V82=\"provincia\",X82=\"48hrs\"),2,NETWORKDAYS.INTL(D82,M82,11,'Dias Feriados'!$A$1:$A$15))))","v":-39255}]
["B001667600","May","2025-05-27","2025-05-28","G/I. 030-10132",82,"WENDY ERIKA ANAIS ALIAGA TENOR","URB VILLA KILLARI B15 MENORCA MENORCA SANTA MARIA A ESPALDAS DEL PARQUE","Provincia","ICA","ICA","B001667600",null,"En Ruta",9730017168,"F",202508,203201,"En Ruta","Dia 1","CARMEL","PROVINCIA",{"$f":"NETWORKDAYS.INTL(D83,M83,11,'Dias Feriados'!$A$1:$A$15)","v":-39255},"En Ruta",22,"NO",null,0.9375,0.94722222222222219,1,"CRUCES CHO","2025-05-28",null,null,45804,"",{"$f":"IF(AS83=\"Devuelto\",\"\",IF(X83=\"24hrs\",\"Entregado\",CONSOLIDADO!S83))","v":"En Ruta"},"",{"$f":"IF(AK83=\"Entregado\",\"\",IF(X83=\"24hrs\",\"\",IF(X83=\"48hrs\",\"Entregado\",CONSOLIDADO!S83)))","v":"En Ruta"},"",{"$f":"IF(AK83=\"Entregado\",\"\",IF(OR(X83=\"24hrs\",X83=\"48hrs\"),\"\",IF(X83=\"72hrs\",\"Entregado\",CONSOLIDADO!S83)))","v":"En Ruta"},"",{"$f":"IF(AK83=\"Entregado\",\"\",IF(OR(X83=\"24hrs\",X83=\"48hrs\",X83=\"72hrs\"),\"\",IF(X83=\"+72hrs\",\"Entregado\",CONSOLIDADO!S83)))","v":"En Ruta"},"","En Ruta",1,0,0,0,0,1,0,"No Entregado",0,0,1,0,{"$f":"IF(V83=\"Lima\",NETWORKDAYS.INTL(D83,M83,11,'Dias Feriados'!$A$1:$A$15),IF(AND(V83=\"provincia\",X83=\"24hrs\"),1,IF(AND(V83=\"provincia\",X83=\"48hrs\"),2,NETWORKDAYS.INTL(D83,M83,11,'Dias Feriados'!$A$1:$A$15))))","v":-39255}]
["B001667519","May","2025-05-27","2025-05-28","G/I. 030-10132",83,"CAMILA FERNANDA RISCO HERNANDE","CL LA MAR MIL 28 AV CUTERVO Y CL NASCA","Provincia","ICA","ICA","B001667519",null,"En Ruta",9730017170,"F",202508,203201,"En Ruta","Dia 1","CARMEL","PROVINCIA",{"$f":"NETWORKDAYS.INTL(D84,M84,11,'Dias Feriados'!$A$1:$A$15)","v":-39255},"En Ruta",22,"NO",null,0.9375,0.94722222222222219,1,"CRUCES CHO","2025-05-28",null,null,45804,"",{"$f":"IF(AS84=\"Devuelto\",\"\",IF(X84=\"24hrs\",\"Entregado\",CONSOLIDADO!S84))","v":"En Ruta"},"",{"$f":"IF(AK84=\"Entregado\",\"\",IF(X84=\"24hrs\",\"\",IF(X84=\"48hrs\",\"Entregado\",CONSOLIDADO!S84)))","v":"En Ruta"},"",{"$f":"IF(AK84=\"Entregado\",\"\",IF(OR(X84=\"24hrs\",X84=\"48hrs\"),\"\",IF(X84=\"72hrs\",\"Entregado\",CONSOLIDADO!S84)))","v":"En Ruta"},"",{"$f":"IF(AK84=\"Entregado\",\"\",IF(OR(X84=\"24hrs\",X84=\"48hrs\",X84=\"72hrs\"),\"\",IF(X84=\"+72hrs\",\"Entregado\",CONSOLIDADO!S84)))","v":"En Ruta"},"","En Ruta",1,0,0,0,0,1,0,"No Entregado",0,0,1,0,{"$f":"IF(V84=\"Lima\",NETWORKDAYS.INTL(D84,M84,11,'Dias Feriados'!$A$1:$A$15),IF(AND(V84=\"provincia\",X84=\"24hrs\"),1,IF(AND(V84=\"provincia\",X84=\"48hrs\"),2,NETWORKDAYS.INTL(D84,M84,11,'Dias Feriados'!$A$1:$A$15))))","v":-39255}]
["B001667333","May","2025-05-27","2025-05-28","G/I. 030-10132",84,"NATHALIA PAULINA CARO RAMOS","AV CUTERVO 219 URB SAN ISIDRO RESTAURANTE MCGRILL","Provincia","ICA","ICA","B001667333",null,"En Ruta",9730017173,"F",202508,203201,"En Ruta","Dia 1","CARMEL","PROVINCIA",{"$f":"NETWORKDAYS.INTL(D85,M85,11,'Dias Feriados'!$A$1:$A$15)","v":-39255},"En Ruta",22,"NO",null,0.9375,0.94722222222222219,1,"CRUCES CHO","2025-05-28",null,null,45804,"",{"$f":"IF(AS85=\"Devuelto\",\"\",IF(X85=\"24hrs\",\"Entregado\",CONSOLIDADO!S85))","v":"En Ruta"},"",{"$f":"IF(AK85=\"Entregado\",\"\",IF(X85=\"24hrs\",\"\",IF(X85=\"48hrs\",\"Entregado\",CONSOLIDADO!S85)))","v":"En Ruta"},"",{"$f":"IF(AK85=\"Entregado\",\"\",IF(OR(X85=\"24hrs\",X85=\"48hrs\"),\"\",IF(X85=\"72hrs\",\"Entregado\",CONSOLIDADO!S85)))","v":"En Ruta"},"",{"$f":"IF(AK85=\"Entregado\",\"\",IF(OR(X85=\"24hrs\",X85=\"48hrs\",X85=\"72hrs\"),\"\",IF(X85=\"+72hrs\",\"Entregado\",CONSOLIDADO!S85)))","v":"En Ruta"},"","En Ruta",1,0,0,0,0,1,0,"No Entregado",0,0,1,0,{"$f":"IF(V85=\"Lima\",NETWORKDAYS.INTL(D85,M85,11,'Dias Feriados'!$A$1:$A$15),IF(AND(V85=\"provincia\",X85=\"24hrs\"),1,IF(AND(V85=\"provincia\",X85=\"48hrs\"),2,NETWORKDAYS.INTL(D85,M85,11,'Dias Feriados'!$A$1:$A$15))))","v":-39255}]
["B001667659","May","2025-05-27","2025-05-28","G/I. 030-10132",85,"VICTORIA GUTIERREZ RAMOS","SAN JOAQUIN MZT LT 61 A MEDIA CUADRA DEL CRUCE URB SAN JOAQUIN 2DA ETAPA","Provincia","ICA","ICA","B001667659",null,"En Ruta",9730017176,"F",202508,203201,"En Ruta","Dia 1","CARMEL","PROVINCIA",{"$f":"NETWORKDAYS.INTL(D86,M86,11,'Dias Feriados'!$A$1:$A$15)","v":-39255},"En Ruta",22,"NO",null,0.9375,0.94722222222222219,1,"CRUCES CHO","2025-05-28",null,null,45804,"",{"$f":"IF(AS86=\"Devuelto\",\"\",IF(X86=\"24hrs\",\"Entregado\",CONSOLIDADO!S86))","v":"En Ruta"},"",{"$f":"IF(AK86=\"Entregado\",\"\",IF(X86=\"24hrs\",\"\",IF(X86=\"48hrs\",\"Entregado\",CONSOLIDADO!S86)))","v":"En Ruta"},"",{"$f":"IF(AK86=\"Entregado\",\"\",IF(OR(X86=\"24hrs\",X86=\"48hrs\"),\"\",IF(X86=\"72hrs\",\"Entregado\",CONSOLIDADO!S86)))","v":"En Ruta"},"",{"$f":"IF(AK86=\"Entregado\",\"\",IF(OR(X86=\"24hrs\",X86=\"48hrs\",X86=\"72hrs\"),\"\",IF(X86=\"+72hrs\",\"Entregado\",CONSOLIDADO!S86)))","v":"En Ruta"},"","En Ruta",1,0,0,0,0,1,0,"No Entregado",0,0,1,0,{"$f":"IF(V86=\"Lima\",NETWORKDAYS.INTL(D86,M86,11,'Dias Feriados'!$A$1:$A$15),IF(AND(V86=\"provincia\",X86=\"24hrs\"),1,IF(AND(V86=\"provincia\",X86=\"48hrs\"),2,NETWORKDAYS.INTL(D86,M86,11,'Dias Feriados'!$A$1:$A$15))))","v":-39255}]
["B001667633","May","2025-05-27","2025-05-28","G/I. 030-10132",86,"MARIA DEL ROSARIO RIOS ECOS","BOTIJERIA ANGULO SUR INTERIOR B MZ L LT 23B POR LA ORILLA DEL RIO BOTIJERIA ANGULO SUR MANZANILLA","Provincia","ICA","ICA","B001667633",null,"En Ruta",9730017177,"F",202508,203201,"En Ruta","Dia 1","CARMEL","PROVINCIA",{"$f":"NETWORKDAYS.INTL(D87,M87,11,'Dias Feriados'!$A$1:$A$15)","v":-39255},"En Ruta",22,"NO",null,0.9375,0.94722222222222219,1,"CRUCES CHO","2025-05-28",null,null,45804,"",{"$f":"IF(AS87=\"Devuelto\",\"\",IF(X87=\"24hrs\",\"Entregado\",CONSOLIDADO!S87))","v":"En Ruta"},"",{"$f":"IF(AK87=\"Entregado\",\"\",IF(X87=\"24hrs\",\"\",IF(X87=\"48hrs\",\"Entregado\",CONSOLIDADO!S87)))","v":"En Ruta"},"",{"$f":"IF(AK87=\"Entregado\",\"\",IF(OR(X87=\"24hrs\",X87=\"48hrs\"),\"\",IF(X87=\"72hrs\",\"Entregado\",CONSOLIDADO!S87)))","v":"En Ruta"},"",{"$f":"IF(AK87=\"Entregado\",\"\",IF(OR(X87=\"24hrs\",X87=\"48hrs\",X87=\"72hrs\"),\"\",IF(X87=\"+72hrs\",\"Entregado\",CONSOLIDADO!S87)))","v":"En Ruta"},"","En Ruta",1,0,0,0,0,1,0,"No Entregado",0,0,1,0,{"$f":"IF(V87=\"Lima\",NETWORKDAYS.INTL(D87,M87,11,'Dias Feriados'!$A$1:$A$15),IF(AND(V87=\"provincia\",X87=\"24hrs\"),1,IF(AND(V87=\"provincia\",X87=\"48hrs\"),2,NETWORKDAYS.INTL(D87,M87,11,'Dias Feriados'!$A$1:$A$15))))","v":-39255}]
["B001667658","May","2025-05-27","2025-05-28","G/I. 030-10132",87,"JOANIE DEL CARMEN LUJAN SOSA","URB VILLAS DEL SOL E01 ETAPA 2 ETAPA 2","Provincia","ICA","ICA","B001667658",null,"En Ruta",9730017180,"F",202508,203201,"En Ruta","Dia 1","CARMEL","PROVINCIA",{"$f":"NETWORKDAYS.INTL(D88,M88,11,'Dias Feriados'!$A$1:$A$15)","v":-39255},"En Ruta",22,"NO",null,0.9375,0.94722222222222219,1,"CRUCES CHO","2025-05-28",null,null,45804,"",{"$f":"IF(AS88=\"Devuelto\",\"\",IF(X88=\"24hrs\",\"Entregado\",CONSOLIDADO!S88))","v":"En Ruta"},"",{"$f":"IF(AK88=\"Entregado\",\"\",IF(X88=\"24hrs\",\"\",IF(X88=\"48hrs\",\"Entregado\",CONSOLIDADO!S88)))","v":"En Ruta"},"",{"$f":"IF(AK88=\"Entregado\",\"\",IF(OR(X88=\"24hrs\",X88=\"48hrs\"),\"\",IF(X88=\"72hrs\",\"Entregado\",CONSOLIDADO!S88)))","v":"En Ruta"},"",{"$f":"IF(AK88=\"Entregado\",\"\",IF(OR(X88=\"24hrs\",X88=\"48hrs\",X88=\"72hrs\"),\"\",IF(X88=\"+72hrs\",\"Entregado\",CONSOLIDADO!S88)))","v":"En Ruta"},"","En Ruta",1,0,0,0,0,1,0,"No Entregado",0,0,1,0,{"$f":"IF(V88=\"Lima\",NETWORKDAYS.INTL(D88,M88,11,'Dias Feriados'!$A$1:$A$15),IF(AND(V88=\"provincia\",X88=\"24hrs\"),1,IF(AND(V88=\"provincia\",X88=\"48hrs\"),2,NETWORKDAYS.INTL(D88,M88,11,'Dias Feriados'!$A$1:$A$15))))","v":-39255}]
["B001667626","May","2025-05-27","2025-05-28","G/I. 030-10132",88,"NORIS EVARISTA ALLGAIHUAMAN HU","CL CALLAO 212 PISO 3 DPTO 5 COSTADO DE LA NOTARIA SANCHEZ","Provincia","ICA","ICA","B001667626",null,"En Ruta",9730017183,"F",202508,203201,"En Ruta","Dia 1","CARMEL","PROVINCIA",{"$f":"NETWORKDAYS.INTL(D89,M89,11,'Dias Feriados'!$A$1:$A$15)","v":-39255},"En Ruta",22,"NO",null,0.9375,0.94722222222222219,1,"CRUCES CHO","2025-05-28",null,null,45804,"",{"$f":"IF(AS89=\"Devuelto\",\"\",IF(X89=\"24hrs\",\"Entregado\",CONSOLIDADO!S89))","v":"En Ruta"},"",{"$f":"IF(AK89=\"Entregado\",\"\",IF(X89=\"24hrs\",\"\",IF(X89=\"48hrs\",\"Entregado\",CONSOLIDADO!S89)))","v":"En Ruta"},"",{"$f":"IF(AK89=\"Entregado\",\"\",IF(OR(X89=\"24hrs\",X89=\"48hrs\"),\"\",IF(X89=\"72hrs\",\"Entregado\",CONSOLIDADO!S89)))","v":"En Ruta"},"",{"$f":"IF(AK89=\"Entregado\",\"\",IF(OR(X89=\"24hrs\",X89=\"48hrs\",X89=\"72hrs\"),\"\",IF(X89=\"+72hrs\",\"Entregado\",CONSOLIDADO!S89)))","v":"En Ruta"},"","En Ruta",1,0,0,0,0,1,0,"No Entregado",0,0,1,0,{"$f":"IF(V89=\"Lima\",NETWORKDAYS.INTL(D89,M89,11,'Dias Feriados'!$A$1:$A$15),IF(AND(V89=\"provincia\",X89=\"24hrs\"),1,IF(AND(V89=\"provincia\",X89=\"48hrs\"),2,NETWORKDAYS.INTL(D89,M89,11,'Dias Feriados'!$A$1:$A$15))))","v":-39255}]
["B001667416","May","2025-05-27","2025-05-28","G/I. 030-10132",89,"MARIA DEL ROSARIO PARVINA ALVA","SANTA ROSA DEL PALMAR TURQUESAS 0 MZ F LT 31 ANTES DE LLEGAR ALA POLLERIA EL HUARANGO","Provincia","ICA","ICA","B001667416",null,"En Ruta",9730017192,"F",202508,203201,"En Ruta","Dia 1","CARMEL","PROVINCIA",{"$f":"NETWORKDAYS.INTL(D90,M90,11,'Dias Feriados'!$A$1:$A$15)","v":-39255},"En Ruta",22,"NO",null,0.9375,0.94722222222222219,1,"CRUCES CHO","2025-05-28",null,null,45804,"",{"$f":"IF(AS90=\"Devuelto\",\"\",IF(X90=\"24hrs\",\"Entregado\",CONSOLIDADO!S90))","v":"En Ruta"},"",{"$f":"IF(AK90=\"Entregado\",\"\",IF(X90=\"24hrs\",\"\",IF(X90=\"48hrs\",\"Entregado\",CONSOLIDADO!S90)))","v":"En Ruta"},"",{"$f":"IF(AK90=\"Entregado\",\"\",IF(OR(X90=\"24hrs\",X90=\"48hrs\"),\"\",IF(X90=\"72hrs\",\"Entregado\",CONSOLIDADO!S90)))","v":"En Ruta"},"",{"$f":"IF(AK90=\"Entregado\",\"\",IF(OR(X90=\"24hrs\",X90=\"48hrs\",X90=\"72hrs\"),\"\",IF(X90=\"+72hrs\",\"Entregado\",CONSOLIDADO!S90)))","v":"En Ruta"},"","En Ruta",1,0,0,0,0,1,0,"No Entregado",0,0,1,0,{"$f":"IF(V90=\"Lima\",NETWORKDAYS.INTL(D90,M90,11,'Dias Feriados'!$A$1:$A$15),IF(AND(V90=\"provincia\",X90=\"24hrs\"),1,IF(AND(V90=\"provincia\",X90=\"48hrs\"),2,NETWORKDAYS.INTL(D90,M90,11,'Dias Feriados'!$A$1:$A$15))))","v":-39255}]
["B001667337","May","2025-05-27","2025-05-28","G/I. 030-10132",90,"DAYSI YOLANDA ALMORA SANDOVAL","SAN JUAN BAUTISTA CACERIO LONGAR 1010 PASANDO EL RESERVORIO","Provincia","ICA","ICA","B001667337",null,"En Ruta",9730017193,"F",202508,203201,"En Ruta","Dia 1","CARMEL","PROVINCIA",{"$f":"NETWORKDAYS.INTL(D91,M91,11,'Dias Feriados'!$A$1:$A$15)","v":-39255},"En Ruta",22,"NO",null,0.9375,0.94722222222222219,1,"CRUCES CHO","2025-05-28",null,null,45804,"",{"$f":"IF(AS91=\"Devuelto\",\"\",IF(X91=\"24hrs\",\"Entregado\",CONSOLIDADO!S91))","v":"En Ruta"},"",{"$f":"IF(AK91=\"Entregado\",\"\",IF(X91=\"24hrs\",\"\",IF(X91=\"48hrs\",\"Entregado\",CONSOLIDADO!S91)))","v":"En Ruta"},"",{"$f":"IF(AK91=\"Entregado\",\"\",IF(OR(X91=\"24hrs\",X91=\"48hrs\"),\"\",IF(X91=\"72hrs\",\"Entregado\",CONSOLIDADO!S91)))","v":"En Ruta"},"",{"$f":"IF(AK91=\"Entregado\",\"\",IF(OR(X91=\"24hrs\",X91=\"48hrs\",X91=\"72hrs\"),\"\",IF(X91=\"+72hrs\",\"Entregado\",CONSOLIDADO!S91)))","v":"En Ruta"},"","En Ruta",1,0,0,0,0,1,0,"No Entregado",0,0,1,0,{"$f":"IF(V91=\"Lima\",NETWORKDAYS.INTL(D91,M91,11,'Dias Feriados'!$A$1:$A$15),IF(AND(V91=\"provincia\",X91=\"24hrs\"),1,IF(AND(V91=\"provincia\",X91=\"48hrs\"),2,NETWORKDAYS.INTL(D91,M91,11,'Dias Feriados'!$A$1:$A$15))))","v":-39255}]
["B001667795","May","2025-05-27","2025-05-28","G/I. 030-10132",91,"MERY TEODORA QUIJANDRIA NUNEZ","LOS VINEDOS MZ G LT 7 ESPALDA MERCADO ARENALES URB LOS VINEDOS","Provincia","ICA","ICA","B001667795",null,"En Ruta",9730017194,"F",202508,203201,"En Ruta","Dia 1","CARMEL","PROVINCIA",{"$f":"NETWORKDAYS.INTL(D92,M92,11,'Dias Feriados'!$A$1:$A$15)","v":-39255},"En Ruta",22,"NO",null,0.9375,0.94722222222222219,1,"CRUCES CHO","2025-05-28",null,null,45804,"",{"$f":"IF(AS92=\"Devuelto\",\"\",IF(X92=\"24hrs\",\"Entregado\",CONSOLIDADO!S92))","v":"En Ruta"},"",{"$f":"IF(AK92=\"Entregado\",\"\",IF(X92=\"24hrs\",\"\",IF(X92=\"48hrs\",\"Entregado\",CONSOLIDADO!S92)))","v":"En Ruta"},"",{"$f":"IF(AK92=\"Entregado\",\"\",IF(OR(X92=\"24hrs\",X92=\"48hrs\"),\"\",IF(X92=\"72hrs\",\"Entregado\",CONSOLIDADO!S92)))","v":"En Ruta"},"",{"$f":"IF(AK92=\"Entregado\",\"\",IF(OR(X92=\"24hrs\",X92=\"48hrs\",X92=\"72hrs\"),\"\",IF(X92=\"+72hrs\",\"Entregado\",CONSOLIDADO!S92)))","v":"En Ruta"},"","En Ruta",1,0,0,0,0,1,0,"No Entregado",0,0,1,0,{"$f":"IF(V92=\"Lima\",NETWORKDAYS.INTL(D92,M92,11,'Dias Feriados'!$A$1:$A$15),IF(AND(V92=\"provincia\",X92=\"24hrs\"),1,IF(AND(V92=\"provincia\",X92=\"48hrs\"),2,NETWORKDAYS.INTL(D92,M92,11,'Dias Feriados'!$A$1:$A$15))))","v":-39255}]
["B001667589","May","2025-05-27","2025-05-28","G/I. 030-10132",92,"LUPE MARIVEL CAMPOS RAMOS","PROLONGACION ABRAHAM VALDELOMAR 172 COSTADO DE COCACOLA","Provincia","ICA","ICA","B001667589",null,"En Ruta",9730017195,"F",202508,203201,"En Ruta","Dia 1","CARMEL","PROVINCIA",{"$f":"NETWORKDAYS.INTL(D93,M93,11,'Dias Feriados'!$A$1:$A$15)","v":-39255},"En Ruta",22,"NO",null,0.9375,0.94722222222222219,1,"CRUCES CHO","2025-05-28",null,null,45804,"",{"$f":"IF(AS93=\"Devuelto\",\"\",IF(X93=\"24hrs\",\"Entregado\",CONSOLIDADO!S93))","v":"En Ruta"},"",{"$f":"IF(AK93=\"Entregado\",\"\",IF(X93=\"24hrs\",\"\",IF(X93=\"48hrs\",\"Entregado\",CONSOLIDADO!S93)))","v":"En Ruta"},"",{"$f":"IF(AK93=\"Entregado\",\"\",IF(OR(X93=\"24hrs\",X93=\"48hrs\"),\"\",IF(X93=\"72hrs\",\"Entregado\",CONSOLIDADO!S93)))","v":"En Ruta"},"",{"$f":"IF(AK93=\"Entregado\",\"\",IF(OR(X93=\"24hrs\",X93=\"48hrs\",X93=\"72hrs\"),\"\",IF(X93=\"+72hrs\",\"Entregado\",CONSOLIDADO!S93)))","v":"En Ruta"},"","En Ruta",1,0,0,0,0,1,0,"No Entregado",0,0,1,0,{"$f":"IF(V93=\"Lima\",NETWORKDAYS.INTL(D93,M93,11,'Dias Feriados'!$A$1:$A$15),IF(AND(V93=\"provincia\",X93=\"24hrs\"),1,IF(AND(V93=\"provincia\",X93=\"48hrs\"),2,NETWORKDAYS.INTL(D93,M93,11,'Dias Feriados'!$A$1:$A$15))))","v":-39255}]
["B001667484","May","2025-05-27","2025-05-28","G/I. 030-10132",93,"LUISA ELIZABETH URIONDO PACHEC","EL CARMEN MZ C LT 9 X EL CRUCE DE SAN JOAQUIN URB EL CARMEN","Provincia","ICA","ICA","B001667484",null,"En Ruta",9730017200,"F",202508,203201,"En Ruta","Dia 1","CARMEL","PROVINCIA",{"$f":"NETWORKDAYS.INTL(D94,M94,11,'Dias Feriados'!$A$1:$A$15)","v":-39255},"En Ruta",22,"NO",null,0.9375,0.94722222222222219,1,"CRUCES CHO","2025-05-28",null,null,45804,"",{"$f":"IF(AS94=\"Devuelto\",\"\",IF(X94=\"24hrs\",\"Entregado\",CONSOLIDADO!S94))","v":"En Ruta"},"",{"$f":"IF(AK94=\"Entregado\",\"\",IF(X94=\"24hrs\",\"\",IF(X94=\"48hrs\",\"Entregado\",CONSOLIDADO!S94)))","v":"En Ruta"},"",{"$f":"IF(AK94=\"Entregado\",\"\",IF(OR(X94=\"24hrs\",X94=\"48hrs\"),\"\",IF(X94=\"72hrs\",\"Entregado\",CONSOLIDADO!S94)))","v":"En Ruta"},"",{"$f":"IF(AK94=\"Entregado\",\"\",IF(OR(X94=\"24hrs\",X94=\"48hrs\",X94=\"72hrs\"),\"\",IF(X94=\"+72hrs\",\"Entregado\",CONSOLIDADO!S94)))","v":"En Ruta"},"","En Ruta",1,0,0,0,0,1,0,"No Entregado",0,0,1,0,{"$f":"IF(V94=\"Lima\",NETWORKDAYS.INTL(D94,M94,11,'Dias Feriados'!$A$1:$A$15),IF(AND(V94=\"provincia\",X94=\"24hrs\"),1,IF(AND(V94=\"provincia\",X94=\"48hrs\"),2,NETWORKDAYS.INTL(D94,M94,11,'Dias Feriados'!$A$1:$A$15))))","v":-39255}]
["B001667636","May","2025-05-27","2025-05-28","G/I. 030-10132",94,"JUANA ISABEL GARIBAY GUEVARA","URB VALLE HERMOSO MZ J LOTE 02 RREF HUACACHINA","Provincia","ICA","ICA","B001667636",null,"En Ruta",9730017205,"F",202508,203201,"En Ruta","Dia 1","CARMEL","PROVINCIA",{"$f":"NETWORKDAYS.INTL(D95,M95,11,'Dias Feriados'!$A$1:$A$15)","v":-39255},"En Ruta",22,"NO",null,0.9375,0.94722222222222219,1,"CRUCES CHO","2025-05-28",null,null,45804,"",{"$f":"IF(AS95=\"Devuelto\",\"\",IF(X95=\"24hrs\",\"Entregado\",CONSOLIDADO!S95))","v":"En Ruta"},"",{"$f":"IF(AK95=\"Entregado\",\"\",IF(X95=\"24hrs\",\"\",IF(X95=\"48hrs\",\"Entregado\",CONSOLIDADO!S95)))","v":"En Ruta"},"",{"$f":"IF(AK95=\"Entregado\",\"\",IF(OR(X95=\"24hrs\",X95=\"48hrs\"),\"\",IF(X95=\"72hrs\",\"Entregado\",CONSOLIDADO!S95)))","v":"En Ruta"},"",{"$f":"IF(AK95=\"Entregado\",\"\",IF(OR(X95=\"24hrs\",X95=\"48hrs\",X95=\"72hrs\"),\"\",IF(X95=\"+72hrs\",\"Entregado\",CONSOLIDADO!S95)))","v":"En Ruta"},"","En Ruta",1,0,0,0,0,1,0,"No Entregado",0,0,1,0,{"$f":"IF(V95=\"Lima\",NETWORKDAYS.INTL(D95,M95,11,'Dias Feriados'!$A$1:$A$15),IF(AND(V95=\"provincia\",X95=\"24hrs\"),1,IF(AND(V95=\"provincia\",X95=\"48hrs\"),2,NETWORKDAYS.INTL(D95,M95,11,'Dias Feriados'!$A$1:$A$15))))","v":-39255}]
["B001667608","May","2025-05-27","2025-05-28","G/I. 030-10132",95,"LINA NEMESIA GALLEGOS CARRASCO","CLL CASTROVIRREYNA 114 INT 2 AL COSTADO DE TRAGAMONEDAS RICHARD","Provincia","ICA","ICA","B001667608",null,"En Ruta",9730017217,"F",202508,203201,"En Ruta","Dia 1","CARMEL","PROVINCIA",{"$f":"NETWORKDAYS.INTL(D96,M96,11,'Dias Feriados'!$A$1:$A$15)","v":-39255},"En Ruta",22,"NO",null,0.9375,0.94722222222222219,1,"CRUCES CHO","2025-05-28",null,null,45804,"",{"$f":"IF(AS96=\"Devuelto\",\"\",IF(X96=\"24hrs\",\"Entregado\",CONSOLIDADO!S96))","v":"En Ruta"},"",{"$f":"IF(AK96=\"Entregado\",\"\",IF(X96=\"24hrs\",\"\",IF(X96=\"48hrs\",\"Entregado\",CONSOLIDADO!S96)))","v":"En Ruta"},"",{"$f":"IF(AK96=\"Entregado\",\"\",IF(OR(X96=\"24hrs\",X96=\"48hrs\"),\"\",IF(X96=\"72hrs\",\"Entregado\",CONSOLIDADO!S96)))","v":"En Ruta"},"",{"$f":"IF(AK96=\"Entregado\",\"\",IF(OR(X96=\"24hrs\",X96=\"48hrs\",X96=\"72hrs\"),\"\",IF(X96=\"+72hrs\",\"Entregado\",CONSOLIDADO!S96)))","v":"En Ruta"},"","En Ruta",1,0,0,0,0,1,0,"No Entregado",0,0,1,0,{"$f":"IF(V96=\"Lima\",NETWORKDAYS.INTL(D96,M96,11,'Dias Feriados'!$A$1:$A$15),IF(AND(V96=\"provincia\",X96=\"24hrs\"),1,IF(AND(V96=\"provincia\",X96=\"48hrs\"),2,NETWORKDAYS.INTL(D96,M96,11,'Dias Feriados'!$A$1:$A$15))))","v":-39255}]
["B001667761","May","2025-05-27","2025-05-28","G/I. 030-10132",96,"FELICITA NELIDA SOTO CRISPIN","URB LAS PALMERAS O 16 4ET COL INCIAL UN MUNDO DE COLORES","Provincia","ICA","ICA","B001667761",null,"En Ruta",9730017220,"F",202508,203201,"En Ruta","Dia 1","CARMEL","PROVINCIA",{"$f":"NETWORKDAYS.INTL(D97,M97,11,'Dias Feriados'!$A$1:$A$15)","v":-39255},"En Ruta",22,"NO",null,0.9375,0.94722222222222219,1,"CRUCES CHO","2025-05-28",null,null,45804,"",{"$f":"IF(AS97=\"Devuelto\",\"\",IF(X97=\"24hrs\",\"Entregado\",CONSOLIDADO!S97))","v":"En Ruta"},"",{"$f":"IF(AK97=\"Entregado\",\"\",IF(X97=\"24hrs\",\"\",IF(X97=\"48hrs\",\"Entregado\",CONSOLIDADO!S97)))","v":"En Ruta"},"",{"$f":"IF(AK97=\"Entregado\",\"\",IF(OR(X97=\"24hrs\",X97=\"48hrs\"),\"\",IF(X97=\"72hrs\",\"Entregado\",CONSOLIDADO!S97)))","v":"En Ruta"},"",{"$f":"IF(AK97=\"Entregado\",\"\",IF(OR(X97=\"24hrs\",X97=\"48hrs\",X97=\"72hrs\"),\"\",IF(X97=\"+72hrs\",\"Entregado\",CONSOLIDADO!S97)))","v":"En Ruta"},"","En Ruta",1,0,0,0,0,1,0,"No Entregado",0,0,1,0,{"$f":"IF(V97=\"Lima\",NETWORKDAYS.INTL(D97,M97,11,'Dias Feriados'!$A$1:$A$15),IF(AND(V97=\"provincia\",X97=\"24hrs\"),1,IF(AND(V97=\"provincia\",X97=\"48hrs\"),2,NETWORKDAYS.INTL(D97,M97,11,'Dias Feriados'!$A$1:$A$15))))","v":-39255}]
["B001667666","May","2025-05-27","2025-05-28","G/I. 030-10132",97,"CINTHYA BEATRIZ RAMOS FLORES","LA MAR 733 MZ 0 LT A AL COSTADO DE LIBRERIA PALANTE 0","Provincia","ICA","ICA","B001667666",null,"En Ruta",9730017223,"F",202508,203201,"En Ruta","Dia 1","CARMEL","PROVINCIA",{"$f":"NETWORKDAYS.INTL(D98,M98,11,'Dias Feriados'!$A$1:$A$15)","v":-39255},"En Ruta",22,"NO",null,0.9375,0.94722222222222219,1,"CRUCES CHO","2025-05-28",null,null,45804,"",{"$f":"IF(AS98=\"Devuelto\",\"\",IF(X98=\"24hrs\",\"Entregado\",CONSOLIDADO!S98))","v":"En Ruta"},"",{"$f":"IF(AK98=\"Entregado\",\"\",IF(X98=\"24hrs\",\"\",IF(X98=\"48hrs\",\"Entregado\",CONSOLIDADO!S98)))","v":"En Ruta"},"",{"$f":"IF(AK98=\"Entregado\",\"\",IF(OR(X98=\"24hrs\",X98=\"48hrs\"),\"\",IF(X98=\"72hrs\",\"Entregado\",CONSOLIDADO!S98)))","v":"En Ruta"},"",{"$f":"IF(AK98=\"Entregado\",\"\",IF(OR(X98=\"24hrs\",X98=\"48hrs\",X98=\"72hrs\"),\"\",IF(X98=\"+72hrs\",\"Entregado\",CONSOLIDADO!S98)))","v":"En Ruta"},"","En Ruta",1,0,0,0,0,1,0,"No Entregado",0,0,1,0,{"$f":"IF(V98=\"Lima\",NETWORKDAYS.INTL(D98,M98,11,'Dias Feriados'!$A$1:$A$15),IF(AND(V98=\"provincia\",X98=\"24hrs\"),1,IF(AND(V98=\"provincia\",X98=\"48hrs\"),2,NETWORKDAYS.INTL(D98,M98,11,'Dias Feriados'!$A$1:$A$15))))","v":-39255}]
["B001667499","May","2025-05-27","2025-05-28","G/I. 030-10132",98,"JACQUELIN BLONDET VALENCIA","URB LAS DUNAS A8 SAN JOAQUIN NUEVO HOTEL CARMELO","Provincia","ICA","ICA","B001667499",null,"En Ruta",9730017224,"F",202508,203201,"En Ruta","Dia 1","CARMEL","PROVINCIA",{"$f":"NETWORKDAYS.INTL(D99,M99,11,'Dias Feriados'!$A$1:$A$15)","v":-39255},"En Ruta",22,"NO",null,0.9375,0.94722222222222219,1,"CRUCES CHO","2025-05-28",null,null,45804,"",{"$f":"IF(AS99=\"Devuelto\",\"\",IF(X99=\"24hrs\",\"Entregado\",CONSOLIDADO!S99))","v":"En Ruta"},"",{"$f":"IF(AK99=\"Entregado\",\"\",IF(X99=\"24hrs\",\"\",IF(X99=\"48hrs\",\"Entregado\",CONSOLIDADO!S99)))","v":"En Ruta"},"",{"$f":"IF(AK99=\"Entregado\",\"\",IF(OR(X99=\"24hrs\",X99=\"48hrs\"),\"\",IF(X99=\"72hrs\",\"Entregado\",CONSOLIDADO!S99)))","v":"En Ruta"},"",{"$f":"IF(AK99=\"Entregado\",\"\",IF(OR(X99=\"24hrs\",X99=\"48hrs\",X99=\"72hrs\"),\"\",IF(X99=\"+72hrs\",\"Entregado\",CONSOLIDADO!S99)))","v":"En Ruta"},"","En Ruta",1,0,0,0,0,1,0,"No Entregado",0,0,1,0,{"$f":"IF(V99=\"Lima\",NETWORKDAYS.INTL(D99,M99,11,'Dias Feriados'!$A$1:$A$15),IF(AND(V99=\"provincia\",X99=\"24hrs\"),1,IF(AND(V99=\"provincia\",X99=\"48hrs\"),2,NETWORKDAYS.INTL(D99,M99,11,'Dias Feriados'!$A$1:$A$15))))","v":-39255}]
["B001667488","May","2025-05-27","2025-05-28","G/I. 030-10132",99,"JUANA MARIA RIVAS CASTILLO","URB LOS EUCALIPTOS G16 ANTES DE RSDALL SAN CARLOS MINISTERIO","Provincia","ICA","ICA","B001667488",null,"En Ruta",9730017226,"F",202508,203201,"En Ruta","Dia 1","CARMEL","PROVINCIA",{"$f":"NETWORKDAYS.INTL(D100,M100,11,'Dias Feriados'!$A$1:$A$15)","v":-39255},"En Ruta",22,"NO",null,0.9375,0.94722222222222219,1,"CRUCES CHO","2025-05-28",null,null,45804,"",{"$f":"IF(AS100=\"Devuelto\",\"\",IF(X100=\"24hrs\",\"Entregado\",CONSOLIDADO!S100))","v":"En Ruta"},"",{"$f":"IF(AK100=\"Entregado\",\"\",IF(X100=\"24hrs\",\"\",IF(X100=\"48hrs\",\"Entregado\",CONSOLIDADO!S100)))","v":"En Ruta"},"",{"$f":"IF(AK100=\"Entregado\",\"\",IF(OR(X100=\"24hrs\",X100=\"48hrs\"),\"\",IF(X100=\"72hrs\",\"Entregado\",CONSOLIDADO!S100)))","v":"En Ruta"},"",{"$f":"IF(AK100=\"Entregado\",\"\",IF(OR(X100=\"24hrs\",X100=\"48hrs\",X100=\"72hrs\"),\"\",IF(X100=\"+72hrs\",\"Entregado\",CONSOLIDADO!S100)))","v":"En Ruta"},"","En Ruta",1,0,0,0,0,1,0,"No Entregado",0,0,1,0,{"$f":"IF(V100=\"Lima\",NETWORKDAYS.INTL(D100,M100,11,'Dias Feriados'!$A$1:$A$15),IF(AND(V100=\"provincia\",X100=\"24hrs\"),1,IF(AND(V100=\"provincia\",X100=\"48hrs\"),2,NETWORKDAYS.INTL(D100,M100,11,'Dias Feriados'!$A$1:$A$15))))","v":-39255}]
["B001667434","May","2025-05-27","2025-05-28","G/I. 030-10132",100,"SILVIA FLOR SALCEDO LAGOS","URB SAN JOAQUIN S 60 2 ETP CRUCE SAN JOAQUIN PO EL CHIFA KELIKO","Provincia","ICA","ICA","B001667434",null,"En Ruta",9730017231,"F",202508,203201,"En Ruta","Dia 1","CARMEL","PROVINCIA",{"$f":"NETWORKDAYS.INTL(D101,M101,11,'Dias Feriados'!$A$1:$A$15)","v":-39255},"En Ruta",22,"NO",null,0.9375,0.94722222222222219,1,"CRUCES CHO","2025-05-28",null,null,45804,"",{"$f":"IF(AS101=\"Devuelto\",\"\",IF(X101=\"24hrs\",\"Entregado\",CONSOLIDADO!S101))","v":"En Ruta"},"",{"$f":"IF(AK101=\"Entregado\",\"\",IF(X101=\"24hrs\",\"\",IF(X101=\"48hrs\",\"Entregado\",CONSOLIDADO!S101)))","v":"En Ruta"},"",{"$f":"IF(AK101=\"Entregado\",\"\",IF(OR(X101=\"24hrs\",X101=\"48hrs\"),\"\",IF(X101=\"72hrs\",\"Entregado\",CONSOLIDADO!S101)))","v":"En Ruta"},"",{"$f":"IF(AK101=\"Entregado\",\"\",IF(OR(X101=\"24hrs\",X101=\"48hrs\",X101=\"72hrs\"),\"\",IF(X101=\"+72hrs\",\"Entregado\",CONSOLIDADO!S101)))","v":"En Ruta"},"","En Ruta",1,0,0,0,0,1,0,"No Entregado",0,0,1,0,{"$f":"IF(V101=\"Lima\",NETWORKDAYS.INTL(D101,M101,11,'Dias Feriados'!$A$1:$A$15),IF(AND(V101=\"provincia\",X101=\"24hrs\"),1,IF(AND(V101=\"provincia\",X101=\"48hrs\"),2,NETWORKDAYS.INTL(D101,M101,11,'Dias Feriados'!$A$1:$A$15))))","v":-39255}]
["B001667621","May","2025-05-27","2025-05-28","G/I. 030-10132",101,"GLADYS ISABEL UCHUYA HERNANDEZ","ASOC LOS LIBERTADORES MZ C LT 11 UNIVERSIDAD SAN JUAN BASUTICAS","Provincia","ICA","ICA","B001667621",null,"En Ruta",9730017232,"F",202508,203201,"En Ruta","Dia 1","CARMEL","PROVINCIA",{"$f":"NETWORKDAYS.INTL(D102,M102,11,'Dias Feriados'!$A$1:$A$15)","v":-39255},"En Ruta",22,"NO",null,0.9375,0.94722222222222219,1,"CRUCES CHO","2025-05-28",null,null,45804,"",{"$f":"IF(AS102=\"Devuelto\",\"\",IF(X102=\"24hrs\",\"Entregado\",CONSOLIDADO!S102))","v":"En Ruta"},"",{"$f":"IF(AK102=\"Entregado\",\"\",IF(X102=\"24hrs\",\"\",IF(X102=\"48hrs\",\"Entregado\",CONSOLIDADO!S102)))","v":"En Ruta"},"",{"$f":"IF(AK102=\"Entregado\",\"\",IF(OR(X102=\"24hrs\",X102=\"48hrs\"),\"\",IF(X102=\"72hrs\",\"Entregado\",CONSOLIDADO!S102)))","v":"En Ruta"},"",{"$f":"IF(AK102=\"Entregado\",\"\",IF(OR(X102=\"24hrs\",X102=\"48hrs\",X102=\"72hrs\"),\"\",IF(X102=\"+72hrs\",\"Entregado\",CONSOLIDADO!S102)))","v":"En Ruta"},"","En Ruta",1,0,0,0,0,1,0,"No Entregado",0,0,1,0,{"$f":"IF(V102=\"Lima\",NETWORKDAYS.INTL(D102,M102,11,'Dias Feriados'!$A$1:$A$15),IF(AND(V102=\"provincia\",X102=\"24hrs\"),1,IF(AND(V102=\"provincia\",X102=\"48hrs\"),2,NETWORKDAYS.INTL(D102,M102,11,'Dias Feriados'!$A$1:$A$15))))","v":-39255}]
["B001667417","May","2025-05-27","2025-05-28","G/I. 030-10132",102,"FELICITA GLORIA SALCEDO LAGOS","URB SAN JOAQUIN S60 2DA ET CRUCE SAN JUAQUIN","Provincia","ICA","ICA","B001667417",null,"En Ruta",9730017238,"F",202508,203201,"En Ruta","Dia 1","CARMEL","PROVINCIA",{"$f":"NETWORKDAYS.INTL(D103,M103,11,'Dias Feriados'!$A$1:$A$15)","v":-39255},"En Ruta",22,"NO",null,0.9375,0.94722222222222219,1,"CRUCES CHO","2025-05-28",null,null,45804,"",{"$f":"IF(AS103=\"Devuelto\",\"\",IF(X103=\"24hrs\",\"Entregado\",CONSOLIDADO!S103))","v":"En Ruta"},"",{"$f":"IF(AK103=\"Entregado\",\"\",IF(X103=\"24hrs\",\"\",IF(X103=\"48hrs\",\"Entregado\",CONSOLIDADO!S103)))","v":"En Ruta"},"",{"$f":"IF(AK103=\"Entregado\",\"\",IF(OR(X103=\"24hrs\",X103=\"48hrs\"),\"\",IF(X103=\"72hrs\",\"Entregado\",CONSOLIDADO!S103)))","v":"En Ruta"},"",{"$f":"IF(AK103=\"Entregado\",\"\",IF(OR(X103=\"24hrs\",X103=\"48hrs\",X103=\"72hrs\"),\"\",IF(X103=\"+72hrs\",\"Entregado\",CONSOLIDADO!S103)))","v":"En Ruta"},"","En Ruta",1,0,0,0,0,1,0,"No Entregado",0,0,1,0,{"$f":"IF(V103=\"Lima\",NETWORKDAYS.INTL(D103,M103,11,'Dias Feriados'!$A$1:$A$15),IF(AND(V103=\"provincia\",X103=\"24hrs\"),1,IF(AND(V103=\"provincia\",X103=\"48hrs\"),2,NETWORKDAYS.INTL(D103,M103,11,'Dias Feriados'!$A$1:$A$15))))","v":-39255}]
["B001667605","May","2025-05-27","2025-05-28","G/I. 030-10132",103,"ROSARIO FELICITA GARCIA FLORES","ASOCIACION HILDA SALAS J 5 FRENTE AAHH LOS POLLITOS","Provincia","ICA","ICA","B001667605",null,"En Ruta",9730017239,"F",202508,203201,"En Ruta","Dia 1","CARMEL","PROVINCIA",{"$f":"NETWORKDAYS.INTL(D104,M104,11,'Dias Feriados'!$A$1:$A$15)","v":-39255},"En Ruta",22,"NO",null,0.9375,0.94722222222222219,1,"CRUCES CHO","2025-05-28",null,null,45804,"",{"$f":"IF(AS104=\"Devuelto\",\"\",IF(X104=\"24hrs\",\"Entregado\",CONSOLIDADO!S104))","v":"En Ruta"},"",{"$f":"IF(AK104=\"Entregado\",\"\",IF(X104=\"24hrs\",\"\",IF(X104=\"48hrs\",\"Entregado\",CONSOLIDADO!S104)))","v":"En Ruta"},"",{"$f":"IF(AK104=\"Entregado\",\"\",IF(OR(X104=\"24hrs\",X104=\"48hrs\"),\"\",IF(X104=\"72hrs\",\"Entregado\",CONSOLIDADO!S104)))","v":"En Ruta"},"",{"$f":"IF(AK104=\"Entregado\",\"\",IF(OR(X104=\"24hrs\",X104=\"48hrs\",X104=\"72hrs\"),\"\",IF(X104=\"+72hrs\",\"Entregado\",CONSOLIDADO!S104)))","v":"En Ruta"},"","En Ruta",1,0,0,0,0,1,0,"No Entregado",0,0,1,0,{"$f":"IF(V104=\"Lima\",NETWORKDAYS.INTL(D104,M104,11,'Dias Feriados'!$A$1:$A$15),IF(AND(V104=\"provincia\",X104=\"24hrs\"),1,IF(AND(V104=\"provincia\",X104=\"48hrs\"),2,NETWORKDAYS.INTL(D104,M104,11,'Dias Feriados'!$A$1:$A$15))))","v":-39255}]
["B001667700","May","2025-05-27","2025-05-28","G/I. 030-10132",104,"NORA MARIA MITMA ESPINOZA","CALLE PEDRO ORTIZ TALLA E234 FRENTE AL HOSTAL CAMPO ALEGRE","Provincia","ICA","ICA","B001667700",null,"En Ruta",9730017244,"F",202508,203201,"En Ruta","Dia 1","CARMEL","PROVINCIA",{"$f":"NETWORKDAYS.INTL(D105,M105,11,'Dias Feriados'!$A$1:$A$15)","v":-39255},"En Ruta",22,"NO",null,0.9375,0.94722222222222219,1,"CRUCES CHO","2025-05-28",null,null,45804,"",{"$f":"IF(AS105=\"Devuelto\",\"\",IF(X105=\"24hrs\",\"Entregado\",CONSOLIDADO!S105))","v":"En Ruta"},"",{"$f":"IF(AK105=\"Entregado\",\"\",IF(X105=\"24hrs\",\"\",IF(X105=\"48hrs\",\"Entregado\",CONSOLIDADO!S105)))","v":"En Ruta"},"",{"$f":"IF(AK105=\"Entregado\",\"\",IF(OR(X105=\"24hrs\",X105=\"48hrs\"),\"\",IF(X105=\"72hrs\",\"Entregado\",CONSOLIDADO!S105)))","v":"En Ruta"},"",{"$f":"IF(AK105=\"Entregado\",\"\",IF(OR(X105=\"24hrs\",X105=\"48hrs\",X105=\"72hrs\"),\"\",IF(X105=\"+72hrs\",\"Entregado\",CONSOLIDADO!S105)))","v":"En Ruta"},"","En Ruta",1,0,0,0,0,1,0,"No Entregado",0,0,1,0,{"$f":"IF(V105=\"Lima\",NETWORKDAYS.INTL(D105,M105,11,'Dias Feriados'!$A$1:$A$15),IF(AND(V105=\"provincia\",X105=\"24hrs\"),1,IF(AND(V105=\"provincia\",X105=\"48hrs\"),2,NETWORKDAYS.INTL(D105,M105,11,'Dias Feriados'!$A$1:$A$15))))","v":-39255}]
["B001667670","May","2025-05-27","2025-05-28","G/I. 030-10132",105,"ROSA MARLENI RAFAEL GAMBOA","CL PEDRO CARLOS OLAECHEA 150 A UNA CDRA DE AV SALAVD MANZANILLA","Provincia","ICA","ICA","B001667670",null,"En Ruta",9730017250,"F",202508,203201,"En Ruta","Dia 1","CARMEL","PROVINCIA",{"$f":"NETWORKDAYS.INTL(D106,M106,11,'Dias Feriados'!$A$1:$A$15)","v":-39255},"En Ruta",22,"NO",null,0.9375,0.94722222222222219,1,"CRUCES CHO","2025-05-28",null,null,45804,"",{"$f":"IF(AS106=\"Devuelto\",\"\",IF(X106=\"24hrs\",\"Entregado\",CONSOLIDADO!S106))","v":"En Ruta"},"",{"$f":"IF(AK106=\"Entregado\",\"\",IF(X106=\"24hrs\",\"\",IF(X106=\"48hrs\",\"Entregado\",CONSOLIDADO!S106)))","v":"En Ruta"},"",{"$f":"IF(AK106=\"Entregado\",\"\",IF(OR(X106=\"24hrs\",X106=\"48hrs\"),\"\",IF(X106=\"72hrs\",\"Entregado\",CONSOLIDADO!S106)))","v":"En Ruta"},"",{"$f":"IF(AK106=\"Entregado\",\"\",IF(OR(X106=\"24hrs\",X106=\"48hrs\",X106=\"72hrs\"),\"\",IF(X106=\"+72hrs\",\"Entregado\",CONSOLIDADO!S106)))","v":"En Ruta"},"","En Ruta",1,0,0,0,0,1,0,"No Entregado",0,0,1,0,{"$f":"IF(V106=\"Lima\",NETWORKDAYS.INTL(D106,M106,11,'Dias Feriados'!$A$1:$A$15),IF(AND(V106=\"provincia\",X106=\"24hrs\"),1,IF(AND(V106=\"provincia\",X106=\"48hrs\"),2,NETWORKDAYS.INTL(D106,M106,11,'Dias Feriados'!$A$1:$A$15))))","v":-39255}]
["B001667517","May","2025-05-27","2025-05-28","G/I. 030-10132",106,"FLOR DE MARIA HARVEY ORMENO","CALLE PAITA 248 CENTRO POR 2 DE MAYO","Provincia","ICA","ICA","B001667517",null,"En Ruta",9730017251,"F",202508,203201,"En Ruta","Dia 1","CARMEL","PROVINCIA",{"$f":"NETWORKDAYS.INTL(D107,M107,11,'Dias Feriados'!$A$1:$A$15)","v":-39255},"En Ruta",22,"NO",null,0.9375,0.94722222222222219,1,"CRUCES CHO","2025-05-28",null,null,45804,"",{"$f":"IF(AS107=\"Devuelto\",\"\",IF(X107=\"24hrs\",\"Entregado\",CONSOLIDADO!S107))","v":"En Ruta"},"",{"$f":"IF(AK107=\"Entregado\",\"\",IF(X107=\"24hrs\",\"\",IF(X107=\"48hrs\",\"Entregado\",CONSOLIDADO!S107)))","v":"En Ruta"},"",{"$f":"IF(AK107=\"Entregado\",\"\",IF(OR(X107=\"24hrs\",X107=\"48hrs\"),\"\",IF(X107=\"72hrs\",\"Entregado\",CONSOLIDADO!S107)))","v":"En Ruta"},"",{"$f":"IF(AK107=\"Entregado\",\"\",IF(OR(X107=\"24hrs\",X107=\"48hrs\",X107=\"72hrs\"),\"\",IF(X107=\"+72hrs\",\"Entregado\",CONSOLIDADO!S107)))","v":"En Ruta"},"","En Ruta",1,0,0,0,0,1,0,"No Entregado",0,0,1,0,{"$f":"IF(V107=\"Lima\",NETWORKDAYS.INTL(D107,M107,11,'Dias Feriados'!$A$1:$A$15),IF(AND(V107=\"provincia\",X107=\"24hrs\"),1,IF(AND(V107=\"provincia\",X107=\"48hrs\"),2,NETWORKDAYS.INTL(D107,M107,11,'Dias Feriados'!$A$1:$A$15))))","v":-39255}]
["B001667436","May","2025-05-27","2025-05-28","G/I. 030-10132",107,"JULIA YSABEL VEGA ARONES","VILLA EL PERIODISTA MZ A LT 9 POR EL COLISEO CERRADO VILLA EL PERIODISTA","Provincia","ICA","ICA","B001667436",null,"En Ruta",9730017254,"F",202508,203201,"En Ruta","Dia 1","CARMEL","PROVINCIA",{"$f":"NETWORKDAYS.INTL(D108,M108,11,'Dias Feriados'!$A$1:$A$15)","v":-39255},"En Ruta",22,"NO",null,0.9375,0.94722222222222219,1,"CRUCES CHO","2025-05-28",null,null,45804,"",{"$f":"IF(AS108=\"Devuelto\",\"\",IF(X108=\"24hrs\",\"Entregado\",CONSOLIDADO!S108))","v":"En Ruta"},"",{"$f":"IF(AK108=\"Entregado\",\"\",IF(X108=\"24hrs\",\"\",IF(X108=\"48hrs\",\"Entregado\",CONSOLIDADO!S108)))","v":"En Ruta"},"",{"$f":"IF(AK108=\"Entregado\",\"\",IF(OR(X108=\"24hrs\",X108=\"48hrs\"),\"\",IF(X108=\"72hrs\",\"Entregado\",CONSOLIDADO!S108)))","v":"En Ruta"},"",{"$f":"IF(AK108=\"Entregado\",\"\",IF(OR(X108=\"24hrs\",X108=\"48hrs\",X108=\"72hrs\"),\"\",IF(X108=\"+72hrs\",\"Entregado\",CONSOLIDADO!S108)))","v":"En Ruta"},"","En Ruta",1,0,0,0,0,1,0,"No Entregado",0,0,1,0,{"$f":"IF(V108=\"Lima\",NETWORKDAYS.INTL(D108,M108,11,'Dias Feriados'!$A$1:$A$15),IF(AND(V108=\"provincia\",X108=\"24hrs\"),1,IF(AND(V108=\"provincia\",X108=\"48hrs\"),2,NETWORKDAYS.INTL(D108,M108,11,'Dias Feriados'!$A$1:$A$15))))","v":-39255}]
["B001667331","May","2025-05-27","2025-05-28","G/I. 030-10132",108,"LUZ VIRGINIA VENTURA ASTOCAZA","SAN JUAQUIN EL HUALLABO I LT 2 COLISEO DE GALLOS","Provincia","ICA","ICA","B001667331",null,"En Ruta",9730017255,"F",202508,203201,"En Ruta","Dia 1","CARMEL","PROVINCIA",{"$f":"NETWORKDAYS.INTL(D109,M109,11,'Dias Feriados'!$A$1:$A$15)","v":-39255},"En Ruta",22,"NO",null,0.9375,0.94722222222222219,1,"CRUCES CHO","2025-05-28",null,null,45804,"",{"$f":"IF(AS109=\"Devuelto\",\"\",IF(X109=\"24hrs\",\"Entregado\",CONSOLIDADO!S109))","v":"En Ruta"},"",{"$f":"IF(AK109=\"Entregado\",\"\",IF(X109=\"24hrs\",\"\",IF(X109=\"48hrs\",\"Entregado\",CONSOLIDADO!S109)))","v":"En Ruta"},"",{"$f":"IF(AK109=\"Entregado\",\"\",IF(OR(X109=\"24hrs\",X109=\"48hrs\"),\"\",IF(X109=\"72hrs\",\"Entregado\",CONSOLIDADO!S109)))","v":"En Ruta"},"",{"$f":"IF(AK109=\"Entregado\",\"\",IF(OR(X109=\"24hrs\",X109=\"48hrs\",X109=\"72hrs\"),\"\",IF(X109=\"+72hrs\",\"Entregado\",CONSOLIDADO!S109)))","v":"En Ruta"},"","En Ruta",1,0,0,0,0,1,0,"No Entregado",0,0,1,0,{"$f":"IF(V109=\"Lima\",NETWORKDAYS.INTL(D109,M109,11,'Dias Feriados'!$A$1:$A$15),IF(AND(V109=\"provincia\",X109=\"24hrs\"),1,IF(AND(V109=\"provincia\",X109=\"48hrs\"),2,NETWORKDAYS.INTL(D109,M109,11,'Dias Feriados'!$A$1:$A$15))))","v":-39255}]
["B001667559","May","2025-05-27","2025-05-28","G/I. 030-10132",109,"PASCUALA ANITA SIGUAS HUAYTA","AAHH LAS DUNAS A 14 FRENTE AL HOTEL CARMELO","Provincia","ICA","ICA","B001667559",null,"En Ruta",9730017256,"F",202508,203201,"En Ruta","Dia 1","CARMEL","PROVINCIA",{"$f":"NETWORKDAYS.INTL(D110,M110,11,'Dias Feriados'!$A$1:$A$15)","v":-39255},"En Ruta",22,"NO",null,0.9375,0.94722222222222219,1,"CRUCES CHO","2025-05-28",null,null,45804,"",{"$f":"IF(AS110=\"Devuelto\",\"\",IF(X110=\"24hrs\",\"Entregado\",CONSOLIDADO!S110))","v":"En Ruta"},"",{"$f":"IF(AK110=\"Entregado\",\"\",IF(X110=\"24hrs\",\"\",IF(X110=\"48hrs\",\"Entregado\",CONSOLIDADO!S110)))","v":"En Ruta"},"",{"$f":"IF(AK110=\"Entregado\",\"\",IF(OR(X110=\"24hrs\",X110=\"48hrs\"),\"\",IF(X110=\"72hrs\",\"Entregado\",CONSOLIDADO!S110)))","v":"En Ruta"},"",{"$f":"IF(AK110=\"Entregado\",\"\",IF(OR(X110=\"24hrs\",X110=\"48hrs\",X110=\"72hrs\"),\"\",IF(X110=\"+72hrs\",\"Entregado\",CONSOLIDADO!S110)))","v":"En Ruta"},"","En Ruta",1,0,0,0,0,1,0,"No Entregado",0,0,1,0,{"$f":"IF(V110=\"Lima\",NETWORKDAYS.INTL(D110,M110,11,'Dias Feriados'!$A$1:$A$15),IF(AND(V110=\"provincia\",X110=\"24hrs\"),1,IF(AND(V110=\"provincia\",X110=\"48hrs\"),2,NETWORKDAYS.INTL(D110,M110,11,'Dias Feriados'!$A$1:$A$15))))","v":-39255}]
["B001667350","May","2025-05-27","2025-05-28","G/I. 030-10132",110,"DIANA VICTORIA RAMOS VALENCIA","VIEJO PSJ EL AMOR PUERTA 214 SAN JOAQUIN","Provincia","ICA","ICA","B001667350",null,"En Ruta",9730017260,"F",202508,203201,"En Ruta","Dia 1","CARMEL","PROVINCIA",{"$f":"NETWORKDAYS.INTL(D111,M111,11,'Dias Feriados'!$A$1:$A$15)","v":-39255},"En Ruta",22,"NO",null,0.9375,0.94722222222222219,1,"CRUCES CHO","2025-05-28",null,null,45804,"",{"$f":"IF(AS111=\"Devuelto\",\"\",IF(X111=\"24hrs\",\"Entregado\",CONSOLIDADO!S111))","v":"En Ruta"},"",{"$f":"IF(AK111=\"Entregado\",\"\",IF(X111=\"24hrs\",\"\",IF(X111=\"48hrs\",\"Entregado\",CONSOLIDADO!S111)))","v":"En Ruta"},"",{"$f":"IF(AK111=\"Entregado\",\"\",IF(OR(X111=\"24hrs\",X111=\"48hrs\"),\"\",IF(X111=\"72hrs\",\"Entregado\",CONSOLIDADO!S111)))","v":"En Ruta"},"",{"$f":"IF(AK111=\"Entregado\",\"\",IF(OR(X111=\"24hrs\",X111=\"48hrs\",X111=\"72hrs\"),\"\",IF(X111=\"+72hrs\",\"Entregado\",CONSOLIDADO!S111)))","v":"En Ruta"},"","En Ruta",1,0,0,0,0,1,0,"No Entregado",0,0,1,0,{"$f":"IF(V111=\"Lima\",NETWORKDAYS.INTL(D111,M111,11,'Dias Feriados'!$A$1:$A$15),IF(AND(V111=\"provincia\",X111=\"24hrs\"),1,IF(AND(V111=\"provincia\",X111=\"48hrs\"),2,NETWORKDAYS.INTL(D111,M111,11,'Dias Feriados'!$A$1:$A$15))))","v":-39255}]
["B001667449","May","2025-05-27","2025-05-28","G/I. 030-10132",111,"JENNY LILIANA AQUIJE OROSCO","PASAJE LOS JUAREZ 420 COMTRANA CLG JOSE OLAYA COMTRANA DERECHA 3 CDRAS","Provincia","ICA","ICA","B001667449",null,"En Ruta",9730017261,"F",202508,203201,"En Ruta","Dia 1","CARMEL","PROVINCIA",{"$f":"NETWORKDAYS.INTL(D112,M112,11,'Dias Feriados'!$A$1:$A$15)","v":-39255},"En Ruta",22,"NO",null,0.9375,0.94722222222222219,1,"CRUCES CHO","2025-05-28",null,null,45804,"",{"$f":"IF(AS112=\"Devuelto\",\"\",IF(X112=\"24hrs\",\"Entregado\",CONSOLIDADO!S112))","v":"En Ruta"},"",{"$f":"IF(AK112=\"Entregado\",\"\",IF(X112=\"24hrs\",\"\",IF(X112=\"48hrs\",\"Entregado\",CONSOLIDADO!S112)))","v":"En Ruta"},"",{"$f":"IF(AK112=\"Entregado\",\"\",IF(OR(X112=\"24hrs\",X112=\"48hrs\"),\"\",IF(X112=\"72hrs\",\"Entregado\",CONSOLIDADO!S112)))","v":"En Ruta"},"",{"$f":"IF(AK112=\"Entregado\",\"\",IF(OR(X112=\"24hrs\",X112=\"48hrs\",X112=\"72hrs\"),\"\",IF(X112=\"+72hrs\",\"Entregado\",CONSOLIDADO!S112)))","v":"En Ruta"},"","En Ruta",1,0,0,0,0,1,0,"No Entregado",0,0,1,0,{"$f":"IF(V112=\"Lima\",NETWORKDAYS.INTL(D112,M112,11,'Dias Feriados'!$A$1:$A$15),IF(AND(V112=\"provincia\",X112=\"24hrs\"),1,IF(AND(V112=\"provincia\",X112=\"48hrs\"),2,NETWORKDAYS.INTL(D112,M112,11,'Dias Feriados'!$A$1:$A$15))))","v":-39255}]
["B001667429","May","2025-05-27","2025-05-28","G/I. 030-10132",112,"CLEILA ISABEL GUERRA GAMBOA","URB SAN JOAQUIN P46 PRIMERA ET TERMINANDO EL COLEGIO JULIO C TELLO","Provincia","ICA","ICA","B001667429",null,"En Ruta",9730017262,"F",202508,203201,"En Ruta","Dia 1","CARMEL","PROVINCIA",{"$f":"NETWORKDAYS.INTL(D113,M113,11,'Dias Feriados'!$A$1:$A$15)","v":-39255},"En Ruta",22,"NO",null,0.9375,0.94722222222222219,1,"CRUCES CHO","2025-05-28",null,null,45804,"",{"$f":"IF(AS113=\"Devuelto\",\"\",IF(X113=\"24hrs\",\"Entregado\",CONSOLIDADO!S113))","v":"En Ruta"},"",{"$f":"IF(AK113=\"Entregado\",\"\",IF(X113=\"24hrs\",\"\",IF(X113=\"48hrs\",\"Entregado\",CONSOLIDADO!S113)))","v":"En Ruta"},"",{"$f":"IF(AK113=\"Entregado\",\"\",IF(OR(X113=\"24hrs\",X113=\"48hrs\"),\"\",IF(X113=\"72hrs\",\"Entregado\",CONSOLIDADO!S113)))","v":"En Ruta"},"",{"$f":"IF(AK113=\"Entregado\",\"\",IF(OR(X113=\"24hrs\",X113=\"48hrs\",X113=\"72hrs\"),\"\",IF(X113=\"+72hrs\",\"Entregado\",CONSOLIDADO!S113)))","v":"En Ruta"},"","En Ruta",1,0,0,0,0,1,0,"No Entregado",0,0,1,0,{"$f":"IF(V113=\"Lima\",NETWORKDAYS.INTL(D113,M113,11,'Dias Feriados'!$A$1:$A$15),IF(AND(V113=\"provincia\",X113=\"24hrs\"),1,IF(AND(V113=\"provincia\",X113=\"48hrs\"),2,NETWORKDAYS.INTL(D113,M113,11,'Dias Feriados'!$A$1:$A$15))))","v":-39255}]
["B001667748","May","2025-05-27","2025-05-28","G/I. 030-10132",113,"GIRVERT ANTHONY MIER Y TERAN","HILDA SALAS MZ J LT 5 ENTRADA CACHICHE FRENTE A LOS POLLITOS ASOC VIVIENDA HILDA SALAS","Provincia","ICA","ICA","B001667748",null,"En Ruta",9730017271,"F",202508,203201,"En Ruta","Dia 1","CARMEL","PROVINCIA",{"$f":"NETWORKDAYS.INTL(D114,M114,11,'Dias Feriados'!$A$1:$A$15)","v":-39255},"En Ruta",22,"NO",null,0.9375,0.94722222222222219,1,"CRUCES CHO","2025-05-28",null,null,45804,"",{"$f":"IF(AS114=\"Devuelto\",\"\",IF(X114=\"24hrs\",\"Entregado\",CONSOLIDADO!S114))","v":"En Ruta"},"",{"$f":"IF(AK114=\"Entregado\",\"\",IF(X114=\"24hrs\",\"\",IF(X114=\"48hrs\",\"Entregado\",CONSOLIDADO!S114)))","v":"En Ruta"},"",{"$f":"IF(AK114=\"Entregado\",\"\",IF(OR(X114=\"24hrs\",X114=\"48hrs\"),\"\",IF(X114=\"72hrs\",\"Entregado\",CONSOLIDADO!S114)))","v":"En Ruta"},"",{"$f":"IF(AK114=\"Entregado\",\"\",IF(OR(X114=\"24hrs\",X114=\"48hrs\",X114=\"72hrs\"),\"\",IF(X114=\"+72hrs\",\"Entregado\",CONSOLIDADO!S114)))","v":"En Ruta"},"","En Ruta",1,0,0,0,0,1,0,"No Entregado",0,0,1,0,{"$f":"IF(V114=\"Lima\",NETWORKDAYS.INTL(D114,M114,11,'Dias Feriados'!$A$1:$A$15),IF(AND(V114=\"provincia\",X114=\"24hrs\"),1,IF(AND(V114=\"provincia\",X114=\"48hrs\"),2,NETWORKDAYS.INTL(D114,M114,11,'Dias Feriados'!$A$1:$A$15))))","v":-39255}]
["B001667355","May","2025-05-27","2025-05-28","G/I. 030-10132",114,"ANA YSABEL CABRERA CACERES","LA MAR INTERIOR 2 442 ENTRE CALLE LA MAR Y HUANCAVELICA","Provincia","ICA","ICA","B001667355","2025-05-28","Entregado",9730017272,"F",202508,203201,"Entregado","Dia 1","CARMEL","PROVINCIA",{"$f":"NETWORKDAYS.INTL(D115,M115,11,'Dias Feriados'!$A$1:$A$15)","v":1},"24hrs",22,"NO",null,0.9375,0.94722222222222219,1,"CRUCES CHO","2025-05-28",null,null,45804,45805,{"$f":"IF(AS115=\"Devuelto\",\"\",IF(X115=\"24hrs\",\"Entregado\",CONSOLIDADO!S115))","v":"Entregado"},"",{"$f":"IF(AK115=\"Entregado\",\"\",IF(X115=\"24hrs\",\"\",IF(X115=\"48hrs\",\"Entregado\",CONSOLIDADO!S115)))","v":""},"",{"$f":"IF(AK115=\"Entregado\",\"\",IF(OR(X115=\"24hrs\",X115=\"48hrs\"),\"\",IF(X115=\"72hrs\",\"Entregado\",CONSOLIDADO!S115)))","v":""},"",{"$f":"IF(AK115=\"Entregado\",\"\",IF(OR(X115=\"24hrs\",X115=\"48hrs\",X115=\"72hrs\"),\"\",IF(X115=\"+72hrs\",\"Entregado\",CONSOLIDADO!S115)))","v":""},45805,"Entregado",1,1,0,0,0,0,0,"A Tiempo",1,0,0,0,{"$f":"IF(V115=\"Lima\",NETWORKDAYS.INTL(D115,M115,11,'Dias Feriados'!$A$1:$A$15),IF(AND(V115=\"provincia\",X115=\"24hrs\"),1,IF(AND(V115=\"provincia\",X115=\"48hrs\"),2,NETWORKDAYS.INTL(D115,M115,11,'Dias Feriados'!$A$1:$A$15))))","v":1}]
["B001667540","May","2025-05-27","2025-05-28","G/I. 030-10132",115,"JACQUELINE DELCARMEN GRIMALDO","AV ACOMAYO 462 FRENTE AL BOTICA ROSA MARIA","Provincia","ICA","ICA","B001667540",null,"En Ruta",9730017273,"F",202508,203201,"En Ruta","Dia 1","CARMEL","PROVINCIA",{"$f":"NETWORKDAYS.INTL(D116,M116,11,'Dias Feriados'!$A$1:$A$15)","v":-39255},"En Ruta",22,"NO",null,0.9375,0.94722222222222219,1,"CRUCES CHO","2025-05-28",null,null,45804,"",{"$f":"IF(AS116=\"Devuelto\",\"\",IF(X116=\"24hrs\",\"Entregado\",CONSOLIDADO!S116))","v":"En Ruta"},"",{"$f":"IF(AK116=\"Entregado\",\"\",IF(X116=\"24hrs\",\"\",IF(X116=\"48hrs\",\"Entregado\",CONSOLIDADO!S116)))","v":"En Ruta"},"",{"$f":"IF(AK116=\"Entregado\",\"\",IF(OR(X116=\"24hrs\",X116=\"48hrs\"),\"\",IF(X116=\"72hrs\",\"Entregado\",CONSOLIDADO!S116)))","v":"En Ruta"},"",{"$f":"IF(AK116=\"Entregado\",\"\",IF(OR(X116=\"24hrs\",X116=\"48hrs\",X116=\"72hrs\"),\"\",IF(X116=\"+72hrs\",\"Entregado\",CONSOLIDADO!S116)))","v":"En Ruta"},"","En Ruta",1,0,0,0,0,1,0,"No Entregado",0,0,1,0,{"$f":"IF(V116=\"Lima\",NETWORKDAYS.INTL(D116,M116,11,'Dias Feriados'!$A$1:$A$15),IF(AND(V116=\"provincia\",X116=\"24hrs\"),1,IF(AND(V116=\"provincia\",X116=\"48hrs\"),2,NETWORKDAYS.INTL(D116,M116,11,'Dias Feriados'!$A$1:$A$15))))","v":-39255}]
["B001667420","May","2025-05-27","2025-05-28","G/I. 030-10132",116,"MARIA GEORGINA FLORES CORDERO","URB GUERTOS DE SAN JOSE C15 CL QUEBRANTA ENFRENTE CENTRO COMERCIAL MEGAPLAZA","Provincia","ICA","ICA","B001667420",null,"En Ruta",9730017277,"F",202508,203201,"En Ruta","Dia 1","CARMEL","PROVINCIA",{"$f":"NETWORKDAYS.INTL(D117,M117,11,'Dias Feriados'!$A$1:$A$15)","v":-39255},"En Ruta",22,"NO",null,0.9375,0.94722222222222219,1,"CRUCES CHO","2025-05-28",null,null,45804,"",{"$f":"IF(AS117=\"Devuelto\",\"\",IF(X117=\"24hrs\",\"Entregado\",CONSOLIDADO!S117))","v":"En Ruta"},"",{"$f":"IF(AK117=\"Entregado\",\"\",IF(X117=\"24hrs\",\"\",IF(X117=\"48hrs\",\"Entregado\",CONSOLIDADO!S117)))","v":"En Ruta"},"",{"$f":"IF(AK117=\"Entregado\",\"\",IF(OR(X117=\"24hrs\",X117=\"48hrs\"),\"\",IF(X117=\"72hrs\",\"Entregado\",CONSOLIDADO!S117)))","v":"En Ruta"},"",{"$f":"IF(AK117=\"Entregado\",\"\",IF(OR(X117=\"24hrs\",X117=\"48hrs\",X117=\"72hrs\"),\"\",IF(X117=\"+72hrs\",\"Entregado\",CONSOLIDADO!S117)))","v":"En Ruta"},"","En Ruta",1,0,0,0,0,1,0,"No Entregado",0,0,1,0,{"$f":"IF(V117=\"Lima\",NETWORKDAYS.INTL(D117,M117,11,'Dias Feriados'!$A$1:$A$15),IF(AND(V117=\"provincia\",X117=\"24hrs\"),1,IF(AND(V117=\"provincia\",X117=\"48hrs\"),2,NETWORKDAYS.INTL(D117,M117,11,'Dias Feriados'!$A$1:$A$15))))","v":-39255}]
["B001667472","May","2025-05-27","2025-05-28","G/I. 030-10132",117,"ELIZA GABRIELA RODRIGUEZ RIOS","URB SAN JOAQUIN 3 ETAPA O14 OLINDA MALDONADO","Provincia","ICA","ICA","B001667472",null,"En Ruta",9730017278,"F",202508,203201,"En Ruta","Dia 1","CARMEL","PROVINCIA",{"$f":"NETWORKDAYS.INTL(D118,M118,11,'Dias Feriados'!$A$1:$A$15)","v":-39255},"En Ruta",22,"NO",null,0.9375,0.94722222222222219,1,"CRUCES CHO","2025-05-28",null,null,45804,"",{"$f":"IF(AS118=\"Devuelto\",\"\",IF(X118=\"24hrs\",\"Entregado\",CONSOLIDADO!S118))","v":"En Ruta"},"",{"$f":"IF(AK118=\"Entregado\",\"\",IF(X118=\"24hrs\",\"\",IF(X118=\"48hrs\",\"Entregado\",CONSOLIDADO!S118)))","v":"En Ruta"},"",{"$f":"IF(AK118=\"Entregado\",\"\",IF(OR(X118=\"24hrs\",X118=\"48hrs\"),\"\",IF(X118=\"72hrs\",\"Entregado\",CONSOLIDADO!S118)))","v":"En Ruta"},"",{"$f":"IF(AK118=\"Entregado\",\"\",IF(OR(X118=\"24hrs\",X118=\"48hrs\",X118=\"72hrs\"),\"\",IF(X118=\"+72hrs\",\"Entregado\",CONSOLIDADO!S118)))","v":"En Ruta"},"","En Ruta",1,0,0,0,0,1,0,"No Entregado",0,0,1,0,{"$f":"IF(V118=\"Lima\",NETWORKDAYS.INTL(D118,M118,11,'Dias Feriados'!$A$1:$A$15),IF(AND(V118=\"provincia\",X118=\"24hrs\"),1,IF(AND(V118=\"provincia\",X118=\"48hrs\"),2,NETWORKDAYS.INTL(D118,M118,11,'Dias Feriados'!$A$1:$A$15))))","v":-39255}]
["B001667576","May","2025-05-27","2025-05-28","G/I. 030-10132",118,"GISELLA PILAR ORMENO MALLMA","AAHH JESUS DE NAZARETH MZ A LT 4 PLANTA DE GAS","Provincia","ICA","ICA","B001667576",null,"En Ruta",9730017286,"F",202508,203201,"En Ruta","Dia 1","CARMEL","PROVINCIA",{"$f":"NETWORKDAYS.INTL(D119,M119,11,'Dias Feriados'!$A$1:$A$15)","v":-39255},"En Ruta",22,"NO",null,0.9375,0.94722222222222219,1,"CRUCES CHO","2025-05-28",null,null,45804,"",{"$f":"IF(AS119=\"Devuelto\",\"\",IF(X119=\"24hrs\",\"Entregado\",CONSOLIDADO!S119))","v":"En Ruta"},"",{"$f":"IF(AK119=\"Entregado\",\"\",IF(X119=\"24hrs\",\"\",IF(X119=\"48hrs\",\"Entregado\",CONSOLIDADO!S119)))","v":"En Ruta"},"",{"$f":"IF(AK119=\"Entregado\",\"\",IF(OR(X119=\"24hrs\",X119=\"48hrs\"),\"\",IF(X119=\"72hrs\",\"Entregado\",CONSOLIDADO!S119)))","v":"En Ruta"},"",{"$f":"IF(AK119=\"Entregado\",\"\",IF(OR(X119=\"24hrs\",X119=\"48hrs\",X119=\"72hrs\"),\"\",IF(X119=\"+72hrs\",\"Entregado\",CONSOLIDADO!S119)))","v":"En Ruta"},"","En Ruta",1,0,0,0,0,1,0,"No Entregado",0,0,1,0,{"$f":"IF(V119=\"Lima\",NETWORKDAYS.INTL(D119,M119,11,'Dias Feriados'!$A$1:$A$15),IF(AND(V119=\"provincia\",X119=\"24hrs\"),1,IF(AND(V119=\"provincia\",X119=\"48hrs\"),2,NETWORKDAYS.INTL(D119,M119,11,'Dias Feriados'!$A$1:$A$15))))","v":-39255}]
["B001667639","May","2025-05-27","2025-05-28","G/I. 030-10132",119,"SANDY THALIA GARAVITO YAURICAS","AYACUCHO GALERIA ICA TOP PLAZA STAND 7 129 COSTADO DEL BANCO INTERBANK","Provincia","ICA","ICA","B001667639",null,"En Ruta",9730017294,"F",202508,203201,"En Ruta","Dia 1","CARMEL","PROVINCIA",{"$f":"NETWORKDAYS.INTL(D120,M120,11,'Dias Feriados'!$A$1:$A$15)","v":-39255},"En Ruta",22,"NO",null,0.9375,0.94722222222222219,1,"CRUCES CHO","2025-05-28",null,null,45804,"",{"$f":"IF(AS120=\"Devuelto\",\"\",IF(X120=\"24hrs\",\"Entregado\",CONSOLIDADO!S120))","v":"En Ruta"},"",{"$f":"IF(AK120=\"Entregado\",\"\",IF(X120=\"24hrs\",\"\",IF(X120=\"48hrs\",\"Entregado\",CONSOLIDADO!S120)))","v":"En Ruta"},"",{"$f":"IF(AK120=\"Entregado\",\"\",IF(OR(X120=\"24hrs\",X120=\"48hrs\"),\"\",IF(X120=\"72hrs\",\"Entregado\",CONSOLIDADO!S120)))","v":"En Ruta"},"",{"$f":"IF(AK120=\"Entregado\",\"\",IF(OR(X120=\"24hrs\",X120=\"48hrs\",X120=\"72hrs\"),\"\",IF(X120=\"+72hrs\",\"Entregado\",CONSOLIDADO!S120)))","v":"En Ruta"},"","En Ruta",1,0,0,0,0,1,0,"No Entregado",0,0,1,0,{"$f":"IF(V120=\"Lima\",NETWORKDAYS.INTL(D120,M120,11,'Dias Feriados'!$A$1:$A$15),IF(AND(V120=\"provincia\",X120=\"24hrs\"),1,IF(AND(V120=\"provincia\",X120=\"48hrs\"),2,NETWORKDAYS.INTL(D120,M120,11,'Dias Feriados'!$A$1:$A$15))))","v":-39255}]
["B001667368","May","2025-05-27","2025-05-28","G/I. 030-10132",120,"JOSSELYN YARITZA SEPULVEDAS VE","JR SAN MARTIN DE PORRAS 160 HOSPITAL SOCORRO","Provincia","ICA","ICA","B001667368",null,"En Ruta",9730017298,"F",202508,203201,"En Ruta","Dia 1","CARMEL","PROVINCIA",{"$f":"NETWORKDAYS.INTL(D121,M121,11,'Dias Feriados'!$A$1:$A$15)","v":-39255},"En Ruta",22,"NO",null,0.9375,0.94722222222222219,1,"CRUCES CHO","2025-05-28",null,null,45804,"",{"$f":"IF(AS121=\"Devuelto\",\"\",IF(X121=\"24hrs\",\"Entregado\",CONSOLIDADO!S121))","v":"En Ruta"},"",{"$f":"IF(AK121=\"Entregado\",\"\",IF(X121=\"24hrs\",\"\",IF(X121=\"48hrs\",\"Entregado\",CONSOLIDADO!S121)))","v":"En Ruta"},"",{"$f":"IF(AK121=\"Entregado\",\"\",IF(OR(X121=\"24hrs\",X121=\"48hrs\"),\"\",IF(X121=\"72hrs\",\"Entregado\",CONSOLIDADO!S121)))","v":"En Ruta"},"",{"$f":"IF(AK121=\"Entregado\",\"\",IF(OR(X121=\"24hrs\",X121=\"48hrs\",X121=\"72hrs\"),\"\",IF(X121=\"+72hrs\",\"Entregado\",CONSOLIDADO!S121)))","v":"En Ruta"},"","En Ruta",1,0,0,0,0,1,0,"No Entregado",0,0,1,0,{"$f":"IF(V121=\"Lima\",NETWORKDAYS.INTL(D121,M121,11,'Dias Feriados'!$A$1:$A$15),IF(AND(V121=\"provincia\",X121=\"24hrs\"),1,IF(AND(V121=\"provincia\",X121=\"48hrs\"),2,NETWORKDAYS.INTL(D121,M121,11,'Dias Feriados'!$A$1:$A$15))))","v":-39255}]
["B001667466","May","2025-05-27","2025-05-28","G/I. 030-10132",121,"LUZ MARIA MARTINEZ LACHY","AV MIGUEL GRAU124 POR EL PUENTE DEL RIO LA CHIRANA","Provincia","ICA","ICA","B001667466",null,"En Ruta",9730017303,"F",202508,203201,"En Ruta","Dia 1","CARMEL","PROVINCIA",{"$f":"NETWORKDAYS.INTL(D122,M122,11,'Dias Feriados'!$A$1:$A$15)","v":-39255},"En Ruta",22,"NO",null,0.9375,0.94722222222222219,1,"CRUCES CHO","2025-05-28",null,null,45804,"",{"$f":"IF(AS122=\"Devuelto\",\"\",IF(X122=\"24hrs\",\"Entregado\",CONSOLIDADO!S122))","v":"En Ruta"},"",{"$f":"IF(AK122=\"Entregado\",\"\",IF(X122=\"24hrs\",\"\",IF(X122=\"48hrs\",\"Entregado\",CONSOLIDADO!S122)))","v":"En Ruta"},"",{"$f":"IF(AK122=\"Entregado\",\"\",IF(OR(X122=\"24hrs\",X122=\"48hrs\"),\"\",IF(X122=\"72hrs\",\"Entregado\",CONSOLIDADO!S122)))","v":"En Ruta"},"",{"$f":"IF(AK122=\"Entregado\",\"\",IF(OR(X122=\"24hrs\",X122=\"48hrs\",X122=\"72hrs\"),\"\",IF(X122=\"+72hrs\",\"Entregado\",CONSOLIDADO!S122)))","v":"En Ruta"},"","En Ruta",1,0,0,0,0,1,0,"No Entregado",0,0,1,0,{"$f":"IF(V122=\"Lima\",NETWORKDAYS.INTL(D122,M122,11,'Dias Feriados'!$A$1:$A$15),IF(AND(V122=\"provincia\",X122=\"24hrs\"),1,IF(AND(V122=\"provincia\",X122=\"48hrs\"),2,NETWORKDAYS.INTL(D122,M122,11,'Dias Feriados'!$A$1:$A$15))))","v":-39255}]
["B001667556","May","2025-05-27","2025-05-28","G/I. 030-10132",122,"LUZ HAYDEE ARCOS DONAYRE","URB VILLAS DEL SOL 1ERA ETAPA MZ G LOTE 18","Provincia","ICA","ICA","B001667556",null,"En Ruta",9730017305,"F",202508,203201,"En Ruta","Dia 1","CARMEL","PROVINCIA",{"$f":"NETWORKDAYS.INTL(D123,M123,11,'Dias Feriados'!$A$1:$A$15)","v":-39255},"En Ruta",22,"NO",null,0.9375,0.94722222222222219,1,"CRUCES CHO","2025-05-28",null,null,45804,"",{"$f":"IF(AS123=\"Devuelto\",\"\",IF(X123=\"24hrs\",\"Entregado\",CONSOLIDADO!S123))","v":"En Ruta"},"",{"$f":"IF(AK123=\"Entregado\",\"\",IF(X123=\"24hrs\",\"\",IF(X123=\"48hrs\",\"Entregado\",CONSOLIDADO!S123)))","v":"En Ruta"},"",{"$f":"IF(AK123=\"Entregado\",\"\",IF(OR(X123=\"24hrs\",X123=\"48hrs\"),\"\",IF(X123=\"72hrs\",\"Entregado\",CONSOLIDADO!S123)))","v":"En Ruta"},"",{"$f":"IF(AK123=\"Entregado\",\"\",IF(OR(X123=\"24hrs\",X123=\"48hrs\",X123=\"72hrs\"),\"\",IF(X123=\"+72hrs\",\"Entregado\",CONSOLIDADO!S123)))","v":"En Ruta"},"","En Ruta",1,0,0,0,0,1,0,"No Entregado",0,0,1,0,{"$f":"IF(V123=\"Lima\",NETWORKDAYS.INTL(D123,M123,11,'Dias Feriados'!$A$1:$A$15),IF(AND(V123=\"provincia\",X123=\"24hrs\"),1,IF(AND(V123=\"provincia\",X123=\"48hrs\"),2,NETWORKDAYS.INTL(D123,M123,11,'Dias Feriados'!$A$1:$A$15))))","v":-39255}]
["B001667770","May","2025-05-27","2025-05-28","G/I. 030-10132",123,"MILAGROS MELCHORITA CARDENAS G","URB EL REMANSO DE LA FLORIDA A 10 SUBTANJALLA ICA POR ENTRADA DE MIAMI BEACH EL 1ER CONDOMINIO CERRADO","Provincia","ICA","ICA","B001667770",null,"En Ruta",9730017307,"F",202508,203201,"En Ruta","Dia 1","CARMEL","PROVINCIA",{"$f":"NETWORKDAYS.INTL(D124,M124,11,'Dias Feriados'!$A$1:$A$15)","v":-39255},"En Ruta",22,"NO",null,0.9375,0.94722222222222219,1,"CRUCES CHO","2025-05-28",null,null,45804,"",{"$f":"IF(AS124=\"Devuelto\",\"\",IF(X124=\"24hrs\",\"Entregado\",CONSOLIDADO!S124))","v":"En Ruta"},"",{"$f":"IF(AK124=\"Entregado\",\"\",IF(X124=\"24hrs\",\"\",IF(X124=\"48hrs\",\"Entregado\",CONSOLIDADO!S124)))","v":"En Ruta"},"",{"$f":"IF(AK124=\"Entregado\",\"\",IF(OR(X124=\"24hrs\",X124=\"48hrs\"),\"\",IF(X124=\"72hrs\",\"Entregado\",CONSOLIDADO!S124)))","v":"En Ruta"},"",{"$f":"IF(AK124=\"Entregado\",\"\",IF(OR(X124=\"24hrs\",X124=\"48hrs\",X124=\"72hrs\"),\"\",IF(X124=\"+72hrs\",\"Entregado\",CONSOLIDADO!S124)))","v":"En Ruta"},"","En Ruta",1,0,0,0,0,1,0,"No Entregado",0,0,1,0,{"$f":"IF(V124=\"Lima\",NETWORKDAYS.INTL(D124,M124,11,'Dias Feriados'!$A$1:$A$15),IF(AND(V124=\"provincia\",X124=\"24hrs\"),1,IF(AND(V124=\"provincia\",X124=\"48hrs\"),2,NETWORKDAYS.INTL(D124,M124,11,'Dias Feriados'!$A$1:$A$15))))","v":-39255}]
["B001667485","May","2025-05-27","2025-05-28","G/I. 030-10132",124,"MELANIE DANAE FLORES APARCANA","AV 410 ACOMAYO","Provincia","ICA","ICA","B001667485",null,"En Ruta",9730017308,"F",202508,203201,"En Ruta","Dia 1","CARMEL","PROVINCIA",{"$f":"NETWORKDAYS.INTL(D125,M125,11,'Dias Feriados'!$A$1:$A$15)","v":-39255},"En Ruta",22,"NO",null,0.9375,0.94722222222222219,1,"CRUCES CHO","2025-05-28",null,null,45804,"",{"$f":"IF(AS125=\"Devuelto\",\"\",IF(X125=\"24hrs\",\"Entregado\",CONSOLIDADO!S125))","v":"En Ruta"},"",{"$f":"IF(AK125=\"Entregado\",\"\",IF(X125=\"24hrs\",\"\",IF(X125=\"48hrs\",\"Entregado\",CONSOLIDADO!S125)))","v":"En Ruta"},"",{"$f":"IF(AK125=\"Entregado\",\"\",IF(OR(X125=\"24hrs\",X125=\"48hrs\"),\"\",IF(X125=\"72hrs\",\"Entregado\",CONSOLIDADO!S125)))","v":"En Ruta"},"",{"$f":"IF(AK125=\"Entregado\",\"\",IF(OR(X125=\"24hrs\",X125=\"48hrs\",X125=\"72hrs\"),\"\",IF(X125=\"+72hrs\",\"Entregado\",CONSOLIDADO!S125)))","v":"En Ruta"},"","En Ruta",1,0,0,0,0,1,0,"No Entregado",0,0,1,0,{"$f":"IF(V125=\"Lima\",NETWORKDAYS.INTL(D125,M125,11,'Dias Feriados'!$A$1:$A$15),IF(AND(V125=\"provincia\",X125=\"24hrs\"),1,IF(AND(V125=\"provincia\",X125=\"48hrs\"),2,NETWORKDAYS.INTL(D125,M125,11,'Dias Feriados'!$A$1:$A$15))))","v":-39255}]
["B001667467","May","2025-05-27","2025-05-28","G/I. 030-10132",125,"YARESSI SILVIA ROCA VILLANUEVA","URB EL HARAS 0 MZ X LT 14 PASANDO CASUARINAS EL HARAS","Provincia","ICA","ICA","B001667467",null,"En Ruta",9730017317,"F",202508,203201,"En Ruta","Dia 1","CARMEL","PROVINCIA",{"$f":"NETWORKDAYS.INTL(D126,M126,11,'Dias Feriados'!$A$1:$A$15)","v":-39255},"En Ruta",22,"NO",null,0.9375,0.94722222222222219,1,"CRUCES CHO","2025-05-28",null,null,45804,"",{"$f":"IF(AS126=\"Devuelto\",\"\",IF(X126=\"24hrs\",\"Entregado\",CONSOLIDADO!S126))","v":"En Ruta"},"",{"$f":"IF(AK126=\"Entregado\",\"\",IF(X126=\"24hrs\",\"\",IF(X126=\"48hrs\",\"Entregado\",CONSOLIDADO!S126)))","v":"En Ruta"},"",{"$f":"IF(AK126=\"Entregado\",\"\",IF(OR(X126=\"24hrs\",X126=\"48hrs\"),\"\",IF(X126=\"72hrs\",\"Entregado\",CONSOLIDADO!S126)))","v":"En Ruta"},"",{"$f":"IF(AK126=\"Entregado\",\"\",IF(OR(X126=\"24hrs\",X126=\"48hrs\",X126=\"72hrs\"),\"\",IF(X126=\"+72hrs\",\"Entregado\",CONSOLIDADO!S126)))","v":"En Ruta"},"","En Ruta",1,0,0,0,0,1,0,"No Entregado",0,0,1,0,{"$f":"IF(V126=\"Lima\",NETWORKDAYS.INTL(D126,M126,11,'Dias Feriados'!$A$1:$A$15),IF(AND(V126=\"provincia\",X126=\"24hrs\"),1,IF(AND(V126=\"provincia\",X126=\"48hrs\"),2,NETWORKDAYS.INTL(D126,M126,11,'Dias Feriados'!$A$1:$A$15))))","v":-39255}]
["B001667563","May","2025-05-27","2025-05-28","G/I. 030-10132",126,"SANDY KATHARINY ACEVEDO GUERRE","CJ HAB JOSE DE LA TORRE UGARTE A 20 AL COSTADO DE LOS FARDOS","Provincia","ICA","ICA","B001667563",null,"En Ruta",9730017321,"F",202508,203201,"En Ruta","Dia 1","CARMEL","PROVINCIA",{"$f":"NETWORKDAYS.INTL(D127,M127,11,'Dias Feriados'!$A$1:$A$15)","v":-39255},"En Ruta",22,"NO",null,0.9375,0.94722222222222219,1,"CRUCES CHO","2025-05-28",null,null,45804,"",{"$f":"IF(AS127=\"Devuelto\",\"\",IF(X127=\"24hrs\",\"Entregado\",CONSOLIDADO!S127))","v":"En Ruta"},"",{"$f":"IF(AK127=\"Entregado\",\"\",IF(X127=\"24hrs\",\"\",IF(X127=\"48hrs\",\"Entregado\",CONSOLIDADO!S127)))","v":"En Ruta"},"",{"$f":"IF(AK127=\"Entregado\",\"\",IF(OR(X127=\"24hrs\",X127=\"48hrs\"),\"\",IF(X127=\"72hrs\",\"Entregado\",CONSOLIDADO!S127)))","v":"En Ruta"},"",{"$f":"IF(AK127=\"Entregado\",\"\",IF(OR(X127=\"24hrs\",X127=\"48hrs\",X127=\"72hrs\"),\"\",IF(X127=\"+72hrs\",\"Entregado\",CONSOLIDADO!S127)))","v":"En Ruta"},"","En Ruta",1,0,0,0,0,1,0,"No Entregado",0,0,1,0,{"$f":"IF(V127=\"Lima\",NETWORKDAYS.INTL(D127,M127,11,'Dias Feriados'!$A$1:$A$15),IF(AND(V127=\"provincia\",X127=\"24hrs\"),1,IF(AND(V127=\"provincia\",X127=\"48hrs\"),2,NETWORKDAYS.INTL(D127,M127,11,'Dias Feriados'!$A$1:$A$15))))","v":-39255}]
["B001667503","May","2025-05-27","2025-05-28","G/I. 030-10132",127,"SILVANA VALERIA OLIVA QUINTANA","APV TEMISTOCLES ROCHA M8 PARROQUIA PUEBLO J SENOR DE LUREN","Provincia","ICA","ICA","B001667503",null,"En Ruta",9730017322,"F",202508,203201,"En Ruta","Dia 1","CARMEL","PROVINCIA",{"$f":"NETWORKDAYS.INTL(D128,M128,11,'Dias Feriados'!$A$1:$A$15)","v":-39255},"En Ruta",22,"NO",null,0.9375,0.94722222222222219,1,"CRUCES CHO","2025-05-28",null,null,45804,"",{"$f":"IF(AS128=\"Devuelto\",\"\",IF(X128=\"24hrs\",\"Entregado\",CONSOLIDADO!S128))","v":"En Ruta"},"",{"$f":"IF(AK128=\"Entregado\",\"\",IF(X128=\"24hrs\",\"\",IF(X128=\"48hrs\",\"Entregado\",CONSOLIDADO!S128)))","v":"En Ruta"},"",{"$f":"IF(AK128=\"Entregado\",\"\",IF(OR(X128=\"24hrs\",X128=\"48hrs\"),\"\",IF(X128=\"72hrs\",\"Entregado\",CONSOLIDADO!S128)))","v":"En Ruta"},"",{"$f":"IF(AK128=\"Entregado\",\"\",IF(OR(X128=\"24hrs\",X128=\"48hrs\",X128=\"72hrs\"),\"\",IF(X128=\"+72hrs\",\"Entregado\",CONSOLIDADO!S128)))","v":"En Ruta"},"","En Ruta",1,0,0,0,0,1,0,"No Entregado",0,0,1,0,{"$f":"IF(V128=\"Lima\",NETWORKDAYS.INTL(D128,M128,11,'Dias Feriados'!$A$1:$A$15),IF(AND(V128=\"provincia\",X128=\"24hrs\"),1,IF(AND(V128=\"provincia\",X128=\"48hrs\"),2,NETWORKDAYS.INTL(D128,M128,11,'Dias Feriados'!$A$1:$A$15))))","v":-39255}]
["B001667599",{"$f":"TEXT(C129,\"mmm\")","v":"May"},"2025-05-27","2025-05-28","G/I. 030-10132",128,"RAQUEL SILVIA YALLICO FLORES","URB LAS CASUARINAS MZ A1 LT 07 ETAPA III","Provincia","ICA","ICA","B001667599",null,"En Ruta",9730017326,"F",202508,203201,"En Ruta","Dia 1","CARMEL","PROVINCIA",{"$f":"NETWORKDAYS.INTL(D129,M129,11,'Dias Feriados'!$A$1:$A$15)","v":-39255},"En Ruta",22,"NO",null,0.9375,0.94722222222222219,1,"CRUCES CHO",{"$f":"DATEVALUE(D129)","v":"2025-05-28"},null,null,{"$f":"C129","v":45804},{"$f":"IF(AK129=\"Entregado\",M129,\"\")","v":""},{"$f":"IF(AS129=\"Devuelto\",\"\",IF(X129=\"24hrs\",\"Entregado\",CONSOLIDADO!S129))","v":"En Ruta"},{"$f":"IF(AM129=\"Entregado\",M129,\"\")","v":""},{"$f":"IF(AK129=\"Entregado\",\"\",IF(X129=\"24hrs\",\"\",IF(X129=\"48hrs\",\"Entregado\",CONSOLIDADO!S129)))","v":"En Ruta"},{"$f":"IF(AO129=\"Entregado\",M129,\"\")","v":""},{"$f":"IF(AK129=\"Entregado\",\"\",IF(OR(X129=\"24hrs\",X129=\"48hrs\"),\"\",IF(X129=\"72hrs\",\"Entregado\",CONSOLIDADO!S129)))","v":"En Ruta"},{"$f":"IF(AQ129=\"Entregado\",M129,\"\")","v":""},{"$f":"IF(AK129=\"Entregado\",\"\",IF(OR(X129=\"24hrs\",X129=\"48hrs\",X129=\"72hrs\"),\"\",IF(X129=\"+72hrs\",\"Entregado\",CONSOLIDADO!S129)))","v":"En Ruta"},{"$f":"IF(M129=\"\",\"\",M129)","v":""},{"$f":"IF(AG129=\"Devuelto\",AG129,N129)","v":"En Ruta"},{"$f":"1+0","v":1},0,0,0,0,1,0,"No Entregado",0,0,1,0,{"$f":"IF(V129=\"Lima\",NETWORKDAYS.INTL(D129,M129,11,'Dias Feriados'!$A$1:$A$15),IF(AND(V129=\"provincia\",X129=\"24hrs\"),1,IF(AND(V129=\"provincia\",X129=\"48hrs\"),2,NETWORKDAYS.INTL(D129,M129,11,'Dias Feriados'!$A$1:$A$15))))","v":-39255}]
["B001667655","May","2025-05-27","2025-05-28","G/I. 030-10132",129,"ANYIE EDITH PRIETO HERRERA","STO DOMINGO DE MARCONA K36 URBANIZACION","Provincia","ICA","ICA","B001667655",null,"En Ruta",9730017328,"F",202508,203201,"En Ruta","Dia 1",{"$f":"IF(MID(R130,1,2)=\"10\",\"PACIFIKA\",IF(MID(R130,1,2)=\"20\",\"CARMEL\",\"EMPLEADOS\"))","v":"CARMEL"},{"$f":"IF(I130=\"LIMA\",\"LIMA\",\"PROVINCIA\")","v":"PROVINCIA"},{"$f":"NETWORKDAYS.INTL(D130,M130,11,'Dias Feriados'!$A$1:$A$15)","v":-39255},{"$f":"IF(OR(M130=\"\",M130=\"En Ruta\"),\"En Ruta\",IF(M130=\"Motivado\",\"Motivado\",IF(W130<=1,\"24hrs\",IF(W130=2,\"48hrs\",IF(W130=3,\"72hrs\",\"+72hrs\")))))","v":"En Ruta"},{"$f":"WEEKNUM(C130)","v":22},"NO",null,0.9375,0.94722222222222219,1,"CRUCES CHO","2025-05-28",null,null,45804,"",{"$f":"IF(AS130=\"Devuelto\",\"\",IF(X130=\"24hrs\",\"Entregado\",CONSOLIDADO!S130))","v":"En Ruta"},"",{"$f":"IF(AK130=\"Entregado\",\"\",IF(X130=\"24hrs\",\"\",IF(X130=\"48hrs\",\"Entregado\",CONSOLIDADO!S130)))","v":"En Ruta"},"",{"$f":"IF(AK130=\"Entregado\",\"\",IF(OR(X130=\"24hrs\",X130=\"48hrs\"),\"\",IF(X130=\"72hrs\",\"Entregado\",CONSOLIDADO!S130)))","v":"En Ruta"},"",{"$f":"IF(AK130=\"Entregado\",\"\",IF(OR(X130=\"24hrs\",X130=\"48hrs\",X130=\"72hrs\"),\"\",IF(X130=\"+72hrs\",\"Entregado\",CONSOLIDADO!S130)))","v":"En Ruta"},"","En Ruta",1,{"$f":"IF(X130=\"24hrs\",1,0)","v":0},{"$f":"IF(X130=\"48hrs\",1,0)","v":0},{"$f":"IF(X130=\"72hrs\",1,0)","v":0},{"$f":"IF(X130=\"+72hrs\",1,0)","v":0},{"$f":"IF(X130=\"En Ruta\",1,0)","v":1},{"$f":"IF(X130=\"Motivado\",1,0)","v":0},{"$f":"IF(OR(N130=\"devuelto\",N130=\"siniestro\"),\"Nulo\",IF(OR(X130=\"24hrs\",X130=\"48hrs\"),\"A Tiempo\",IF(OR(X130=\"en ruta\",X130=\"motivado\"),\"No Entregado\",\"Fuera de Tiempo\")))","v":"No Entregado"},{"$f":"IF(BA130=\"a tiempo\",1,0)","v":0},{"$f":"IF(BA130=\"fuera de tiempo\",1,0)","v":0},{"$f":"IF(BA130=\"no entregado\",1,0)","v":1},{"$f":"IF(BA130=\"nulo\",1,0)","v":0},{"$f":"IF(V130=\"Lima\",NETWORKDAYS.INTL(D130,M130,11,'Dias Feriados'!$A$1:$A$15),IF(AND(V130=\"provincia\",X130=\"24hrs\"),1,IF(AND(V130=\"provincia\",X130=\"48hrs\"),2,NETWORKDAYS.INTL(D130,M130,11,'Dias Feriados'!$A$1:$A$15))))","v":-39255}]
["B001667669","May","2025-05-27","2025-05-28","G/I. 030-10132",130,"DIONISIA DINA SUMARI ALANYA","LA ALAMEDA DE HUACACHINA 7 MZ L ENTRAR POR DUNA MARKET","Provincia","ICA","ICA","B001667669",null,"En Ruta",9730017333,"F",202508,203201,"En Ruta","Dia 1","CARMEL","PROVINCIA",{"$f":"NETWORKDAYS.INTL(D131,M131,11,'Dias Feriados'!$A$1:$A$15)","v":-39255},"En Ruta",22,"NO",null,0.9375,0.94722222222222219,1,"CRUCES CHO","2025-05-28",null,null,45804,"",{"$f":"IF(AS131=\"Devuelto\",\"\",IF(X131=\"24hrs\",\"Entregado\",CONSOLIDADO!S131))","v":"En Ruta"},"",{"$f":"IF(AK131=\"Entregado\",\"\",IF(X131=\"24hrs\",\"\",IF(X131=\"48hrs\",\"Entregado\",CONSOLIDADO!S131)))","v":"En Ruta"},"",{"$f":"IF(AK131=\"Entregado\",\"\",IF(OR(X131=\"24hrs\",X131=\"48hrs\"),\"\",IF(X131=\"72hrs\",\"Entregado\",CONSOLIDADO!S131)))","v":"En Ruta"},"",{"$f":"IF(AK131=\"Entregado\",\"\",IF(OR(X131=\"24hrs\",X131=\"48hrs\",X131=\"72hrs\"),\"\",IF(X131=\"+72hrs\",\"Entregado\",CONSOLIDADO!S131)))","v":"En Ruta"},"","En Ruta",1,0,0,0,0,1,0,"No Entregado",0,0,1,0,{"$f":"IF(V131=\"Lima\",NETWORKDAYS.INTL(D131,M131,11,'Dias Feriados'!$A$1:$A$15),IF(AND(V131=\"provincia\",X131=\"24hrs\"),1,IF(AND(V131=\"provincia\",X131=\"48hrs\"),2,NETWORKDAYS.INTL(D131,M131,11,'Dias Feriados'!$A$1:$A$15))))","v":-39255}]
["B001667553","May","2025-05-27","2025-05-28","G/I. 030-10132",131,"LESLIE ROSEMARY PAREDES LAVAND","AV CUTERVO L19 SAN ISIDRO FRENTE A MAC GRILL FINANCIERA CURIA","Provincia","ICA","ICA","B001667553",null,"En Ruta",9730017342,"F",202508,203201,"En Ruta","Dia 1","CARMEL","PROVINCIA",{"$f":"NETWORKDAYS.INTL(D132,M132,11,'Dias Feriados'!$A$1:$A$15)","v":-39255},"En Ruta",22,"NO",null,0.9375,0.94722222222222219,1,"CRUCES CHO","2025-05-28",null,null,45804,"",{"$f":"IF(AS132=\"Devuelto\",\"\",IF(X132=\"24hrs\",\"Entregado\",CONSOLIDADO!S132))","v":"En Ruta"},"",{"$f":"IF(AK132=\"Entregado\",\"\",IF(X132=\"24hrs\",\"\",IF(X132=\"48hrs\",\"Entregado\",CONSOLIDADO!S132)))","v":"En Ruta"},"",{"$f":"IF(AK132=\"Entregado\",\"\",IF(OR(X132=\"24hrs\",X132=\"48hrs\"),\"\",IF(X132=\"72hrs\",\"Entregado\",CONSOLIDADO!S132)))","v":"En Ruta"},"",{"$f":"IF(AK132=\"Entregado\",\"\",IF(OR(X132=\"24hrs\",X132=\"48hrs\",X132=\"72hrs\"),\"\",IF(X132=\"+72hrs\",\"Entregado\",CONSOLIDADO!S132)))","v":"En Ruta"},"","En Ruta",1,0,0,0,0,1,0,"No Entregado",0,0,1,0,{"$f":"IF(V132=\"Lima\",NETWORKDAYS.INTL(D132,M132,11,'Dias Feriados'!$A$1:$A$15),IF(AND(V132=\"provincia\",X132=\"24hrs\"),1,IF(AND(V132=\"provincia\",X132=\"48hrs\"),2,NETWORKDAYS.INTL(D132,M132,11,'Dias Feriados'!$A$1:$A$15))))","v":-39255}]
["B001667765","May","2025-05-27","2025-05-28","G/I. 030-10132",132,"MERLY JAQUELINE PEREZ GONZALES","CL JACINTOS 149 SAN ISIDRO A ESPALDAS DE COL INGENIEROS","Provincia","ICA","ICA","B001667765",null,"En Ruta",9730017344,"F",202508,203201,"En Ruta","Dia 1","CARMEL","PROVINCIA",{"$f":"NETWORKDAYS.INTL(D133,M133,11,'Dias Feriados'!$A$1:$A$15)","v":-39255},"En Ruta",22,"NO",null,0.9375,0.94722222222222219,1,"CRUCES CHO","2025-05-28",null,null,45804,"",{"$f":"IF(AS133=\"Devuelto\",\"\",IF(X133=\"24hrs\",\"Entregado\",CONSOLIDADO!S133))","v":"En Ruta"},"",{"$f":"IF(AK133=\"Entregado\",\"\",IF(X133=\"24hrs\",\"\",IF(X133=\"48hrs\",\"Entregado\",CONSOLIDADO!S133)))","v":"En Ruta"},"",{"$f":"IF(AK133=\"Entregado\",\"\",IF(OR(X133=\"24hrs\",X133=\"48hrs\"),\"\",IF(X133=\"72hrs\",\"Entregado\",CONSOLIDADO!S133)))","v":"En Ruta"},"",{"$f":"IF(AK133=\"Entregado\",\"\",IF(OR(X133=\"24hrs\",X133=\"48hrs\",X133=\"72hrs\"),\"\",IF(X133=\"+72hrs\",\"Entregado\",CONSOLIDADO!S133)))","v":"En Ruta"},"","En Ruta",1,0,0,0,0,1,0,"No Entregado",0,0,1,0,{"$f":"IF(V133=\"Lima\",NETWORKDAYS.INTL(D133,M133,11,'Dias Feriados'!$A$1:$A$15),IF(AND(V133=\"provincia\",X133=\"24hrs\"),1,IF(AND(V133=\"provincia\",X133=\"48hrs\"),2,NETWORKDAYS.INTL(D133,M133,11,'Dias Feriados'!$A$1:$A$15))))","v":-39255}]
["B001667453","May","2025-05-27","2025-05-28","G/I. 030-10132",133,"GEANNINA KARIN HERNANDEZ BENDE","URB RAUL PORRAS BARRENECHEA MINISTERIO PUBLICO URBANO","Provincia","ICA","ICA","B001667453",null,"En Ruta",9730017346,"F",202508,203201,"En Ruta","Dia 1","CARMEL","PROVINCIA",{"$f":"NETWORKDAYS.INTL(D134,M134,11,'Dias Feriados'!$A$1:$A$15)","v":-39255},"En Ruta",22,"NO",null,0.9375,0.94722222222222219,1,"CRUCES CHO","2025-05-28",null,null,45804,"",{"$f":"IF(AS134=\"Devuelto\",\"\",IF(X134=\"24hrs\",\"Entregado\",CONSOLIDADO!S134))","v":"En Ruta"},"",{"$f":"IF(AK134=\"Entregado\",\"\",IF(X134=\"24hrs\",\"\",IF(X134=\"48hrs\",\"Entregado\",CONSOLIDADO!S134)))","v":"En Ruta"},"",{"$f":"IF(AK134=\"Entregado\",\"\",IF(OR(X134=\"24hrs\",X134=\"48hrs\"),\"\",IF(X134=\"72hrs\",\"Entregado\",CONSOLIDADO!S134)))","v":"En Ruta"},"",{"$f":"IF(AK134=\"Entregado\",\"\",IF(OR(X134=\"24hrs\",X134=\"48hrs\",X134=\"72hrs\"),\"\",IF(X134=\"+72hrs\",\"Entregado\",CONSOLIDADO!S134)))","v":"En Ruta"},"","En Ruta",1,0,0,0,0,1,0,"No Entregado",0,0,1,0,{"$f":"IF(V134=\"Lima\",NETWORKDAYS.INTL(D134,M134,11,'Dias Feriados'!$A$1:$A$15),IF(AND(V134=\"provincia\",X134=\"24hrs\"),1,IF(AND(V134=\"provincia\",X134=\"48hrs\"),2,NETWORKDAYS.INTL(D134,M134,11,'Dias Feriados'!$A$1:$A$15))))","v":-39255}]
["B001667638","May","2025-05-27","2025-05-28","G/I. 030-10132",134,"VIRGINIA ORMENO FERREYRA","URB LOS VIEDOS DE STA MARA I9 FRENTE AL CAR WASH LA CURBA","Provincia","ICA","ICA","B001667638",null,"En Ruta",9730017349,"F",202508,203201,"En Ruta","Dia 1","CARMEL","PROVINCIA",{"$f":"NETWORKDAYS.INTL(D135,M135,11,'Dias Feriados'!$A$1:$A$15)","v":-39255},"En Ruta",22,"NO",null,0.9375,0.94722222222222219,1,"CRUCES CHO","2025-05-28",null,null,45804,"",{"$f":"IF(AS135=\"Devuelto\",\"\",IF(X135=\"24hrs\",\"Entregado\",CONSOLIDADO!S135))","v":"En Ruta"},"",{"$f":"IF(AK135=\"Entregado\",\"\",IF(X135=\"24hrs\",\"\",IF(X135=\"48hrs\",\"Entregado\",CONSOLIDADO!S135)))","v":"En Ruta"},"",{"$f":"IF(AK135=\"Entregado\",\"\",IF(OR(X135=\"24hrs\",X135=\"48hrs\"),\"\",IF(X135=\"72hrs\",\"Entregado\",CONSOLIDADO!S135)))","v":"En Ruta"},"",{"$f":"IF(AK135=\"Entregado\",\"\",IF(OR(X135=\"24hrs\",X135=\"48hrs\",X135=\"72hrs\"),\"\",IF(X135=\"+72hrs\",\"Entregado\",CONSOLIDADO!S135)))","v":"En Ruta"},"","En Ruta",1,0,0,0,0,1,0,"No Entregado",0,0,1,0,{"$f":"IF(V135=\"Lima\",NETWORKDAYS.INTL(D135,M135,11,'Dias Feriados'!$A$1:$A$15),IF(AND(V135=\"provincia\",X135=\"24hrs\"),1,IF(AND(V135=\"provincia\",X135=\"48hrs\"),2,NETWORKDAYS.INTL(D135,M135,11,'Dias Feriados'!$A$1:$A$15))))","v":-39255}]
["B001667750","May","2025-05-27","2025-05-28","G/I. 030-10132",135,"MARTHA ADELMA REVATTA BAUTISTA","4TA ETAPA ANTIGUA KM 5 ICA URB LAS PALMERAS FRENTE A PARQUE","Provincia","ICA","ICA","B001667750",null,"En Ruta",9730017354,"F",202508,203201,"En Ruta","Dia 1","CARMEL","PROVINCIA",{"$f":"NETWORKDAYS.INTL(D136,M136,11,'Dias Feriados'!$A$1:$A$15)","v":-39255},"En Ruta",22,"NO",null,0.9375,0.94722222222222219,1,"CRUCES CHO","2025-05-28",null,null,45804,"",{"$f":"IF(AS136=\"Devuelto\",\"\",IF(X136=\"24hrs\",\"Entregado\",CONSOLIDADO!S136))","v":"En Ruta"},"",{"$f":"IF(AK136=\"Entregado\",\"\",IF(X136=\"24hrs\",\"\",IF(X136=\"48hrs\",\"Entregado\",CONSOLIDADO!S136)))","v":"En Ruta"},"",{"$f":"IF(AK136=\"Entregado\",\"\",IF(OR(X136=\"24hrs\",X136=\"48hrs\"),\"\",IF(X136=\"72hrs\",\"Entregado\",CONSOLIDADO!S136)))","v":"En Ruta"},"",{"$f":"IF(AK136=\"Entregado\",\"\",IF(OR(X136=\"24hrs\",X136=\"48hrs\",X136=\"72hrs\"),\"\",IF(X136=\"+72hrs\",\"Entregado\",CONSOLIDADO!S136)))","v":"En Ruta"},"","En Ruta",1,0,0,0,0,1,0,"No Entregado",0,0,1,0,{"$f":"IF(V136=\"Lima\",NETWORKDAYS.INTL(D136,M136,11,'Dias Feriados'!$A$1:$A$15),IF(AND(V136=\"provincia\",X136=\"24hrs\"),1,IF(AND(V136=\"provincia\",X136=\"48hrs\"),2,NETWORKDAYS.INTL(D136,M136,11,'Dias Feriados'!$A$1:$A$15))))","v":-39255}]
["B001667446","May","2025-05-27","2025-05-28","G/I. 030-10132",136,"CARMELA CORDOVA MENDOZA","BOTIJERIA ANGULO SUR MZ O LT 17 CASA 3 PISOS DE CERAMICA PASANDO LA CRUZ MANZANILLA","Provincia","ICA","ICA","B001667446",null,"En Ruta",9730017355,"F",202508,203201,"En Ruta","Dia 1","CARMEL","PROVINCIA",{"$f":"NETWORKDAYS.INTL(D137,M137,11,'Dias Feriados'!$A$1:$A$15)","v":-39255},"En Ruta",22,"NO",null,0.9375,0.94722222222222219,1,"CRUCES CHO","2025-05-28",null,null,45804,"",{"$f":"IF(AS137=\"Devuelto\",\"\",IF(X137=\"24hrs\",\"Entregado\",CONSOLIDADO!S137))","v":"En Ruta"},"",{"$f":"IF(AK137=\"Entregado\",\"\",IF(X137=\"24hrs\",\"\",IF(X137=\"48hrs\",\"Entregado\",CONSOLIDADO!S137)))","v":"En Ruta"},"",{"$f":"IF(AK137=\"Entregado\",\"\",IF(OR(X137=\"24hrs\",X137=\"48hrs\"),\"\",IF(X137=\"72hrs\",\"Entregado\",CONSOLIDADO!S137)))","v":"En Ruta"},"",{"$f":"IF(AK137=\"Entregado\",\"\",IF(OR(X137=\"24hrs\",X137=\"48hrs\",X137=\"72hrs\"),\"\",IF(X137=\"+72hrs\",\"Entregado\",CONSOLIDADO!S137)))","v":"En Ruta"},"","En Ruta",1,0,0,0,0,1,0,"No Entregado",0,0,1,0,{"$f":"IF(V137=\"Lima\",NETWORKDAYS.INTL(D137,M137,11,'Dias Feriados'!$A$1:$A$15),IF(AND(V137=\"provincia\",X137=\"24hrs\"),1,IF(AND(V137=\"provincia\",X137=\"48hrs\"),2,NETWORKDAYS.INTL(D137,M137,11,'Dias Feriados'!$A$1:$A$15))))","v":-39255}]
["B001667950","May","2025-05-27","2025-05-28","G/I. 030-10132",137,"LISA MARIA ADELINA MUNANTE TOR","1ERA ETAPA MZ B LT 40 DE ROJAS MARKET A LA DERECHA URB CASUARINAS","Provincia","ICA","ICA","B001667950",null,"En Ruta",9730017361,"F",202508,203201,"En Ruta","Dia 1","CARMEL","PROVINCIA",{"$f":"NETWORKDAYS.INTL(D138,M138,11,'Dias Feriados'!$A$1:$A$15)","v":-39255},"En Ruta",22,"NO",null,0.9375,0.94722222222222219,1,"CRUCES CHO","2025-05-28",null,null,45804,"",{"$f":"IF(AS138=\"Devuelto\",\"\",IF(X138=\"24hrs\",\"Entregado\",CONSOLIDADO!S138))","v":"En Ruta"},"",{"$f":"IF(AK138=\"Entregado\",\"\",IF(X138=\"24hrs\",\"\",IF(X138=\"48hrs\",\"Entregado\",CONSOLIDADO!S138)))","v":"En Ruta"},"",{"$f":"IF(AK138=\"Entregado\",\"\",IF(OR(X138=\"24hrs\",X138=\"48hrs\"),\"\",IF(X138=\"72hrs\",\"Entregado\",CONSOLIDADO!S138)))","v":"En Ruta"},"",{"$f":"IF(AK138=\"Entregado\",\"\",IF(OR(X138=\"24hrs\",X138=\"48hrs\",X138=\"72hrs\"),\"\",IF(X138=\"+72hrs\",\"Entregado\",CONSOLIDADO!S138)))","v":"En Ruta"},"","En Ruta",1,0,0,0,0,1,0,"No Entregado",0,0,1,0,{"$f":"IF(V138=\"Lima\",NETWORKDAYS.INTL(D138,M138,11,'Dias Feriados'!$A$1:$A$15),IF(AND(V138=\"provincia\",X138=\"24hrs\"),1,IF(AND(V138=\"provincia\",X138=\"48hrs\"),2,NETWORKDAYS.INTL(D138,M138,11,'Dias Feriados'!$A$1:$A$15))))","v":-39255}]
["B001667635","May","2025-05-27","2025-05-28","G/I. 030-10132",138,"LUZDELI CANTORAL MUZAURIETA","URBANIZACION VILLA SARAJA MZ C LOTE 2 REF ESPALDAS DEL PARQUE","Provincia","ICA","ICA","B001667635",null,"En Ruta",9730017375,"F",202508,203201,"En Ruta","Dia 1","CARMEL","PROVINCIA",{"$f":"NETWORKDAYS.INTL(D139,M139,11,'Dias Feriados'!$A$1:$A$15)","v":-39255},"En Ruta",22,"NO",null,0.9375,0.94722222222222219,1,"CRUCES CHO","2025-05-28",null,null,45804,"",{"$f":"IF(AS139=\"Devuelto\",\"\",IF(X139=\"24hrs\",\"Entregado\",CONSOLIDADO!S139))","v":"En Ruta"},"",{"$f":"IF(AK139=\"Entregado\",\"\",IF(X139=\"24hrs\",\"\",IF(X139=\"48hrs\",\"Entregado\",CONSOLIDADO!S139)))","v":"En Ruta"},"",{"$f":"IF(AK139=\"Entregado\",\"\",IF(OR(X139=\"24hrs\",X139=\"48hrs\"),\"\",IF(X139=\"72hrs\",\"Entregado\",CONSOLIDADO!S139)))","v":"En Ruta"},"",{"$f":"IF(AK139=\"Entregado\",\"\",IF(OR(X139=\"24hrs\",X139=\"48hrs\",X139=\"72hrs\"),\"\",IF(X139=\"+72hrs\",\"Entregado\",CONSOLIDADO!S139)))","v":"En Ruta"},"","En Ruta",1,0,0,0,0,1,0,"No Entregado",0,0,1,0,{"$f":"IF(V139=\"Lima\",NETWORKDAYS.INTL(D139,M139,11,'Dias Feriados'!$A$1:$A$15),IF(AND(V139=\"provincia\",X139=\"24hrs\"),1,IF(AND(V139=\"provincia\",X139=\"48hrs\"),2,NETWORKDAYS.INTL(D139,M139,11,'Dias Feriados'!$A$1:$A$15))))","v":-39255}]
["B001667593","May","2025-05-27","2025-05-28","G/I. 030-10132",139,"MARIA ISABEL MUNANTE TORRES","URB PUENTE BLANCO H9 PRIMERA ET PASANDO MEGAPLAZA ENTRA POR EL AUXILIAR DE PUENTE BLANCO POR EL PARQUE DOBLA","Provincia","ICA","ICA","B001667593",null,"En Ruta",9730017378,"F",202508,203201,"En Ruta","Dia 1","CARMEL","PROVINCIA",{"$f":"NETWORKDAYS.INTL(D140,M140,11,'Dias Feriados'!$A$1:$A$15)","v":-39255},"En Ruta",22,"NO",null,0.9375,0.94722222222222219,1,"CRUCES CHO","2025-05-28",null,null,45804,"",{"$f":"IF(AS140=\"Devuelto\",\"\",IF(X140=\"24hrs\",\"Entregado\",CONSOLIDADO!S140))","v":"En Ruta"},"",{"$f":"IF(AK140=\"Entregado\",\"\",IF(X140=\"24hrs\",\"\",IF(X140=\"48hrs\",\"Entregado\",CONSOLIDADO!S140)))","v":"En Ruta"},"",{"$f":"IF(AK140=\"Entregado\",\"\",IF(OR(X140=\"24hrs\",X140=\"48hrs\"),\"\",IF(X140=\"72hrs\",\"Entregado\",CONSOLIDADO!S140)))","v":"En Ruta"},"",{"$f":"IF(AK140=\"Entregado\",\"\",IF(OR(X140=\"24hrs\",X140=\"48hrs\",X140=\"72hrs\"),\"\",IF(X140=\"+72hrs\",\"Entregado\",CONSOLIDADO!S140)))","v":"En Ruta"},"","En Ruta",1,0,0,0,0,1,0,"No Entregado",0,0,1,0,{"$f":"IF(V140=\"Lima\",NETWORKDAYS.INTL(D140,M140,11,'Dias Feriados'!$A$1:$A$15),IF(AND(V140=\"provincia\",X140=\"24hrs\"),1,IF(AND(V140=\"provincia\",X140=\"48hrs\"),2,NETWORKDAYS.INTL(D140,M140,11,'Dias Feriados'!$A$1:$A$15))))","v":-39255}]
["B001667384","May","2025-05-27","2025-05-28","G/I. 030-10132",140,"ZAIDA KATERINNE GARCIA ROJAS","URB LAS CASUARINAS 6TA ETAPA MZ F LT 22 FRENTE AL PARQUE DEL CENTRO","Provincia","ICA","ICA","B001667384",null,"En Ruta",9730017388,"F",202508,203201,"En Ruta","Dia 1","CARMEL","PROVINCIA",{"$f":"NETWORKDAYS.INTL(D141,M141,11,'Dias Feriados'!$A$1:$A$15)","v":-39255},"En Ruta",22,"NO",null,0.9375,0.94722222222222219,1,"CRUCES CHO","2025-05-28",null,null,45804,"",{"$f":"IF(AS141=\"Devuelto\",\"\",IF(X141=\"24hrs\",\"Entregado\",CONSOLIDADO!S141))","v":"En Ruta"},"",{"$f":"IF(AK141=\"Entregado\",\"\",IF(X141=\"24hrs\",\"\",IF(X141=\"48hrs\",\"Entregado\",CONSOLIDADO!S141)))","v":"En Ruta"},"",{"$f":"IF(AK141=\"Entregado\",\"\",IF(OR(X141=\"24hrs\",X141=\"48hrs\"),\"\",IF(X141=\"72hrs\",\"Entregado\",CONSOLIDADO!S141)))","v":"En Ruta"},"",{"$f":"IF(AK141=\"Entregado\",\"\",IF(OR(X141=\"24hrs\",X141=\"48hrs\",X141=\"72hrs\"),\"\",IF(X141=\"+72hrs\",\"Entregado\",CONSOLIDADO!S141)))","v":"En Ruta"},"","En Ruta",1,0,0,0,0,1,0,"No Entregado",0,0,1,0,{"$f":"IF(V141=\"Lima\",NETWORKDAYS.INTL(D141,M141,11,'Dias Feriados'!$A$1:$A$15),IF(AND(V141=\"provincia\",X141=\"24hrs\"),1,IF(AND(V141=\"provincia\",X141=\"48hrs\"),2,NETWORKDAYS.INTL(D141,M141,11,'Dias Feriados'!$A$1:$A$15))))","v":-39255}]
["B001667468","May","2025-05-27","2025-05-28","G/I. 030-10132",141,"LUCERO BELEN ROMERO CORDOVA","JOSE SANTOS CHOCANO MZ W LT 10 SAN JOAQUIN","Provincia","ICA","ICA","B001667468",null,"En Ruta",9730017390,"F",202508,203201,"En Ruta","Dia 1","CARMEL","PROVINCIA",{"$f":"NETWORKDAYS.INTL(D142,M142,11,'Dias Feriados'!$A$1:$A$15)","v":-39255},"En Ruta",22,"NO",null,0.9375,0.94722222222222219,1,"CRUCES CHO","2025-05-28",null,null,45804,"",{"$f":"IF(AS142=\"Devuelto\",\"\",IF(X142=\"24hrs\",\"Entregado\",CONSOLIDADO!S142))","v":"En Ruta"},"",{"$f":"IF(AK142=\"Entregado\",\"\",IF(X142=\"24hrs\",\"\",IF(X142=\"48hrs\",\"Entregado\",CONSOLIDADO!S142)))","v":"En Ruta"},"",{"$f":"IF(AK142=\"Entregado\",\"\",IF(OR(X142=\"24hrs\",X142=\"48hrs\"),\"\",IF(X142=\"72hrs\",\"Entregado\",CONSOLIDADO!S142)))","v":"En Ruta"},"",{"$f":"IF(AK142=\"Entregado\",\"\",IF(OR(X142=\"24hrs\",X142=\"48hrs\",X142=\"72hrs\"),\"\",IF(X142=\"+72hrs\",\"Entregado\",CONSOLIDADO!S142)))","v":"En Ruta"},"","En Ruta",1,0,0,0,0,1,0,"No Entregado",0,0,1,0,{"$f":"IF(V142=\"Lima\",NETWORKDAYS.INTL(D142,M142,11,'Dias Feriados'!$A$1:$A$15),IF(AND(V142=\"provincia\",X142=\"24hrs\"),1,IF(AND(V142=\"provincia\",X142=\"48hrs\"),2,NETWORKDAYS.INTL(D142,M142,11,'Dias Feriados'!$A$1:$A$15))))","v":-39255}]
["B001667358","May","2025-05-27","2025-05-28","G/I. 030-10132",142,"ROSARIO MELCHORA MUNANTE TORRE","CASUARINAS MZ O LT 36 URB CASUARINAS 1ERA ETAPA","Provincia","ICA","ICA","B001667358",null,"En Ruta",9730017400,"F",202508,203201,"En Ruta","Dia 1","CARMEL","PROVINCIA",{"$f":"NETWORKDAYS.INTL(D143,M143,11,'Dias Feriados'!$A$1:$A$15)","v":-39255},"En Ruta",22,"NO",null,0.9375,0.94722222222222219,1,"CRUCES CHO","2025-05-28",null,null,45804,"",{"$f":"IF(AS143=\"Devuelto\",\"\",IF(X143=\"24hrs\",\"Entregado\",CONSOLIDADO!S143))","v":"En Ruta"},"",{"$f":"IF(AK143=\"Entregado\",\"\",IF(X143=\"24hrs\",\"\",IF(X143=\"48hrs\",\"Entregado\",CONSOLIDADO!S143)))","v":"En Ruta"},"",{"$f":"IF(AK143=\"Entregado\",\"\",IF(OR(X143=\"24hrs\",X143=\"48hrs\"),\"\",IF(X143=\"72hrs\",\"Entregado\",CONSOLIDADO!S143)))","v":"En Ruta"},"",{"$f":"IF(AK143=\"Entregado\",\"\",IF(OR(X143=\"24hrs\",X143=\"48hrs\",X143=\"72hrs\"),\"\",IF(X143=\"+72hrs\",\"Entregado\",CONSOLIDADO!S143)))","v":"En Ruta"},"","En Ruta",1,0,0,0,0,1,0,"No Entregado",0,0,1,0,{"$f":"IF(V143=\"Lima\",NETWORKDAYS.INTL(D143,M143,11,'Dias Feriados'!$A$1:$A$15),IF(AND(V143=\"provincia\",X143=\"24hrs\"),1,IF(AND(V143=\"provincia\",X143=\"48hrs\"),2,NETWORKDAYS.INTL(D143,M143,11,'Dias Feriados'!$A$1:$A$15))))","v":-39255}]
["B001667728","May","2025-05-27","2025-05-28","G/I. 030-10132",143,"ANA LIZ EZEQUILLA APAZA","AV AYABACA CON AV PRINCIPAL 1339 COMATRANA 15 CUADRAS PASANDO LA PLAZUELA DE COMATRANA","Provincia","ICA","ICA","B001667728",null,"En Ruta",9730017405,"F",202508,203201,"En Ruta","Dia 1","CARMEL","PROVINCIA",{"$f":"NETWORKDAYS.INTL(D144,M144,11,'Dias Feriados'!$A$1:$A$15)","v":-39255},"En Ruta",22,"NO",null,0.9375,0.94722222222222219,1,"CRUCES CHO","2025-05-28",null,null,45804,"",{"$f":"IF(AS144=\"Devuelto\",\"\",IF(X144=\"24hrs\",\"Entregado\",CONSOLIDADO!S144))","v":"En Ruta"},"",{"$f":"IF(AK144=\"Entregado\",\"\",IF(X144=\"24hrs\",\"\",IF(X144=\"48hrs\",\"Entregado\",CONSOLIDADO!S144)))","v":"En Ruta"},"",{"$f":"IF(AK144=\"Entregado\",\"\",IF(OR(X144=\"24hrs\",X144=\"48hrs\"),\"\",IF(X144=\"72hrs\",\"Entregado\",CONSOLIDADO!S144)))","v":"En Ruta"},"",{"$f":"IF(AK144=\"Entregado\",\"\",IF(OR(X144=\"24hrs\",X144=\"48hrs\",X144=\"72hrs\"),\"\",IF(X144=\"+72hrs\",\"Entregado\",CONSOLIDADO!S144)))","v":"En Ruta"},"","En Ruta",1,0,0,0,0,1,0,"No Entregado",0,0,1,0,{"$f":"IF(V144=\"Lima\",NETWORKDAYS.INTL(D144,M144,11,'Dias Feriados'!$A$1:$A$15),IF(AND(V144=\"provincia\",X144=\"24hrs\"),1,IF(AND(V144=\"provincia\",X144=\"48hrs\"),2,NETWORKDAYS.INTL(D144,M144,11,'Dias Feriados'!$A$1:$A$15))))","v":-39255}]
["B001667642","May","2025-05-27","2025-05-28","G/I. 030-10132",144,"MARILU ARCOS GUTIERREZ","BOTIJERIA ANGULO SUR H10 POR LA CRUZ PPJJ","Provincia","ICA","ICA","B001667642",null,"En Ruta",9730017436,"F",202508,203201,"En Ruta","Dia 1","CARMEL","PROVINCIA",{"$f":"NETWORKDAYS.INTL(D145,M145,11,'Dias Feriados'!$A$1:$A$15)","v":-39255},"En Ruta",22,"NO",null,0.9375,0.94722222222222219,1,"CRUCES CHO","2025-05-28",null,null,45804,"",{"$f":"IF(AS145=\"Devuelto\",\"\",IF(X145=\"24hrs\",\"Entregado\",CONSOLIDADO!S145))","v":"En Ruta"},"",{"$f":"IF(AK145=\"Entregado\",\"\",IF(X145=\"24hrs\",\"\",IF(X145=\"48hrs\",\"Entregado\",CONSOLIDADO!S145)))","v":"En Ruta"},"",{"$f":"IF(AK145=\"Entregado\",\"\",IF(OR(X145=\"24hrs\",X145=\"48hrs\"),\"\",IF(X145=\"72hrs\",\"Entregado\",CONSOLIDADO!S145)))","v":"En Ruta"},"",{"$f":"IF(AK145=\"Entregado\",\"\",IF(OR(X145=\"24hrs\",X145=\"48hrs\",X145=\"72hrs\"),\"\",IF(X145=\"+72hrs\",\"Entregado\",CONSOLIDADO!S145)))","v":"En Ruta"},"","En Ruta",1,0,0,0,0,1,0,"No Entregado",0,0,1,0,{"$f":"IF(V145=\"Lima\",NETWORKDAYS.INTL(D145,M145,11,'Dias Feriados'!$A$1:$A$15),IF(AND(V145=\"provincia\",X145=\"24hrs\"),1,IF(AND(V145=\"provincia\",X145=\"48hrs\"),2,NETWORKDAYS.INTL(D145,M145,11,'Dias Feriados'!$A$1:$A$15))))","v":-39255}]
["B001667628","May","2025-05-27","2025-05-28","G/I. 030-10132",145,"ANTONIETA INFANZON RAMIREZ","CASUARINAS 5 ETAPA E 25 PASANDO EL PRIMER PARQUE","Provincia","ICA","ICA","B001667628",null,"En Ruta",9730017443,"F",202508,203201,"En Ruta","Dia 1","CARMEL","PROVINCIA",{"$f":"NETWORKDAYS.INTL(D146,M146,11,'Dias Feriados'!$A$1:$A$15)","v":-39255},"En Ruta",22,"NO",null,0.9375,0.94722222222222219,1,"CRUCES CHO","2025-05-28",null,null,45804,"",{"$f":"IF(AS146=\"Devuelto\",\"\",IF(X146=\"24hrs\",\"Entregado\",CONSOLIDADO!S146))","v":"En Ruta"},"",{"$f":"IF(AK146=\"Entregado\",\"\",IF(X146=\"24hrs\",\"\",IF(X146=\"48hrs\",\"Entregado\",CONSOLIDADO!S146)))","v":"En Ruta"},"",{"$f":"IF(AK146=\"Entregado\",\"\",IF(OR(X146=\"24hrs\",X146=\"48hrs\"),\"\",IF(X146=\"72hrs\",\"Entregado\",CONSOLIDADO!S146)))","v":"En Ruta"},"",{"$f":"IF(AK146=\"Entregado\",\"\",IF(OR(X146=\"24hrs\",X146=\"48hrs\",X146=\"72hrs\"),\"\",IF(X146=\"+72hrs\",\"Entregado\",CONSOLIDADO!S146)))","v":"En Ruta"},"","En Ruta",1,0,0,0,0,1,0,"No Entregado",0,0,1,0,{"$f":"IF(V146=\"Lima\",NETWORKDAYS.INTL(D146,M146,11,'Dias Feriados'!$A$1:$A$15),IF(AND(V146=\"provincia\",X146=\"24hrs\"),1,IF(AND(V146=\"provincia\",X146=\"48hrs\"),2,NETWORKDAYS.INTL(D146,M146,11,'Dias Feriados'!$A$1:$A$15))))","v":-39255}]
["B001667369","May","2025-05-27","2025-05-28","G/I. 030-10132",146,"CLAUDIA VANESSA VALENCIA VILLA","URB CAUSARINAS J23 A MEDIA CDRA DEL RESERVORIO","Provincia","ICA","ICA","B001667369",null,"En Ruta",9730017444,"F",202508,203201,"En Ruta","Dia 1","CARMEL","PROVINCIA",{"$f":"NETWORKDAYS.INTL(D147,M147,11,'Dias Feriados'!$A$1:$A$15)","v":-39255},"En Ruta",22,"NO",null,0.9375,0.94722222222222219,1,"CRUCES CHO","2025-05-28",null,null,45804,"",{"$f":"IF(AS147=\"Devuelto\",\"\",IF(X147=\"24hrs\",\"Entregado\",CONSOLIDADO!S147))","v":"En Ruta"},"",{"$f":"IF(AK147=\"Entregado\",\"\",IF(X147=\"24hrs\",\"\",IF(X147=\"48hrs\",\"Entregado\",CONSOLIDADO!S147)))","v":"En Ruta"},"",{"$f":"IF(AK147=\"Entregado\",\"\",IF(OR(X147=\"24hrs\",X147=\"48hrs\"),\"\",IF(X147=\"72hrs\",\"Entregado\",CONSOLIDADO!S147)))","v":"En Ruta"},"",{"$f":"IF(AK147=\"Entregado\",\"\",IF(OR(X147=\"24hrs\",X147=\"48hrs\",X147=\"72hrs\"),\"\",IF(X147=\"+72hrs\",\"Entregado\",CONSOLIDADO!S147)))","v":"En Ruta"},"","En Ruta",1,0,0,0,0,1,0,"No Entregado",0,0,1,0,{"$f":"IF(V147=\"Lima\",NETWORKDAYS.INTL(D147,M147,11,'Dias Feriados'!$A$1:$A$15),IF(AND(V147=\"provincia\",X147=\"24hrs\"),1,IF(AND(V147=\"provincia\",X147=\"48hrs\"),2,NETWORKDAYS.INTL(D147,M147,11,'Dias Feriados'!$A$1:$A$15))))","v":-39255}]
["B001667450","May","2025-05-27","2025-05-28","G/I. 030-10132",147,"KAREN PAOLA PEREZ GUZMAN","BOTIJERIA ANGULO SUR B18 MANZANILLA","Provincia","ICA","ICA","B001667450",null,"En Ruta",9730017452,"F",202508,203201,"En Ruta","Dia 1","CARMEL","PROVINCIA",{"$f":"NETWORKDAYS.INTL(D148,M148,11,'Dias Feriados'!$A$1:$A$15)","v":-39255},"En Ruta",22,"NO",null,0.9375,0.94722222222222219,1,"CRUCES CHO","2025-05-28",null,null,45804,"",{"$f":"IF(AS148=\"Devuelto\",\"\",IF(X148=\"24hrs\",\"Entregado\",CONSOLIDADO!S148))","v":"En Ruta"},"",{"$f":"IF(AK148=\"Entregado\",\"\",IF(X148=\"24hrs\",\"\",IF(X148=\"48hrs\",\"Entregado\",CONSOLIDADO!S148)))","v":"En Ruta"},"",{"$f":"IF(AK148=\"Entregado\",\"\",IF(OR(X148=\"24hrs\",X148=\"48hrs\"),\"\",IF(X148=\"72hrs\",\"Entregado\",CONSOLIDADO!S148)))","v":"En Ruta"},"",{"$f":"IF(AK148=\"Entregado\",\"\",IF(OR(X148=\"24hrs\",X148=\"48hrs\",X148=\"72hrs\"),\"\",IF(X148=\"+72hrs\",\"Entregado\",CONSOLIDADO!S148)))","v":"En Ruta"},"","En Ruta",1,0,0,0,0,1,0,"No Entregado",0,0,1,0,{"$f":"IF(V148=\"Lima\",NETWORKDAYS.INTL(D148,M148,11,'Dias Feriados'!$A$1:$A$15),IF(AND(V148=\"provincia\",X148=\"24hrs\"),1,IF(AND(V148=\"provincia\",X148=\"48hrs\"),2,NETWORKDAYS.INTL(D148,M148,11,'Dias Feriados'!$A$1:$A$15))))","v":-39255}]
["B001668100","May","2025-05-27","2025-05-28","G/I. 030-10132",148,"MARINA FIDELIA COLINA URIBE","PASAJE LOS CALDERONES MZ 11 DETRAS DE HOTEL ROMA SANTA FE SAN JOAQUIN","Provincia","ICA","ICA","B001668100",null,"En Ruta",9730017455,"F",202508,203201,"En Ruta","Dia 1","CARMEL","PROVINCIA",{"$f":"NETWORKDAYS.INTL(D149,M149,11,'Dias Feriados'!$A$1:$A$15)","v":-39255},"En Ruta",22,"NO",null,0.9375,0.94722222222222219,1,"CRUCES CHO","2025-05-28",null,null,45804,"",{"$f":"IF(AS149=\"Devuelto\",\"\",IF(X149=\"24hrs\",\"Entregado\",CONSOLIDADO!S149))","v":"En Ruta"},"",{"$f":"IF(AK149=\"Entregado\",\"\",IF(X149=\"24hrs\",\"\",IF(X149=\"48hrs\",\"Entregado\",CONSOLIDADO!S149)))","v":"En Ruta"},"",{"$f":"IF(AK149=\"Entregado\",\"\",IF(OR(X149=\"24hrs\",X149=\"48hrs\"),\"\",IF(X149=\"72hrs\",\"Entregado\",CONSOLIDADO!S149)))","v":"En Ruta"},"",{"$f":"IF(AK149=\"Entregado\",\"\",IF(OR(X149=\"24hrs\",X149=\"48hrs\",X149=\"72hrs\"),\"\",IF(X149=\"+72hrs\",\"Entregado\",CONSOLIDADO!S149)))","v":"En Ruta"},"","En Ruta",1,0,0,0,0,1,0,"No Entregado",0,0,1,0,{"$f":"IF(V149=\"Lima\",NETWORKDAYS.INTL(D149,M149,11,'Dias Feriados'!$A$1:$A$15),IF(AND(V149=\"provincia\",X149=\"24hrs\"),1,IF(AND(V149=\"provincia\",X149=\"48hrs\"),2,NETWORKDAYS.INTL(D149,M149,11,'Dias Feriados'!$A$1:$A$15))))","v":-39255}]
["B001667406","May","2025-05-27","2025-05-28","G/I. 030-10132",149,"EDWIN JAVIER CABRERA REYNOSO","LOS POLLITOS MZ A LT 5 X ENTRADA DE CACHICHE DETRAS DE COLISEO LOS POLLITOS","Provincia","ICA","ICA","B001667406",null,"En Ruta",9730017458,"F",202508,203201,"En Ruta","Dia 1","CARMEL","PROVINCIA",{"$f":"NETWORKDAYS.INTL(D150,M150,11,'Dias Feriados'!$A$1:$A$15)","v":-39255},"En Ruta",22,"NO",null,0.9375,0.94722222222222219,1,"CRUCES CHO","2025-05-28",null,null,45804,"",{"$f":"IF(AS150=\"Devuelto\",\"\",IF(X150=\"24hrs\",\"Entregado\",CONSOLIDADO!S150))","v":"En Ruta"},"",{"$f":"IF(AK150=\"Entregado\",\"\",IF(X150=\"24hrs\",\"\",IF(X150=\"48hrs\",\"Entregado\",CONSOLIDADO!S150)))","v":"En Ruta"},"",{"$f":"IF(AK150=\"Entregado\",\"\",IF(OR(X150=\"24hrs\",X150=\"48hrs\"),\"\",IF(X150=\"72hrs\",\"Entregado\",CONSOLIDADO!S150)))","v":"En Ruta"},"",{"$f":"IF(AK150=\"Entregado\",\"\",IF(OR(X150=\"24hrs\",X150=\"48hrs\",X150=\"72hrs\"),\"\",IF(X150=\"+72hrs\",\"Entregado\",CONSOLIDADO!S150)))","v":"En Ruta"},"","En Ruta",1,0,0,0,0,1,0,"No Entregado",0,0,1,0,{"$f":"IF(V150=\"Lima\",NETWORKDAYS.INTL(D150,M150,11,'Dias Feriados'!$A$1:$A$15),IF(AND(V150=\"provincia\",X150=\"24hrs\"),1,IF(AND(V150=\"provincia\",X150=\"48hrs\"),2,NETWORKDAYS.INTL(D150,M150,11,'Dias Feriados'!$A$1:$A$15))))","v":-39255}]
["B001667773","May","2025-05-27","2025-05-28","G/I. 030-10132",150,"SHEYLLA ELIZABETH PALMA PINEDA","PALAZUELOS INT 20 200 LT 20 MEDIA CDRA PANADERIA OSIRIS PALAZUELOS","Provincia","ICA","ICA","B001667773",null,"En Ruta",9730017459,"F",202508,203201,"En Ruta","Dia 1","CARMEL","PROVINCIA",{"$f":"NETWORKDAYS.INTL(D151,M151,11,'Dias Feriados'!$A$1:$A$15)","v":-39255},"En Ruta",22,"NO",null,0.9375,0.94722222222222219,1,"CRUCES CHO","2025-05-28",null,null,45804,"",{"$f":"IF(AS151=\"Devuelto\",\"\",IF(X151=\"24hrs\",\"Entregado\",CONSOLIDADO!S151))","v":"En Ruta"},"",{"$f":"IF(AK151=\"Entregado\",\"\",IF(X151=\"24hrs\",\"\",IF(X151=\"48hrs\",\"Entregado\",CONSOLIDADO!S151)))","v":"En Ruta"},"",{"$f":"IF(AK151=\"Entregado\",\"\",IF(OR(X151=\"24hrs\",X151=\"48hrs\"),\"\",IF(X151=\"72hrs\",\"Entregado\",CONSOLIDADO!S151)))","v":"En Ruta"},"",{"$f":"IF(AK151=\"Entregado\",\"\",IF(OR(X151=\"24hrs\",X151=\"48hrs\",X151=\"72hrs\"),\"\",IF(X151=\"+72hrs\",\"Entregado\",CONSOLIDADO!S151)))","v":"En Ruta"},"","En Ruta",1,0,0,0,0,1,0,"No Entregado",0,0,1,0,{"$f":"IF(V151=\"Lima\",NETWORKDAYS.INTL(D151,M151,11,'Dias Feriados'!$A$1:$A$15),IF(AND(V151=\"provincia\",X151=\"24hrs\"),1,IF(AND(V151=\"provincia\",X151=\"48hrs\"),2,NETWORKDAYS.INTL(D151,M151,11,'Dias Feriados'!$A$1:$A$15))))","v":-39255}]
["B001667558","May","2025-05-27","2025-05-28","G/I. 030-10132",151,"FANNY DE LOURDES ROSAS","LOS PORTALES G 03 POR LA HUELGA","Provincia","ICA","ICA","B001667558",null,"En Ruta",9730017465,"F",202508,203201,"En Ruta","Dia 1","CARMEL","PROVINCIA",{"$f":"NETWORKDAYS.INTL(D152,M152,11,'Dias Feriados'!$A$1:$A$15)","v":-39255},"En Ruta",22,"NO",null,0.9375,0.94722222222222219,1,"CRUCES CHO","2025-05-28",null,null,45804,"",{"$f":"IF(AS152=\"Devuelto\",\"\",IF(X152=\"24hrs\",\"Entregado\",CONSOLIDADO!S152))","v":"En Ruta"},"",{"$f":"IF(AK152=\"Entregado\",\"\",IF(X152=\"24hrs\",\"\",IF(X152=\"48hrs\",\"Entregado\",CONSOLIDADO!S152)))","v":"En Ruta"},"",{"$f":"IF(AK152=\"Entregado\",\"\",IF(OR(X152=\"24hrs\",X152=\"48hrs\"),\"\",IF(X152=\"72hrs\",\"Entregado\",CONSOLIDADO!S152)))","v":"En Ruta"},"",{"$f":"IF(AK152=\"Entregado\",\"\",IF(OR(X152=\"24hrs\",X152=\"48hrs\",X152=\"72hrs\"),\"\",IF(X152=\"+72hrs\",\"Entregado\",CONSOLIDADO!S152)))","v":"En Ruta"},"","En Ruta",1,0,0,0,0,1,0,"No Entregado",0,0,1,0,{"$f":"IF(V152=\"Lima\",NETWORKDAYS.INTL(D152,M152,11,'Dias Feriados'!$A$1:$A$15),IF(AND(V152=\"provincia\",X152=\"24hrs\"),1,IF(AND(V152=\"provincia\",X152=\"48hrs\"),2,NETWORKDAYS.INTL(D152,M152,11,'Dias Feriados'!$A$1:$A$15))))","v":-39255}]
["B001667461","May","2025-05-27","2025-05-28","G/I. 030-10132",152,"ARLENY ESTELA MENDOZA ERAZO","SAN JOAQUN NUEVO 651 AVJOSE MARIA EGUREN 1 ERA ETAPA URBANIZACION","Provincia","ICA","ICA","B001667461",null,"En Ruta",9730017469,"F",202508,203201,"En Ruta","Dia 1","CARMEL","PROVINCIA",{"$f":"NETWORKDAYS.INTL(D153,M153,11,'Dias Feriados'!$A$1:$A$15)","v":-39255},"En Ruta",22,"NO",null,0.9375,0.94722222222222219,1,"CRUCES CHO","2025-05-28",null,null,45804,"",{"$f":"IF(AS153=\"Devuelto\",\"\",IF(X153=\"24hrs\",\"Entregado\",CONSOLIDADO!S153))","v":"En Ruta"},"",{"$f":"IF(AK153=\"Entregado\",\"\",IF(X153=\"24hrs\",\"\",IF(X153=\"48hrs\",\"Entregado\",CONSOLIDADO!S153)))","v":"En Ruta"},"",{"$f":"IF(AK153=\"Entregado\",\"\",IF(OR(X153=\"24hrs\",X153=\"48hrs\"),\"\",IF(X153=\"72hrs\",\"Entregado\",CONSOLIDADO!S153)))","v":"En Ruta"},"",{"$f":"IF(AK153=\"Entregado\",\"\",IF(OR(X153=\"24hrs\",X153=\"48hrs\",X153=\"72hrs\"),\"\",IF(X153=\"+72hrs\",\"Entregado\",CONSOLIDADO!S153)))","v":"En Ruta"},"","En Ruta",1,0,0,0,0,1,0,"No Entregado",0,0,1,0,{"$f":"IF(V153=\"Lima\",NETWORKDAYS.INTL(D153,M153,11,'Dias Feriados'!$A$1:$A$15),IF(AND(V153=\"provincia\",X153=\"24hrs\"),1,IF(AND(V153=\"provincia\",X153=\"48hrs\"),2,NETWORKDAYS.INTL(D153,M153,11,'Dias Feriados'!$A$1:$A$15))))","v":-39255}]
["B001667858","May","2025-05-27","2025-05-28","G/I. 030-10132",153,"TEODOLINDA CABRERA DE RAMIREZ","CASERIO SAN MARTIN V 17 FRENTE A COLEGIO MAXIMO DE LA CRUZ SOLORZANO","Provincia","ICA","ICA","B001667858",null,"En Ruta",9730017487,"F",202508,203201,"En Ruta","Dia 1","CARMEL","PROVINCIA",{"$f":"NETWORKDAYS.INTL(D154,M154,11,'Dias Feriados'!$A$1:$A$15)","v":-39255},"En Ruta",22,"NO",null,0.9375,0.94722222222222219,1,"CRUCES CHO","2025-05-28",null,null,45804,"",{"$f":"IF(AS154=\"Devuelto\",\"\",IF(X154=\"24hrs\",\"Entregado\",CONSOLIDADO!S154))","v":"En Ruta"},"",{"$f":"IF(AK154=\"Entregado\",\"\",IF(X154=\"24hrs\",\"\",IF(X154=\"48hrs\",\"Entregado\",CONSOLIDADO!S154)))","v":"En Ruta"},"",{"$f":"IF(AK154=\"Entregado\",\"\",IF(OR(X154=\"24hrs\",X154=\"48hrs\"),\"\",IF(X154=\"72hrs\",\"Entregado\",CONSOLIDADO!S154)))","v":"En Ruta"},"",{"$f":"IF(AK154=\"Entregado\",\"\",IF(OR(X154=\"24hrs\",X154=\"48hrs\",X154=\"72hrs\"),\"\",IF(X154=\"+72hrs\",\"Entregado\",CONSOLIDADO!S154)))","v":"En Ruta"},"","En Ruta",1,0,0,0,0,1,0,"No Entregado",0,0,1,0,{"$f":"IF(V154=\"Lima\",NETWORKDAYS.INTL(D154,M154,11,'Dias Feriados'!$A$1:$A$15),IF(AND(V154=\"provincia\",X154=\"24hrs\"),1,IF(AND(V154=\"provincia\",X154=\"48hrs\"),2,NETWORKDAYS.INTL(D154,M154,11,'Dias Feriados'!$A$1:$A$15))))","v":-39255}]
["B001667569","May","2025-05-27","2025-05-28","G/I. 030-10132",154,"BRIGGITH CHANG PENA","BOTIJERIA ANGULO SUR O 17 MANZANILLA","Provincia","ICA","ICA","B001667569",null,"En Ruta",9730017519,"F",202508,203201,"En Ruta","Dia 1","CARMEL","PROVINCIA",{"$f":"NETWORKDAYS.INTL(D155,M155,11,'Dias Feriados'!$A$1:$A$15)","v":-39255},"En Ruta",22,"NO",null,0.9375,0.94722222222222219,1,"CRUCES CHO","2025-05-28",null,null,45804,"",{"$f":"IF(AS155=\"Devuelto\",\"\",IF(X155=\"24hrs\",\"Entregado\",CONSOLIDADO!S155))","v":"En Ruta"},"",{"$f":"IF(AK155=\"Entregado\",\"\",IF(X155=\"24hrs\",\"\",IF(X155=\"48hrs\",\"Entregado\",CONSOLIDADO!S155)))","v":"En Ruta"},"",{"$f":"IF(AK155=\"Entregado\",\"\",IF(OR(X155=\"24hrs\",X155=\"48hrs\"),\"\",IF(X155=\"72hrs\",\"Entregado\",CONSOLIDADO!S155)))","v":"En Ruta"},"",{"$f":"IF(AK155=\"Entregado\",\"\",IF(OR(X155=\"24hrs\",X155=\"48hrs\",X155=\"72hrs\"),\"\",IF(X155=\"+72hrs\",\"Entregado\",CONSOLIDADO!S155)))","v":"En Ruta"},"","En Ruta",1,0,0,0,0,1,0,"No Entregado",0,0,1,0,{"$f":"IF(V155=\"Lima\",NETWORKDAYS.INTL(D155,M155,11,'Dias Feriados'!$A$1:$A$15),IF(AND(V155=\"provincia\",X155=\"24hrs\"),1,IF(AND(V155=\"provincia\",X155=\"48hrs\"),2,NETWORKDAYS.INTL(D155,M155,11,'Dias Feriados'!$A$1:$A$15))))","v":-39255}]
["B001667577","May","2025-05-27","2025-05-28","G/I. 030-10132",155,"JENNIFER ODALIS RAMIREZ ATOCZA","SAN RAFAEL LT 03 PUEBLO NUEVO","Provincia","ICA","ICA","B001667577",null,"En Ruta",9730017527,"F",202508,203201,"En Ruta","Dia 1","CARMEL","PROVINCIA",{"$f":"NETWORKDAYS.INTL(D156,M156,11,'Dias Feriados'!$A$1:$A$15)","v":-39255},"En Ruta",22,"NO",null,0.9375,0.94722222222222219,1,"CRUCES CHO","2025-05-28",null,null,45804,"",{"$f":"IF(AS156=\"Devuelto\",\"\",IF(X156=\"24hrs\",\"Entregado\",CONSOLIDADO!S156))","v":"En Ruta"},"",{"$f":"IF(AK156=\"Entregado\",\"\",IF(X156=\"24hrs\",\"\",IF(X156=\"48hrs\",\"Entregado\",CONSOLIDADO!S156)))","v":"En Ruta"},"",{"$f":"IF(AK156=\"Entregado\",\"\",IF(OR(X156=\"24hrs\",X156=\"48hrs\"),\"\",IF(X156=\"72hrs\",\"Entregado\",CONSOLIDADO!S156)))","v":"En Ruta"},"",{"$f":"IF(AK156=\"Entregado\",\"\",IF(OR(X156=\"24hrs\",X156=\"48hrs\",X156=\"72hrs\"),\"\",IF(X156=\"+72hrs\",\"Entregado\",CONSOLIDADO!S156)))","v":"En Ruta"},"","En Ruta",1,0,0,0,0,1,0,"No Entregado",0,0,1,0,{"$f":"IF(V156=\"Lima\",NETWORKDAYS.INTL(D156,M156,11,'Dias Feriados'!$A$1:$A$15),IF(AND(V156=\"provincia\",X156=\"24hrs\"),1,IF(AND(V156=\"provincia\",X156=\"48hrs\"),2,NETWORKDAYS.INTL(D156,M156,11,'Dias Feriados'!$A$1:$A$15))))","v":-39255}]
["B001667345","May","2025-05-27","2025-05-28","G/I. 030-10132",156,"LIDIA AURORA TORRES GUTIERREZ","PPJJ SENOR DE LUREN 3RA ETAPA F29 LACOMISARIA A MANO DERECHA ULTIMA CUADRA","Provincia","ICA","ICA","B001667345",null,"En Ruta",9730017532,"F",202508,203201,"En Ruta","Dia 1","CARMEL","PROVINCIA",{"$f":"NETWORKDAYS.INTL(D157,M157,11,'Dias Feriados'!$A$1:$A$15)","v":-39255},"En Ruta",22,"NO",null,0.9375,0.94722222222222219,1,"CRUCES CHO","2025-05-28",null,null,45804,"",{"$f":"IF(AS157=\"Devuelto\",\"\",IF(X157=\"24hrs\",\"Entregado\",CONSOLIDADO!S157))","v":"En Ruta"},"",{"$f":"IF(AK157=\"Entregado\",\"\",IF(X157=\"24hrs\",\"\",IF(X157=\"48hrs\",\"Entregado\",CONSOLIDADO!S157)))","v":"En Ruta"},"",{"$f":"IF(AK157=\"Entregado\",\"\",IF(OR(X157=\"24hrs\",X157=\"48hrs\"),\"\",IF(X157=\"72hrs\",\"Entregado\",CONSOLIDADO!S157)))","v":"En Ruta"},"",{"$f":"IF(AK157=\"Entregado\",\"\",IF(OR(X157=\"24hrs\",X157=\"48hrs\",X157=\"72hrs\"),\"\",IF(X157=\"+72hrs\",\"Entregado\",CONSOLIDADO!S157)))","v":"En Ruta"},"","En Ruta",1,0,0,0,0,1,0,"No Entregado",0,0,1,0,{"$f":"IF(V157=\"Lima\",NETWORKDAYS.INTL(D157,M157,11,'Dias Feriados'!$A$1:$A$15),IF(AND(V157=\"provincia\",X157=\"24hrs\"),1,IF(AND(V157=\"provincia\",X157=\"48hrs\"),2,NETWORKDAYS.INTL(D157,M157,11,'Dias Feriados'!$A$1:$A$15))))","v":-39255}]
["B001667786","May","2025-05-27","2025-05-28","G/I. 030-10132",157,"RUTH EYZAGUIRRE ALEGRIA","CALLE CLAVELES 240 URB LA MODERNA CASA ICA CALLE CLAVELES","Provincia","ICA","ICA","B001667786",null,"En Ruta",9730017535,"F",202508,203201,"En Ruta","Dia 1","CARMEL","PROVINCIA",{"$f":"NETWORKDAYS.INTL(D158,M158,11,'Dias Feriados'!$A$1:$A$15)","v":-39255},"En Ruta",22,"NO",null,0.9375,0.94722222222222219,1,"CRUCES CHO","2025-05-28",null,null,45804,"",{"$f":"IF(AS158=\"Devuelto\",\"\",IF(X158=\"24hrs\",\"Entregado\",CONSOLIDADO!S158))","v":"En Ruta"},"",{"$f":"IF(AK158=\"Entregado\",\"\",IF(X158=\"24hrs\",\"\",IF(X158=\"48hrs\",\"Entregado\",CONSOLIDADO!S158)))","v":"En Ruta"},"",{"$f":"IF(AK158=\"Entregado\",\"\",IF(OR(X158=\"24hrs\",X158=\"48hrs\"),\"\",IF(X158=\"72hrs\",\"Entregado\",CONSOLIDADO!S158)))","v":"En Ruta"},"",{"$f":"IF(AK158=\"Entregado\",\"\",IF(OR(X158=\"24hrs\",X158=\"48hrs\",X158=\"72hrs\"),\"\",IF(X158=\"+72hrs\",\"Entregado\",CONSOLIDADO!S158)))","v":"En Ruta"},"","En Ruta",1,0,0,0,0,1,0,"No Entregado",0,0,1,0,{"$f":"IF(V158=\"Lima\",NETWORKDAYS.INTL(D158,M158,11,'Dias Feriados'!$A$1:$A$15),IF(AND(V158=\"provincia\",X158=\"24hrs\"),1,IF(AND(V158=\"provincia\",X158=\"48hrs\"),2,NETWORKDAYS.INTL(D158,M158,11,'Dias Feriados'!$A$1:$A$15))))","v":-39255}]
["B001667425","May","2025-05-27","2025-05-28","G/I. 030-10132",158,"YESENIA KARINA QUINTANA CHUMBE","URB SAN MIGUEL CL PEDRO ORTIZ MZ E LT 14 POR EL LATERAL DERECHO DEL ESTADIO PICASO","Provincia","ICA","ICA","B001667425",null,"En Ruta",9730017537,"F",202508,203201,"En Ruta","Dia 1","CARMEL","PROVINCIA",{"$f":"NETWORKDAYS.INTL(D159,M159,11,'Dias Feriados'!$A$1:$A$15)","v":-39255},"En Ruta",22,"NO",null,0.9375,0.94722222222222219,1,"CRUCES CHO","2025-05-28",null,null,45804,"",{"$f":"IF(AS159=\"Devuelto\",\"\",IF(X159=\"24hrs\",\"Entregado\",CONSOLIDADO!S159))","v":"En Ruta"},"",{"$f":"IF(AK159=\"Entregado\",\"\",IF(X159=\"24hrs\",\"\",IF(X159=\"48hrs\",\"Entregado\",CONSOLIDADO!S159)))","v":"En Ruta"},"",{"$f":"IF(AK159=\"Entregado\",\"\",IF(OR(X159=\"24hrs\",X159=\"48hrs\"),\"\",IF(X159=\"72hrs\",\"Entregado\",CONSOLIDADO!S159)))","v":"En Ruta"},"",{"$f":"IF(AK159=\"Entregado\",\"\",IF(OR(X159=\"24hrs\",X159=\"48hrs\",X159=\"72hrs\"),\"\",IF(X159=\"+72hrs\",\"Entregado\",CONSOLIDADO!S159)))","v":"En Ruta"},"","En Ruta",1,0,0,0,0,1,0,"No Entregado",0,0,1,0,{"$f":"IF(V159=\"Lima\",NETWORKDAYS.INTL(D159,M159,11,'Dias Feriados'!$A$1:$A$15),IF(AND(V159=\"provincia\",X159=\"24hrs\"),1,IF(AND(V159=\"provincia\",X159=\"48hrs\"),2,NETWORKDAYS.INTL(D159,M159,11,'Dias Feriados'!$A$1:$A$15))))","v":-39255}]
["B001667507","May","2025-05-27","2025-05-28","G/I. 030-10132",159,"CINDY MAE ANDREA AJALCRINA ORM","CL LA HERRADURA 10 MZ 1 LT 10 PORUMA URB EL HARAS TERCERA ET I 10","Provincia","ICA","ICA","B001667507",null,"En Ruta",9730017538,"F",202508,203201,"En Ruta","Dia 1","CARMEL","PROVINCIA",{"$f":"NETWORKDAYS.INTL(D160,M160,11,'Dias Feriados'!$A$1:$A$15)","v":-39255},"En Ruta",22,"NO",null,0.9375,0.94722222222222219,1,"CRUCES CHO","2025-05-28",null,null,45804,"",{"$f":"IF(AS160=\"Devuelto\",\"\",IF(X160=\"24hrs\",\"Entregado\",CONSOLIDADO!S160))","v":"En Ruta"},"",{"$f":"IF(AK160=\"Entregado\",\"\",IF(X160=\"24hrs\",\"\",IF(X160=\"48hrs\",\"Entregado\",CONSOLIDADO!S160)))","v":"En Ruta"},"",{"$f":"IF(AK160=\"Entregado\",\"\",IF(OR(X160=\"24hrs\",X160=\"48hrs\"),\"\",IF(X160=\"72hrs\",\"Entregado\",CONSOLIDADO!S160)))","v":"En Ruta"},"",{"$f":"IF(AK160=\"Entregado\",\"\",IF(OR(X160=\"24hrs\",X160=\"48hrs\",X160=\"72hrs\"),\"\",IF(X160=\"+72hrs\",\"Entregado\",CONSOLIDADO!S160)))","v":"En Ruta"},"","En Ruta",1,0,0,0,0,1,0,"No Entregado",0,0,1,0,{"$f":"IF(V160=\"Lima\",NETWORKDAYS.INTL(D160,M160,11,'Dias Feriados'!$A$1:$A$15),IF(AND(V160=\"provincia\",X160=\"24hrs\"),1,IF(AND(V160=\"provincia\",X160=\"48hrs\"),2,NETWORKDAYS.INTL(D160,M160,11,'Dias Feriados'!$A$1:$A$15))))","v":-39255}]
["B001667625","May","2025-05-27","2025-05-28","G/I. 030-10132",160,"ESTEFANY CAROLINA CAMPOS MARRO","URB LA PALMA A34 COLEGIO TORIBIO POLO","Provincia","ICA","ICA","B001667625",null,"En Ruta",9730017539,"F",202508,203201,"En Ruta","Dia 1","CARMEL","PROVINCIA",{"$f":"NETWORKDAYS.INTL(D161,M161,11,'Dias Feriados'!$A$1:$A$15)","v":-39255},"En Ruta",22,"NO",null,0.9375,0.94722222222222219,1,"CRUCES CHO","2025-05-28",null,null,45804,"",{"$f":"IF(AS161=\"Devuelto\",\"\",IF(X161=\"24hrs\",\"Entregado\",CONSOLIDADO!S161))","v":"En Ruta"},"",{"$f":"IF(AK161=\"Entregado\",\"\",IF(X161=\"24hrs\",\"\",IF(X161=\"48hrs\",\"Entregado\",CONSOLIDADO!S161)))","v":"En Ruta"},"",{"$f":"IF(AK161=\"Entregado\",\"\",IF(OR(X161=\"24hrs\",X161=\"48hrs\"),\"\",IF(X161=\"72hrs\",\"Entregado\",CONSOLIDADO!S161)))","v":"En Ruta"},"",{"$f":"IF(AK161=\"Entregado\",\"\",IF(OR(X161=\"24hrs\",X161=\"48hrs\",X161=\"72hrs\"),\"\",IF(X161=\"+72hrs\",\"Entregado\",CONSOLIDADO!S161)))","v":"En Ruta"},"","En Ruta",1,0,0,0,0,1,0,"No Entregado",0,0,1,0,{"$f":"IF(V161=\"Lima\",NETWORKDAYS.INTL(D161,M161,11,'Dias Feriados'!$A$1:$A$15),IF(AND(V161=\"provincia\",X161=\"24hrs\"),1,IF(AND(V161=\"provincia\",X161=\"48hrs\"),2,NETWORKDAYS.INTL(D161,M161,11,'Dias Feriados'!$A$1:$A$15))))","v":-39255}]
["B001667504","May","2025-05-27","2025-05-28","G/I. 030-10132",161,"MAGDY ELIZABETH VASQUEZ PARDO","CALLE LA COLINA MZ AI LT 06 URB EL HARAS 3ETP INGRESAR POR PORUMA PASANDO AGRECON","Provincia","ICA","ICA","B001667504",null,"En Ruta",9730017543,"F",202508,203201,"En Ruta","Dia 1","CARMEL","PROVINCIA",{"$f":"NETWORKDAYS.INTL(D162,M162,11,'Dias Feriados'!$A$1:$A$15)","v":-39255},"En Ruta",22,"NO",null,0.9375,0.94722222222222219,1,"CRUCES CHO","2025-05-28",null,null,45804,"",{"$f":"IF(AS162=\"Devuelto\",\"\",IF(X162=\"24hrs\",\"Entregado\",CONSOLIDADO!S162))","v":"En Ruta"},"",{"$f":"IF(AK162=\"Entregado\",\"\",IF(X162=\"24hrs\",\"\",IF(X162=\"48hrs\",\"Entregado\",CONSOLIDADO!S162)))","v":"En Ruta"},"",{"$f":"IF(AK162=\"Entregado\",\"\",IF(OR(X162=\"24hrs\",X162=\"48hrs\"),\"\",IF(X162=\"72hrs\",\"Entregado\",CONSOLIDADO!S162)))","v":"En Ruta"},"",{"$f":"IF(AK162=\"Entregado\",\"\",IF(OR(X162=\"24hrs\",X162=\"48hrs\",X162=\"72hrs\"),\"\",IF(X162=\"+72hrs\",\"Entregado\",CONSOLIDADO!S162)))","v":"En Ruta"},"","En Ruta",1,0,0,0,0,1,0,"No Entregado",0,0,1,0,{"$f":"IF(V162=\"Lima\",NETWORKDAYS.INTL(D162,M162,11,'Dias Feriados'!$A$1:$A$15),IF(AND(V162=\"provincia\",X162=\"24hrs\"),1,IF(AND(V162=\"provincia\",X162=\"48hrs\"),2,NETWORKDAYS.INTL(D162,M162,11,'Dias Feriados'!$A$1:$A$15))))","v":-39255}]
["B001667448","May","2025-05-27","2025-05-28","G/I. 030-10132",162,"JULIANA NACIOCINA TORRES TAYPE","PARQUE INDUSTRIAL 264 COSTADO CORTE SUPREMA AV PARQUE INDUSTRIAL SAN JOAQUIN","Provincia","ICA","ICA","B001667448",null,"En Ruta",9730017549,"F",202508,203201,"En Ruta","Dia 1","CARMEL","PROVINCIA",{"$f":"NETWORKDAYS.INTL(D163,M163,11,'Dias Feriados'!$A$1:$A$15)","v":-39255},"En Ruta",22,"NO",null,0.9375,0.94722222222222219,1,"CRUCES CHO","2025-05-28",null,null,45804,"",{"$f":"IF(AS163=\"Devuelto\",\"\",IF(X163=\"24hrs\",\"Entregado\",CONSOLIDADO!S163))","v":"En Ruta"},"",{"$f":"IF(AK163=\"Entregado\",\"\",IF(X163=\"24hrs\",\"\",IF(X163=\"48hrs\",\"Entregado\",CONSOLIDADO!S163)))","v":"En Ruta"},"",{"$f":"IF(AK163=\"Entregado\",\"\",IF(OR(X163=\"24hrs\",X163=\"48hrs\"),\"\",IF(X163=\"72hrs\",\"Entregado\",CONSOLIDADO!S163)))","v":"En Ruta"},"",{"$f":"IF(AK163=\"Entregado\",\"\",IF(OR(X163=\"24hrs\",X163=\"48hrs\",X163=\"72hrs\"),\"\",IF(X163=\"+72hrs\",\"Entregado\",CONSOLIDADO!S163)))","v":"En Ruta"},"","En Ruta",1,0,0,0,0,1,0,"No Entregado",0,0,1,0,{"$f":"IF(V163=\"Lima\",NETWORKDAYS.INTL(D163,M163,11,'Dias Feriados'!$A$1:$A$15),IF(AND(V163=\"provincia\",X163=\"24hrs\"),1,IF(AND(V163=\"provincia\",X163=\"48hrs\"),2,NETWORKDAYS.INTL(D163,M163,11,'Dias Feriados'!$A$1:$A$15))))","v":-39255}]
["B001667544","May","2025-05-27","2025-05-28","G/I. 030-10132",163,"YALILE MARILU HERENCIA TORREAL","III ETAPA 24 MZ F CASA DE 2 PISOS PPJJ SENOR DE LUREN","Provincia","ICA","ICA","B001667544",null,"En Ruta",9730017550,"F",202508,203201,"En Ruta","Dia 1","CARMEL","PROVINCIA",{"$f":"NETWORKDAYS.INTL(D164,M164,11,'Dias Feriados'!$A$1:$A$15)","v":-39255},"En Ruta",22,"NO",null,0.9375,0.94722222222222219,1,"CRUCES CHO","2025-05-28",null,null,45804,"",{"$f":"IF(AS164=\"Devuelto\",\"\",IF(X164=\"24hrs\",\"Entregado\",CONSOLIDADO!S164))","v":"En Ruta"},"",{"$f":"IF(AK164=\"Entregado\",\"\",IF(X164=\"24hrs\",\"\",IF(X164=\"48hrs\",\"Entregado\",CONSOLIDADO!S164)))","v":"En Ruta"},"",{"$f":"IF(AK164=\"Entregado\",\"\",IF(OR(X164=\"24hrs\",X164=\"48hrs\"),\"\",IF(X164=\"72hrs\",\"Entregado\",CONSOLIDADO!S164)))","v":"En Ruta"},"",{"$f":"IF(AK164=\"Entregado\",\"\",IF(OR(X164=\"24hrs\",X164=\"48hrs\",X164=\"72hrs\"),\"\",IF(X164=\"+72hrs\",\"Entregado\",CONSOLIDADO!S164)))","v":"En Ruta"},"","En Ruta",1,0,0,0,0,1,0,"No Entregado",0,0,1,0,{"$f":"IF(V164=\"Lima\",NETWORKDAYS.INTL(D164,M164,11,'Dias Feriados'!$A$1:$A$15),IF(AND(V164=\"provincia\",X164=\"24hrs\"),1,IF(AND(V164=\"provincia\",X164=\"48hrs\"),2,NETWORKDAYS.INTL(D164,M164,11,'Dias Feriados'!$A$1:$A$15))))","v":-39255}]
["B001667712","May","2025-05-27","2025-05-28","G/I. 030-10132",164,"ANGELLA KATHERINE MASSA OROZCO","CALLE CAJAMARCA 314 COSTADO DE LIBRERIA CHICOMA CALLA CAJAMARCA","Provincia","ICA","ICA","B001667712",null,"En Ruta",9730017563,"F",202508,203201,"En Ruta","Dia 1","CARMEL","PROVINCIA",{"$f":"NETWORKDAYS.INTL(D165,M165,11,'Dias Feriados'!$A$1:$A$15)","v":-39255},"En Ruta",22,"NO",null,0.9375,0.94722222222222219,1,"CRUCES CHO","2025-05-28",null,null,45804,"",{"$f":"IF(AS165=\"Devuelto\",\"\",IF(X165=\"24hrs\",\"Entregado\",CONSOLIDADO!S165))","v":"En Ruta"},"",{"$f":"IF(AK165=\"Entregado\",\"\",IF(X165=\"24hrs\",\"\",IF(X165=\"48hrs\",\"Entregado\",CONSOLIDADO!S165)))","v":"En Ruta"},"",{"$f":"IF(AK165=\"Entregado\",\"\",IF(OR(X165=\"24hrs\",X165=\"48hrs\"),\"\",IF(X165=\"72hrs\",\"Entregado\",CONSOLIDADO!S165)))","v":"En Ruta"},"",{"$f":"IF(AK165=\"Entregado\",\"\",IF(OR(X165=\"24hrs\",X165=\"48hrs\",X165=\"72hrs\"),\"\",IF(X165=\"+72hrs\",\"Entregado\",CONSOLIDADO!S165)))","v":"En Ruta"},"","En Ruta",1,0,0,0,0,1,0,"No Entregado",0,0,1,0,{"$f":"IF(V165=\"Lima\",NETWORKDAYS.INTL(D165,M165,11,'Dias Feriados'!$A$1:$A$15),IF(AND(V165=\"provincia\",X165=\"24hrs\"),1,IF(AND(V165=\"provincia\",X165=\"48hrs\"),2,NETWORKDAYS.INTL(D165,M165,11,'Dias Feriados'!$A$1:$A$15))))","v":-39255}]
["B001667759","May","2025-05-27","2025-05-28","G/I. 030-10132",165,"ELSA FIDENCIA MENDOZA HUAMANI","URB LAS CASUARINAS III ET F43 POR EL RESERVORIO","Provincia","ICA","ICA","B001667759",null,"En Ruta",9730017564,"F",202508,203201,"En Ruta","Dia 1","CARMEL","PROVINCIA",{"$f":"NETWORKDAYS.INTL(D166,M166,11,'Dias Feriados'!$A$1:$A$15)","v":-39255},"En Ruta",22,"NO",null,0.9375,0.94722222222222219,1,"CRUCES CHO","2025-05-28",null,null,45804,"",{"$f":"IF(AS166=\"Devuelto\",\"\",IF(X166=\"24hrs\",\"Entregado\",CONSOLIDADO!S166))","v":"En Ruta"},"",{"$f":"IF(AK166=\"Entregado\",\"\",IF(X166=\"24hrs\",\"\",IF(X166=\"48hrs\",\"Entregado\",CONSOLIDADO!S166)))","v":"En Ruta"},"",{"$f":"IF(AK166=\"Entregado\",\"\",IF(OR(X166=\"24hrs\",X166=\"48hrs\"),\"\",IF(X166=\"72hrs\",\"Entregado\",CONSOLIDADO!S166)))","v":"En Ruta"},"",{"$f":"IF(AK166=\"Entregado\",\"\",IF(OR(X166=\"24hrs\",X166=\"48hrs\",X166=\"72hrs\"),\"\",IF(X166=\"+72hrs\",\"Entregado\",CONSOLIDADO!S166)))","v":"En Ruta"},"","En Ruta",1,0,0,0,0,1,0,"No Entregado",0,0,1,0,{"$f":"IF(V166=\"Lima\",NETWORKDAYS.INTL(D166,M166,11,'Dias Feriados'!$A$1:$A$15),IF(AND(V166=\"provincia\",X166=\"24hrs\"),1,IF(AND(V166=\"provincia\",X166=\"48hrs\"),2,NETWORKDAYS.INTL(D166,M166,11,'Dias Feriados'!$A$1:$A$15))))","v":-39255}]
["B001667491","May","2025-05-27","2025-05-28","G/I. 030-10132",166,"CECILIA AUGUSTA MALQUI CALVERA","CLL RAUL BOZA D5 URB SANTA ROSA DEL PALMAR","Provincia","ICA","ICA","B001667491",null,"En Ruta",9730017573,"F",202508,203201,"En Ruta","Dia 1","CARMEL","PROVINCIA",{"$f":"NETWORKDAYS.INTL(D167,M167,11,'Dias Feriados'!$A$1:$A$15)","v":-39255},"En Ruta",22,"NO",null,0.9375,0.94722222222222219,1,"CRUCES CHO","2025-05-28",null,null,45804,"",{"$f":"IF(AS167=\"Devuelto\",\"\",IF(X167=\"24hrs\",\"Entregado\",CONSOLIDADO!S167))","v":"En Ruta"},"",{"$f":"IF(AK167=\"Entregado\",\"\",IF(X167=\"24hrs\",\"\",IF(X167=\"48hrs\",\"Entregado\",CONSOLIDADO!S167)))","v":"En Ruta"},"",{"$f":"IF(AK167=\"Entregado\",\"\",IF(OR(X167=\"24hrs\",X167=\"48hrs\"),\"\",IF(X167=\"72hrs\",\"Entregado\",CONSOLIDADO!S167)))","v":"En Ruta"},"",{"$f":"IF(AK167=\"Entregado\",\"\",IF(OR(X167=\"24hrs\",X167=\"48hrs\",X167=\"72hrs\"),\"\",IF(X167=\"+72hrs\",\"Entregado\",CONSOLIDADO!S167)))","v":"En Ruta"},"","En Ruta",1,0,0,0,0,1,0,"No Entregado",0,0,1,0,{"$f":"IF(V167=\"Lima\",NETWORKDAYS.INTL(D167,M167,11,'Dias Feriados'!$A$1:$A$15),IF(AND(V167=\"provincia\",X167=\"24hrs\"),1,IF(AND(V167=\"provincia\",X167=\"48hrs\"),2,NETWORKDAYS.INTL(D167,M167,11,'Dias Feriados'!$A$1:$A$15))))","v":-39255}]
["B001667787","May","2025-05-27","2025-05-28","G/I. 030-10132",167,"SELENA DIAZ CACHIQUE","SAN MATEO MZ M LT 20 DETRAS DE MAKRO PARQUE STO DOMINGO DE GUZMAN 1ERA ETAPA","Provincia","ICA","ICA","B001667787",null,"En Ruta",9730017586,"F",202508,203201,"En Ruta","Dia 1","CARMEL","PROVINCIA",{"$f":"NETWORKDAYS.INTL(D168,M168,11,'Dias Feriados'!$A$1:$A$15)","v":-39255},"En Ruta",22,"NO",null,0.9375,0.94722222222222219,1,"CRUCES CHO","2025-05-28",null,null,45804,"",{"$f":"IF(AS168=\"Devuelto\",\"\",IF(X168=\"24hrs\",\"Entregado\",CONSOLIDADO!S168))","v":"En Ruta"},"",{"$f":"IF(AK168=\"Entregado\",\"\",IF(X168=\"24hrs\",\"\",IF(X168=\"48hrs\",\"Entregado\",CONSOLIDADO!S168)))","v":"En Ruta"},"",{"$f":"IF(AK168=\"Entregado\",\"\",IF(OR(X168=\"24hrs\",X168=\"48hrs\"),\"\",IF(X168=\"72hrs\",\"Entregado\",CONSOLIDADO!S168)))","v":"En Ruta"},"",{"$f":"IF(AK168=\"Entregado\",\"\",IF(OR(X168=\"24hrs\",X168=\"48hrs\",X168=\"72hrs\"),\"\",IF(X168=\"+72hrs\",\"Entregado\",CONSOLIDADO!S168)))","v":"En Ruta"},"","En Ruta",1,0,0,0,0,1,0,"No Entregado",0,0,1,0,{"$f":"IF(V168=\"Lima\",NETWORKDAYS.INTL(D168,M168,11,'Dias Feriados'!$A$1:$A$15),IF(AND(V168=\"provincia\",X168=\"24hrs\"),1,IF(AND(V168=\"provincia\",X168=\"48hrs\"),2,NETWORKDAYS.INTL(D168,M168,11,'Dias Feriados'!$A$1:$A$15))))","v":-39255}]
["B001667495","May","2025-05-27","2025-05-28","G/I. 030-10132",168,"EVELYN ROSMERY SALCEDO INFANCI","PPJJ SENOR DE LUREN A34 PRIMERA ETAPA FRENTE A POLLERIA","Provincia","ICA","ICA","B001667495",null,"En Ruta",9730017608,"F",202508,203201,"En Ruta","Dia 1","CARMEL","PROVINCIA",{"$f":"NETWORKDAYS.INTL(D169,M169,11,'Dias Feriados'!$A$1:$A$15)","v":-39255},"En Ruta",22,"NO",null,0.9375,0.94722222222222219,1,"CRUCES CHO","2025-05-28",null,null,45804,"",{"$f":"IF(AS169=\"Devuelto\",\"\",IF(X169=\"24hrs\",\"Entregado\",CONSOLIDADO!S169))","v":"En Ruta"},"",{"$f":"IF(AK169=\"Entregado\",\"\",IF(X169=\"24hrs\",\"\",IF(X169=\"48hrs\",\"Entregado\",CONSOLIDADO!S169)))","v":"En Ruta"},"",{"$f":"IF(AK169=\"Entregado\",\"\",IF(OR(X169=\"24hrs\",X169=\"48hrs\"),\"\",IF(X169=\"72hrs\",\"Entregado\",CONSOLIDADO!S169)))","v":"En Ruta"},"",{"$f":"IF(AK169=\"Entregado\",\"\",IF(OR(X169=\"24hrs\",X169=\"48hrs\",X169=\"72hrs\"),\"\",IF(X169=\"+72hrs\",\"Entregado\",CONSOLIDADO!S169)))","v":"En Ruta"},"","En Ruta",1,0,0,0,0,1,0,"No Entregado",0,0,1,0,{"$f":"IF(V169=\"Lima\",NETWORKDAYS.INTL(D169,M169,11,'Dias Feriados'!$A$1:$A$15),IF(AND(V169=\"provincia\",X169=\"24hrs\"),1,IF(AND(V169=\"provincia\",X169=\"48hrs\"),2,NETWORKDAYS.INTL(D169,M169,11,'Dias Feriados'!$A$1:$A$15))))","v":-39255}]
["B001668164","May","2025-05-27","2025-05-28","G/I. 030-10132",169,"TASHIRA MADELEY BENDEZU ZEA","AV LOS ANGELES 217 URB SAN JOAQUIN","Provincia","ICA","ICA","B001668164",null,"En Ruta",9730018322,"F",202508,203201,"En Ruta","Dia 1","CARMEL","PROVINCIA",{"$f":"NETWORKDAYS.INTL(D170,M170,11,'Dias Feriados'!$A$1:$A$15)","v":-39255},"En Ruta",22,"NO",null,0.9375,0.94722222222222219,1,"CRUCES CHO","2025-05-28",null,null,45804,"",{"$f":"IF(AS170=\"Devuelto\",\"\",IF(X170=\"24hrs\",\"Entregado\",CONSOLIDADO!S170))","v":"En Ruta"},"",{"$f":"IF(AK170=\"Entregado\",\"\",IF(X170=\"24hrs\",\"\",IF(X170=\"48hrs\",\"Entregado\",CONSOLIDADO!S170)))","v":"En Ruta"},"",{"$f":"IF(AK170=\"Entregado\",\"\",IF(OR(X170=\"24hrs\",X170=\"48hrs\"),\"\",IF(X170=\"72hrs\",\"Entregado\",CONSOLIDADO!S170)))","v":"En Ruta"},"",{"$f":"IF(AK170=\"Entregado\",\"\",IF(OR(X170=\"24hrs\",X170=\"48hrs\",X170=\"72hrs\"),\"\",IF(X170=\"+72hrs\",\"Entregado\",CONSOLIDADO!S170)))","v":"En Ruta"},"","En Ruta",1,0,0,0,0,1,0,"No Entregado",0,0,1,0,{"$f":"IF(V170=\"Lima\",NETWORKDAYS.INTL(D170,M170,11,'Dias Feriados'!$A$1:$A$15),IF(AND(V170=\"provincia\",X170=\"24hrs\"),1,IF(AND(V170=\"provincia\",X170=\"48hrs\"),2,NETWORKDAYS.INTL(D170,M170,11,'Dias Feriados'!$A$1:$A$15))))","v":-39255}]
["B001667427","May","2025-05-27","2025-05-28","G/I. 030-10132",170,"SHIRLEY ANDREA HUAMAN APOLAYA","AV VICTORIO GOTUZZO 979 ROCOTO","Provincia","ICA","LA TINGUIÑA","B001667427",null,"En Ruta",9730017061,"F",202508,203201,"En Ruta","Dia 1","CARMEL","PROVINCIA",{"$f":"NETWORKDAYS.INTL(D171,M171,11,'Dias Feriados'!$A$1:$A$15)","v":-39255},"En Ruta",22,"NO",null,0.9375,0.94722222222222219,1,"CRUCES CHO","2025-05-28",null,null,45804,"",{"$f":"IF(AS171=\"Devuelto\",\"\",IF(X171=\"24hrs\",\"Entregado\",CONSOLIDADO!S171))","v":"En Ruta"},"",{"$f":"IF(AK171=\"Entregado\",\"\",IF(X171=\"24hrs\",\"\",IF(X171=\"48hrs\",\"Entregado\",CONSOLIDADO!S171)))","v":"En Ruta"},"",{"$f":"IF(AK171=\"Entregado\",\"\",IF(OR(X171=\"24hrs\",X171=\"48hrs\"),\"\",IF(X171=\"72hrs\",\"Entregado\",CONSOLIDADO!S171)))","v":"En Ruta"},"",{"$f":"IF(AK171=\"Entregado\",\"\",IF(OR(X171=\"24hrs\",X171=\"48hrs\",X171=\"72hrs\"),\"\",IF(X171=\"+72hrs\",\"Entregado\",CONSOLIDADO!S171)))","v":"En Ruta"},"","En Ruta",1,0,0,0,0,1,0,"No Entregado",0,0,1,0,{"$f":"IF(V171=\"Lima\",NETWORKDAYS.INTL(D171,M171,11,'Dias Feriados'!$A$1:$A$15),IF(AND(V171=\"provincia\",X171=\"24hrs\"),1,IF(AND(V171=\"provincia\",X171=\"48hrs\"),2,NETWORKDAYS.INTL(D171,M171,11,'Dias Feriados'!$A$1:$A$15))))","v":-39255}]
["B001667665","May","2025-05-27","2025-05-28","G/I. 030-10132",171,"GLADYS TERESA GIANELLO SANCHEZ","JULIO CEVASCO 226 POR PLAZUELA VIRGEN MARIA DE LAS NIEVES","Provincia","ICA","LA TINGUIÑA","B001667665",null,"En Ruta",9730017089,"F",202508,203201,"En Ruta","Dia 1","CARMEL","PROVINCIA",{"$f":"NETWORKDAYS.INTL(D172,M172,11,'Dias Feriados'!$A$1:$A$15)","v":-39255},"En Ruta",22,"NO",null,0.9375,0.94722222222222219,1,"CRUCES CHO","2025-05-28",null,null,45804,"",{"$f":"IF(AS172=\"Devuelto\",\"\",IF(X172=\"24hrs\",\"Entregado\",CONSOLIDADO!S172))","v":"En Ruta"},"",{"$f":"IF(AK172=\"Entregado\",\"\",IF(X172=\"24hrs\",\"\",IF(X172=\"48hrs\",\"Entregado\",CONSOLIDADO!S172)))","v":"En Ruta"},"",{"$f":"IF(AK172=\"Entregado\",\"\",IF(OR(X172=\"24hrs\",X172=\"48hrs\"),\"\",IF(X172=\"72hrs\",\"Entregado\",CONSOLIDADO!S172)))","v":"En Ruta"},"",{"$f":"IF(AK172=\"Entregado\",\"\",IF(OR(X172=\"24hrs\",X172=\"48hrs\",X172=\"72hrs\"),\"\",IF(X172=\"+72hrs\",\"Entregado\",CONSOLIDADO!S172)))","v":"En Ruta"},"","En Ruta",1,0,0,0,0,1,0,"No Entregado",0,0,1,0,{"$f":"IF(V172=\"Lima\",NETWORKDAYS.INTL(D172,M172,11,'Dias Feriados'!$A$1:$A$15),IF(AND(V172=\"provincia\",X172=\"24hrs\"),1,IF(AND(V172=\"provincia\",X172=\"48hrs\"),2,NETWORKDAYS.INTL(D172,M172,11,'Dias Feriados'!$A$1:$A$15))))","v":-39255}]
["B001667476","May","2025-05-27","2025-05-28","G/I. 030-10132",172,"MELCY ROSELA DAVALOS HUAYTALLA","AV EL PAR 528 POSTERIOR DEL ESTADIO","Provincia","ICA","LA TINGUIÑA","B001667476",null,"En Ruta",9730017150,"F",202508,203201,"En Ruta","Dia 1","CARMEL","PROVINCIA",{"$f":"NETWORKDAYS.INTL(D173,M173,11,'Dias Feriados'!$A$1:$A$15)","v":-39255},"En Ruta",22,"NO",null,0.9375,0.94722222222222219,1,"CRUCES CHO","2025-05-28",null,null,45804,"",{"$f":"IF(AS173=\"Devuelto\",\"\",IF(X173=\"24hrs\",\"Entregado\",CONSOLIDADO!S173))","v":"En Ruta"},"",{"$f":"IF(AK173=\"Entregado\",\"\",IF(X173=\"24hrs\",\"\",IF(X173=\"48hrs\",\"Entregado\",CONSOLIDADO!S173)))","v":"En Ruta"},"",{"$f":"IF(AK173=\"Entregado\",\"\",IF(OR(X173=\"24hrs\",X173=\"48hrs\"),\"\",IF(X173=\"72hrs\",\"Entregado\",CONSOLIDADO!S173)))","v":"En Ruta"},"",{"$f":"IF(AK173=\"Entregado\",\"\",IF(OR(X173=\"24hrs\",X173=\"48hrs\",X173=\"72hrs\"),\"\",IF(X173=\"+72hrs\",\"Entregado\",CONSOLIDADO!S173)))","v":"En Ruta"},"","En Ruta",1,0,0,0,0,1,0,"No Entregado",0,0,1,0,{"$f":"IF(V173=\"Lima\",NETWORKDAYS.INTL(D173,M173,11,'Dias Feriados'!$A$1:$A$15),IF(AND(V173=\"provincia\",X173=\"24hrs\"),1,IF(AND(V173=\"provincia\",X173=\"48hrs\"),2,NETWORKDAYS.INTL(D173,M173,11,'Dias Feriados'!$A$1:$A$15))))","v":-39255}]
["B001667418","May","2025-05-27","2025-05-28","G/I. 030-10132",173,"ROSA MARIA ESCALAYA RAMOS DE T","AV MANCO CAPAC 181 CAMINO A LOS MOLINOS","Provincia","ICA","LA TINGUIÑA","B001667418",null,"En Ruta",9730017160,"F",202508,203201,"En Ruta","Dia 1","CARMEL","PROVINCIA",{"$f":"NETWORKDAYS.INTL(D174,M174,11,'Dias Feriados'!$A$1:$A$15)","v":-39255},"En Ruta",22,"NO",null,0.9375,0.94722222222222219,1,"CRUCES CHO","2025-05-28",null,null,45804,"",{"$f":"IF(AS174=\"Devuelto\",\"\",IF(X174=\"24hrs\",\"Entregado\",CONSOLIDADO!S174))","v":"En Ruta"},"",{"$f":"IF(AK174=\"Entregado\",\"\",IF(X174=\"24hrs\",\"\",IF(X174=\"48hrs\",\"Entregado\",CONSOLIDADO!S174)))","v":"En Ruta"},"",{"$f":"IF(AK174=\"Entregado\",\"\",IF(OR(X174=\"24hrs\",X174=\"48hrs\"),\"\",IF(X174=\"72hrs\",\"Entregado\",CONSOLIDADO!S174)))","v":"En Ruta"},"",{"$f":"IF(AK174=\"Entregado\",\"\",IF(OR(X174=\"24hrs\",X174=\"48hrs\",X174=\"72hrs\"),\"\",IF(X174=\"+72hrs\",\"Entregado\",CONSOLIDADO!S174)))","v":"En Ruta"},"","En Ruta",1,0,0,0,0,1,0,"No Entregado",0,0,1,0,{"$f":"IF(V174=\"Lima\",NETWORKDAYS.INTL(D174,M174,11,'Dias Feriados'!$A$1:$A$15),IF(AND(V174=\"provincia\",X174=\"24hrs\"),1,IF(AND(V174=\"provincia\",X174=\"48hrs\"),2,NETWORKDAYS.INTL(D174,M174,11,'Dias Feriados'!$A$1:$A$15))))","v":-39255}]
["B001667566","May","2025-05-27","2025-05-28","G/I. 030-10132",174,"ANA TINCO GARCIA","AMISTAD 334 MZ 11P LT A PORTON CELESTE LAS PERLAS","Provincia","ICA","LA TINGUIÑA","B001667566",null,"En Ruta",9730017161,"F",202508,203201,"En Ruta","Dia 1","CARMEL","PROVINCIA",{"$f":"NETWORKDAYS.INTL(D175,M175,11,'Dias Feriados'!$A$1:$A$15)","v":-39255},"En Ruta",22,"NO",null,0.9375,0.94722222222222219,1,"CRUCES CHO","2025-05-28",null,null,45804,"",{"$f":"IF(AS175=\"Devuelto\",\"\",IF(X175=\"24hrs\",\"Entregado\",CONSOLIDADO!S175))","v":"En Ruta"},"",{"$f":"IF(AK175=\"Entregado\",\"\",IF(X175=\"24hrs\",\"\",IF(X175=\"48hrs\",\"Entregado\",CONSOLIDADO!S175)))","v":"En Ruta"},"",{"$f":"IF(AK175=\"Entregado\",\"\",IF(OR(X175=\"24hrs\",X175=\"48hrs\"),\"\",IF(X175=\"72hrs\",\"Entregado\",CONSOLIDADO!S175)))","v":"En Ruta"},"",{"$f":"IF(AK175=\"Entregado\",\"\",IF(OR(X175=\"24hrs\",X175=\"48hrs\",X175=\"72hrs\"),\"\",IF(X175=\"+72hrs\",\"Entregado\",CONSOLIDADO!S175)))","v":"En Ruta"},"","En Ruta",1,0,0,0,0,1,0,"No Entregado",0,0,1,0,{"$f":"IF(V175=\"Lima\",NETWORKDAYS.INTL(D175,M175,11,'Dias Feriados'!$A$1:$A$15),IF(AND(V175=\"provincia\",X175=\"24hrs\"),1,IF(AND(V175=\"provincia\",X175=\"48hrs\"),2,NETWORKDAYS.INTL(D175,M175,11,'Dias Feriados'!$A$1:$A$15))))","v":-39255}]
["B001667708","May","2025-05-27","2025-05-28","G/I. 030-10132",175,"SINTIA LISBET ROJAS GARCIA","AV HABANA 975 COL MICAELA A DOS CDRAS","Provincia","ICA","LA TINGUIÑA","B001667708",null,"En Ruta",9730017162,"F",202508,203201,"En Ruta","Dia 1","CARMEL","PROVINCIA",{"$f":"NETWORKDAYS.INTL(D176,M176,11,'Dias Feriados'!$A$1:$A$15)","v":-39255},"En Ruta",22,"NO",null,0.9375,0.94722222222222219,1,"CRUCES CHO","2025-05-28",null,null,45804,"",{"$f":"IF(AS176=\"Devuelto\",\"\",IF(X176=\"24hrs\",\"Entregado\",CONSOLIDADO!S176))","v":"En Ruta"},"",{"$f":"IF(AK176=\"Entregado\",\"\",IF(X176=\"24hrs\",\"\",IF(X176=\"48hrs\",\"Entregado\",CONSOLIDADO!S176)))","v":"En Ruta"},"",{"$f":"IF(AK176=\"Entregado\",\"\",IF(OR(X176=\"24hrs\",X176=\"48hrs\"),\"\",IF(X176=\"72hrs\",\"Entregado\",CONSOLIDADO!S176)))","v":"En Ruta"},"",{"$f":"IF(AK176=\"Entregado\",\"\",IF(OR(X176=\"24hrs\",X176=\"48hrs\",X176=\"72hrs\"),\"\",IF(X176=\"+72hrs\",\"Entregado\",CONSOLIDADO!S176)))","v":"En Ruta"},"","En Ruta",1,0,0,0,0,1,0,"No Entregado",0,0,1,0,{"$f":"IF(V176=\"Lima\",NETWORKDAYS.INTL(D176,M176,11,'Dias Feriados'!$A$1:$A$15),IF(AND(V176=\"provincia\",X176=\"24hrs\"),1,IF(AND(V176=\"provincia\",X176=\"48hrs\"),2,NETWORKDAYS.INTL(D176,M176,11,'Dias Feriados'!$A$1:$A$15))))","v":-39255}]
["B001667486","May","2025-05-27","2025-05-28","G/I. 030-10132",176,"CINTHYA NEVENKA CAMACHO LIMACH","AV BERNA 160 LA TINGUINA DEL PODER JUDICIAL 5 CDRAS","Provincia","ICA","LA TINGUIÑA","B001667486",null,"En Ruta",9730017203,"F",202508,203201,"En Ruta","Dia 1","CARMEL","PROVINCIA",{"$f":"NETWORKDAYS.INTL(D177,M177,11,'Dias Feriados'!$A$1:$A$15)","v":-39255},"En Ruta",22,"NO",null,0.9375,0.94722222222222219,1,"CRUCES CHO","2025-05-28",null,null,45804,"",{"$f":"IF(AS177=\"Devuelto\",\"\",IF(X177=\"24hrs\",\"Entregado\",CONSOLIDADO!S177))","v":"En Ruta"},"",{"$f":"IF(AK177=\"Entregado\",\"\",IF(X177=\"24hrs\",\"\",IF(X177=\"48hrs\",\"Entregado\",CONSOLIDADO!S177)))","v":"En Ruta"},"",{"$f":"IF(AK177=\"Entregado\",\"\",IF(OR(X177=\"24hrs\",X177=\"48hrs\"),\"\",IF(X177=\"72hrs\",\"Entregado\",CONSOLIDADO!S177)))","v":"En Ruta"},"",{"$f":"IF(AK177=\"Entregado\",\"\",IF(OR(X177=\"24hrs\",X177=\"48hrs\",X177=\"72hrs\"),\"\",IF(X177=\"+72hrs\",\"Entregado\",CONSOLIDADO!S177)))","v":"En Ruta"},"","En Ruta",1,0,0,0,0,1,0,"No Entregado",0,0,1,0,{"$f":"IF(V177=\"Lima\",NETWORKDAYS.INTL(D177,M177,11,'Dias Feriados'!$A$1:$A$15),IF(AND(V177=\"provincia\",X177=\"24hrs\"),1,IF(AND(V177=\"provincia\",X177=\"48hrs\"),2,NETWORKDAYS.INTL(D177,M177,11,'Dias Feriados'!$A$1:$A$15))))","v":-39255}]
["B001667561","May","2025-05-27","2025-05-28","G/I. 030-10132",177,"FABIOLA MARICEL BARAHONA CAMAN","AV ROMA 148 PODER JUDICIAL TRES CUADRA ASI ARRIBA","Provincia","ICA","LA TINGUIÑA","B001667561",null,"En Ruta",9730017206,"F",202508,203201,"En Ruta","Dia 1","CARMEL","PROVINCIA",{"$f":"NETWORKDAYS.INTL(D178,M178,11,'Dias Feriados'!$A$1:$A$15)","v":-39255},"En Ruta",22,"NO",null,0.9375,0.94722222222222219,1,"CRUCES CHO","2025-05-28",null,null,45804,"",{"$f":"IF(AS178=\"Devuelto\",\"\",IF(X178=\"24hrs\",\"Entregado\",CONSOLIDADO!S178))","v":"En Ruta"},"",{"$f":"IF(AK178=\"Entregado\",\"\",IF(X178=\"24hrs\",\"\",IF(X178=\"48hrs\",\"Entregado\",CONSOLIDADO!S178)))","v":"En Ruta"},"",{"$f":"IF(AK178=\"Entregado\",\"\",IF(OR(X178=\"24hrs\",X178=\"48hrs\"),\"\",IF(X178=\"72hrs\",\"Entregado\",CONSOLIDADO!S178)))","v":"En Ruta"},"",{"$f":"IF(AK178=\"Entregado\",\"\",IF(OR(X178=\"24hrs\",X178=\"48hrs\",X178=\"72hrs\"),\"\",IF(X178=\"+72hrs\",\"Entregado\",CONSOLIDADO!S178)))","v":"En Ruta"},"","En Ruta",1,0,0,0,0,1,0,"No Entregado",0,0,1,0,{"$f":"IF(V178=\"Lima\",NETWORKDAYS.INTL(D178,M178,11,'Dias Feriados'!$A$1:$A$15),IF(AND(V178=\"provincia\",X178=\"24hrs\"),1,IF(AND(V178=\"provincia\",X178=\"48hrs\"),2,NETWORKDAYS.INTL(D178,M178,11,'Dias Feriados'!$A$1:$A$15))))","v":-39255}]
["B001667516","May","2025-05-27","2025-05-28","G/I. 030-10132",178,"FANNY PAMELA LAINEZ LLUEN","CL 11 DE SETIEMBRE 452 LOZA DEPORTIVA EL ABANQUINO","Provincia","ICA","LA TINGUIÑA","B001667516",null,"En Ruta",9730017248,"F",202508,203201,"En Ruta","Dia 1","CARMEL","PROVINCIA",{"$f":"NETWORKDAYS.INTL(D179,M179,11,'Dias Feriados'!$A$1:$A$15)","v":-39255},"En Ruta",22,"NO",null,0.9375,0.94722222222222219,1,"CRUCES CHO","2025-05-28",null,null,45804,"",{"$f":"IF(AS179=\"Devuelto\",\"\",IF(X179=\"24hrs\",\"Entregado\",CONSOLIDADO!S179))","v":"En Ruta"},"",{"$f":"IF(AK179=\"Entregado\",\"\",IF(X179=\"24hrs\",\"\",IF(X179=\"48hrs\",\"Entregado\",CONSOLIDADO!S179)))","v":"En Ruta"},"",{"$f":"IF(AK179=\"Entregado\",\"\",IF(OR(X179=\"24hrs\",X179=\"48hrs\"),\"\",IF(X179=\"72hrs\",\"Entregado\",CONSOLIDADO!S179)))","v":"En Ruta"},"",{"$f":"IF(AK179=\"Entregado\",\"\",IF(OR(X179=\"24hrs\",X179=\"48hrs\",X179=\"72hrs\"),\"\",IF(X179=\"+72hrs\",\"Entregado\",CONSOLIDADO!S179)))","v":"En Ruta"},"","En Ruta",1,0,0,0,0,1,0,"No Entregado",0,0,1,0,{"$f":"IF(V179=\"Lima\",NETWORKDAYS.INTL(D179,M179,11,'Dias Feriados'!$A$1:$A$15),IF(AND(V179=\"provincia\",X179=\"24hrs\"),1,IF(AND(V179=\"provincia\",X179=\"48hrs\"),2,NETWORKDAYS.INTL(D179,M179,11,'Dias Feriados'!$A$1:$A$15))))","v":-39255}]
["B001667366","May","2025-05-27","2025-05-28","G/I. 030-10132",179,"CAMILA EDITA URBANO RAMOS","VIENA 776 ALTURA DE LA 5TA CUADRA CASA DE 2 PISOS TINGUINA ALTA","Provincia","ICA","LA TINGUIÑA","B001667366",null,"En Ruta",9730017264,"F",202508,203201,"En Ruta","Dia 1","CARMEL","PROVINCIA",{"$f":"NETWORKDAYS.INTL(D180,M180,11,'Dias Feriados'!$A$1:$A$15)","v":-39255},"En Ruta",22,"NO",null,0.9375,0.94722222222222219,1,"CRUCES CHO","2025-05-28",null,null,45804,"",{"$f":"IF(AS180=\"Devuelto\",\"\",IF(X180=\"24hrs\",\"Entregado\",CONSOLIDADO!S180))","v":"En Ruta"},"",{"$f":"IF(AK180=\"Entregado\",\"\",IF(X180=\"24hrs\",\"\",IF(X180=\"48hrs\",\"Entregado\",CONSOLIDADO!S180)))","v":"En Ruta"},"",{"$f":"IF(AK180=\"Entregado\",\"\",IF(OR(X180=\"24hrs\",X180=\"48hrs\"),\"\",IF(X180=\"72hrs\",\"Entregado\",CONSOLIDADO!S180)))","v":"En Ruta"},"",{"$f":"IF(AK180=\"Entregado\",\"\",IF(OR(X180=\"24hrs\",X180=\"48hrs\",X180=\"72hrs\"),\"\",IF(X180=\"+72hrs\",\"Entregado\",CONSOLIDADO!S180)))","v":"En Ruta"},"","En Ruta",1,0,0,0,0,1,0,"No Entregado",0,0,1,0,{"$f":"IF(V180=\"Lima\",NETWORKDAYS.INTL(D180,M180,11,'Dias Feriados'!$A$1:$A$15),IF(AND(V180=\"provincia\",X180=\"24hrs\"),1,IF(AND(V180=\"provincia\",X180=\"48hrs\"),2,NETWORKDAYS.INTL(D180,M180,11,'Dias Feriados'!$A$1:$A$15))))","v":-39255}]
["B001667352","May","2025-05-27","2025-05-28","G/I. 030-10132",180,"CARMEN ROSA BORDA MARTINEZ","AV DANIEL OLAECHEA 356 LA FISCALIA CETRO VIGEN MAYOR","Provincia","ICA","LA TINGUIÑA","B001667352",null,"En Ruta",9730017279,"F",202508,203201,"En Ruta","Dia 1","CARMEL","PROVINCIA",{"$f":"NETWORKDAYS.INTL(D181,M181,11,'Dias Feriados'!$A$1:$A$15)","v":-39255},"En Ruta",22,"NO",null,0.9375,0.94722222222222219,1,"CRUCES CHO","2025-05-28",null,null,45804,"",{"$f":"IF(AS181=\"Devuelto\",\"\",IF(X181=\"24hrs\",\"Entregado\",CONSOLIDADO!S181))","v":"En Ruta"},"",{"$f":"IF(AK181=\"Entregado\",\"\",IF(X181=\"24hrs\",\"\",IF(X181=\"48hrs\",\"Entregado\",CONSOLIDADO!S181)))","v":"En Ruta"},"",{"$f":"IF(AK181=\"Entregado\",\"\",IF(OR(X181=\"24hrs\",X181=\"48hrs\"),\"\",IF(X181=\"72hrs\",\"Entregado\",CONSOLIDADO!S181)))","v":"En Ruta"},"",{"$f":"IF(AK181=\"Entregado\",\"\",IF(OR(X181=\"24hrs\",X181=\"48hrs\",X181=\"72hrs\"),\"\",IF(X181=\"+72hrs\",\"Entregado\",CONSOLIDADO!S181)))","v":"En Ruta"},"","En Ruta",1,0,0,0,0,1,0,"No Entregado",0,0,1,0,{"$f":"IF(V181=\"Lima\",NETWORKDAYS.INTL(D181,M181,11,'Dias Feriados'!$A$1:$A$15),IF(AND(V181=\"provincia\",X181=\"24hrs\"),1,IF(AND(V181=\"provincia\",X181=\"48hrs\"),2,NETWORKDAYS.INTL(D181,M181,11,'Dias Feriados'!$A$1:$A$15))))","v":-39255}]
["B001667397","May","2025-05-27","2025-05-28","G/I. 030-10132",181,"MARIBEL LIZBETH CARBAJAL ALALU","AV LONDRES 307 UNA CUADRA ANTES DE LA LA PLAZUELA JOSE AVENIDA","Provincia","ICA","LA TINGUIÑA","B001667397",null,"En Ruta",9730017331,"F",202508,203201,"En Ruta","Dia 1","CARMEL","PROVINCIA",{"$f":"NETWORKDAYS.INTL(D182,M182,11,'Dias Feriados'!$A$1:$A$15)","v":-39255},"En Ruta",22,"NO",null,0.9375,0.94722222222222219,1,"CRUCES CHO","2025-05-28",null,null,45804,"",{"$f":"IF(AS182=\"Devuelto\",\"\",IF(X182=\"24hrs\",\"Entregado\",CONSOLIDADO!S182))","v":"En Ruta"},"",{"$f":"IF(AK182=\"Entregado\",\"\",IF(X182=\"24hrs\",\"\",IF(X182=\"48hrs\",\"Entregado\",CONSOLIDADO!S182)))","v":"En Ruta"},"",{"$f":"IF(AK182=\"Entregado\",\"\",IF(OR(X182=\"24hrs\",X182=\"48hrs\"),\"\",IF(X182=\"72hrs\",\"Entregado\",CONSOLIDADO!S182)))","v":"En Ruta"},"",{"$f":"IF(AK182=\"Entregado\",\"\",IF(OR(X182=\"24hrs\",X182=\"48hrs\",X182=\"72hrs\"),\"\",IF(X182=\"+72hrs\",\"Entregado\",CONSOLIDADO!S182)))","v":"En Ruta"},"","En Ruta",1,0,0,0,0,1,0,"No Entregado",0,0,1,0,{"$f":"IF(V182=\"Lima\",NETWORKDAYS.INTL(D182,M182,11,'Dias Feriados'!$A$1:$A$15),IF(AND(V182=\"provincia\",X182=\"24hrs\"),1,IF(AND(V182=\"provincia\",X182=\"48hrs\"),2,NETWORKDAYS.INTL(D182,M182,11,'Dias Feriados'!$A$1:$A$15))))","v":-39255}]
["B001667620","May","2025-05-27","2025-05-28","G/I. 030-10132",182,"IZABEL BEATRIZ PRADO GOMEZ","AV LONDRES 226 REF UNA CUADRA ANTES DEL SEGURO LONDRES C","Provincia","ICA","LA TINGUIÑA","B001667620",null,"En Ruta",9730017383,"F",202508,203201,"En Ruta","Dia 1","CARMEL","PROVINCIA",{"$f":"NETWORKDAYS.INTL(D183,M183,11,'Dias Feriados'!$A$1:$A$15)","v":-39255},"En Ruta",22,"NO",null,0.9375,0.94722222222222219,1,"CRUCES CHO","2025-05-28",null,null,45804,"",{"$f":"IF(AS183=\"Devuelto\",\"\",IF(X183=\"24hrs\",\"Entregado\",CONSOLIDADO!S183))","v":"En Ruta"},"",{"$f":"IF(AK183=\"Entregado\",\"\",IF(X183=\"24hrs\",\"\",IF(X183=\"48hrs\",\"Entregado\",CONSOLIDADO!S183)))","v":"En Ruta"},"",{"$f":"IF(AK183=\"Entregado\",\"\",IF(OR(X183=\"24hrs\",X183=\"48hrs\"),\"\",IF(X183=\"72hrs\",\"Entregado\",CONSOLIDADO!S183)))","v":"En Ruta"},"",{"$f":"IF(AK183=\"Entregado\",\"\",IF(OR(X183=\"24hrs\",X183=\"48hrs\",X183=\"72hrs\"),\"\",IF(X183=\"+72hrs\",\"Entregado\",CONSOLIDADO!S183)))","v":"En Ruta"},"","En Ruta",1,0,0,0,0,1,0,"No Entregado",0,0,1,0,{"$f":"IF(V183=\"Lima\",NETWORKDAYS.INTL(D183,M183,11,'Dias Feriados'!$A$1:$A$15),IF(AND(V183=\"provincia\",X183=\"24hrs\"),1,IF(AND(V183=\"provincia\",X183=\"48hrs\"),2,NETWORKDAYS.INTL(D183,M183,11,'Dias Feriados'!$A$1:$A$15))))","v":-39255}]
["B001667533","May","2025-05-27","2025-05-28","G/I. 030-10132",183,"LADY DEL ROSARIO HUAYANCA PERE","VILLA CLUB F 48 ANTES DE LLEGAR AL CRUCE DE LA TINGUINA","Provincia","ICA","LA TINGUIÑA","B001667533",null,"En Ruta",9730017387,"F",202508,203201,"En Ruta","Dia 1","CARMEL","PROVINCIA",{"$f":"NETWORKDAYS.INTL(D184,M184,11,'Dias Feriados'!$A$1:$A$15)","v":-39255},"En Ruta",22,"NO",null,0.9375,0.94722222222222219,1,"CRUCES CHO","2025-05-28",null,null,45804,"",{"$f":"IF(AS184=\"Devuelto\",\"\",IF(X184=\"24hrs\",\"Entregado\",CONSOLIDADO!S184))","v":"En Ruta"},"",{"$f":"IF(AK184=\"Entregado\",\"\",IF(X184=\"24hrs\",\"\",IF(X184=\"48hrs\",\"Entregado\",CONSOLIDADO!S184)))","v":"En Ruta"},"",{"$f":"IF(AK184=\"Entregado\",\"\",IF(OR(X184=\"24hrs\",X184=\"48hrs\"),\"\",IF(X184=\"72hrs\",\"Entregado\",CONSOLIDADO!S184)))","v":"En Ruta"},"",{"$f":"IF(AK184=\"Entregado\",\"\",IF(OR(X184=\"24hrs\",X184=\"48hrs\",X184=\"72hrs\"),\"\",IF(X184=\"+72hrs\",\"Entregado\",CONSOLIDADO!S184)))","v":"En Ruta"},"","En Ruta",1,0,0,0,0,1,0,"No Entregado",0,0,1,0,{"$f":"IF(V184=\"Lima\",NETWORKDAYS.INTL(D184,M184,11,'Dias Feriados'!$A$1:$A$15),IF(AND(V184=\"provincia\",X184=\"24hrs\"),1,IF(AND(V184=\"provincia\",X184=\"48hrs\"),2,NETWORKDAYS.INTL(D184,M184,11,'Dias Feriados'!$A$1:$A$15))))","v":-39255}]
["B001667451","May","2025-05-27","2025-05-28","G/I. 030-10132",184,"ISABEL KAROLINA MENESES ANTAYA","LAS CASAS NUEVAS 2DA ETAPA AI30 URB SAN IDELFONSO","Provincia","ICA","LA TINGUIÑA","B001667451",null,"En Ruta",9730017402,"F",202508,203201,"En Ruta","Dia 1","CARMEL","PROVINCIA",{"$f":"NETWORKDAYS.INTL(D185,M185,11,'Dias Feriados'!$A$1:$A$15)","v":-39255},"En Ruta",22,"NO",null,0.9375,0.94722222222222219,1,"CRUCES CHO","2025-05-28",null,null,45804,"",{"$f":"IF(AS185=\"Devuelto\",\"\",IF(X185=\"24hrs\",\"Entregado\",CONSOLIDADO!S185))","v":"En Ruta"},"",{"$f":"IF(AK185=\"Entregado\",\"\",IF(X185=\"24hrs\",\"\",IF(X185=\"48hrs\",\"Entregado\",CONSOLIDADO!S185)))","v":"En Ruta"},"",{"$f":"IF(AK185=\"Entregado\",\"\",IF(OR(X185=\"24hrs\",X185=\"48hrs\"),\"\",IF(X185=\"72hrs\",\"Entregado\",CONSOLIDADO!S185)))","v":"En Ruta"},"",{"$f":"IF(AK185=\"Entregado\",\"\",IF(OR(X185=\"24hrs\",X185=\"48hrs\",X185=\"72hrs\"),\"\",IF(X185=\"+72hrs\",\"Entregado\",CONSOLIDADO!S185)))","v":"En Ruta"},"","En Ruta",1,0,0,0,0,1,0,"No Entregado",0,0,1,0,{"$f":"IF(V185=\"Lima\",NETWORKDAYS.INTL(D185,M185,11,'Dias Feriados'!$A$1:$A$15),IF(AND(V185=\"provincia\",X185=\"24hrs\"),1,IF(AND(V185=\"provincia\",X185=\"48hrs\"),2,NETWORKDAYS.INTL(D185,M185,11,'Dias Feriados'!$A$1:$A$15))))","v":-39255}]
["B001667574","May","2025-05-27","2025-05-28","G/I. 030-10132",185,"JUDY ROSA NINO DE GUZMAN SANCH","AV ARMANDO REVOREDO 599 ENTRE PARCONA Y TINGUINA","Provincia","ICA","LA TINGUIÑA","B001667574",null,"En Ruta",9730017407,"F",202508,203201,"En Ruta","Dia 1","CARMEL","PROVINCIA",{"$f":"NETWORKDAYS.INTL(D186,M186,11,'Dias Feriados'!$A$1:$A$15)","v":-39255},"En Ruta",22,"NO",null,0.9375,0.94722222222222219,1,"CRUCES CHO","2025-05-28",null,null,45804,"",{"$f":"IF(AS186=\"Devuelto\",\"\",IF(X186=\"24hrs\",\"Entregado\",CONSOLIDADO!S186))","v":"En Ruta"},"",{"$f":"IF(AK186=\"Entregado\",\"\",IF(X186=\"24hrs\",\"\",IF(X186=\"48hrs\",\"Entregado\",CONSOLIDADO!S186)))","v":"En Ruta"},"",{"$f":"IF(AK186=\"Entregado\",\"\",IF(OR(X186=\"24hrs\",X186=\"48hrs\"),\"\",IF(X186=\"72hrs\",\"Entregado\",CONSOLIDADO!S186)))","v":"En Ruta"},"",{"$f":"IF(AK186=\"Entregado\",\"\",IF(OR(X186=\"24hrs\",X186=\"48hrs\",X186=\"72hrs\"),\"\",IF(X186=\"+72hrs\",\"Entregado\",CONSOLIDADO!S186)))","v":"En Ruta"},"","En Ruta",1,0,0,0,0,1,0,"No Entregado",0,0,1,0,{"$f":"IF(V186=\"Lima\",NETWORKDAYS.INTL(D186,M186,11,'Dias Feriados'!$A$1:$A$15),IF(AND(V186=\"provincia\",X186=\"24hrs\"),1,IF(AND(V186=\"provincia\",X186=\"48hrs\"),2,NETWORKDAYS.INTL(D186,M186,11,'Dias Feriados'!$A$1:$A$15))))","v":-39255}]
["B001667379","May","2025-05-27","2025-05-28","G/I. 030-10132",186,"GIANELLA ANGELITA YATACO MEJIA","AV VIENA 776 ESPALDA DEL COLEGIO MERINO RUIZ AV VIENA TINGUINA ALTA","Provincia","ICA","LA TINGUIÑA","B001667379",null,"En Ruta",9730017419,"F",202508,203201,"En Ruta","Dia 1","CARMEL","PROVINCIA",{"$f":"NETWORKDAYS.INTL(D187,M187,11,'Dias Feriados'!$A$1:$A$15)","v":-39255},"En Ruta",22,"NO",null,0.9375,0.94722222222222219,1,"CRUCES CHO","2025-05-28",null,null,45804,"",{"$f":"IF(AS187=\"Devuelto\",\"\",IF(X187=\"24hrs\",\"Entregado\",CONSOLIDADO!S187))","v":"En Ruta"},"",{"$f":"IF(AK187=\"Entregado\",\"\",IF(X187=\"24hrs\",\"\",IF(X187=\"48hrs\",\"Entregado\",CONSOLIDADO!S187)))","v":"En Ruta"},"",{"$f":"IF(AK187=\"Entregado\",\"\",IF(OR(X187=\"24hrs\",X187=\"48hrs\"),\"\",IF(X187=\"72hrs\",\"Entregado\",CONSOLIDADO!S187)))","v":"En Ruta"},"",{"$f":"IF(AK187=\"Entregado\",\"\",IF(OR(X187=\"24hrs\",X187=\"48hrs\",X187=\"72hrs\"),\"\",IF(X187=\"+72hrs\",\"Entregado\",CONSOLIDADO!S187)))","v":"En Ruta"},"","En Ruta",1,0,0,0,0,1,0,"No Entregado",0,0,1,0,{"$f":"IF(V187=\"Lima\",NETWORKDAYS.INTL(D187,M187,11,'Dias Feriados'!$A$1:$A$15),IF(AND(V187=\"provincia\",X187=\"24hrs\"),1,IF(AND(V187=\"provincia\",X187=\"48hrs\"),2,NETWORKDAYS.INTL(D187,M187,11,'Dias Feriados'!$A$1:$A$15))))","v":-39255}]
["B001668197","May","2025-05-27","2025-05-28","G/I. 030-10132",187,"JJASMI YOSI MENDEZ BARRIENTOS","JULIO CEVASCO 226 POR LA PLAZUELA JULIO CEVASCO","Provincia","ICA","LA TINGUIÑA","B001668197",null,"En Ruta",9730017565,"F",202508,203201,"En Ruta","Dia 1","CARMEL","PROVINCIA",{"$f":"NETWORKDAYS.INTL(D188,M188,11,'Dias Feriados'!$A$1:$A$15)","v":-39255},"En Ruta",22,"NO",null,0.9375,0.94722222222222219,1,"CRUCES CHO","2025-05-28",null,null,45804,"",{"$f":"IF(AS188=\"Devuelto\",\"\",IF(X188=\"24hrs\",\"Entregado\",CONSOLIDADO!S188))","v":"En Ruta"},"",{"$f":"IF(AK188=\"Entregado\",\"\",IF(X188=\"24hrs\",\"\",IF(X188=\"48hrs\",\"Entregado\",CONSOLIDADO!S188)))","v":"En Ruta"},"",{"$f":"IF(AK188=\"Entregado\",\"\",IF(OR(X188=\"24hrs\",X188=\"48hrs\"),\"\",IF(X188=\"72hrs\",\"Entregado\",CONSOLIDADO!S188)))","v":"En Ruta"},"",{"$f":"IF(AK188=\"Entregado\",\"\",IF(OR(X188=\"24hrs\",X188=\"48hrs\",X188=\"72hrs\"),\"\",IF(X188=\"+72hrs\",\"Entregado\",CONSOLIDADO!S188)))","v":"En Ruta"},"","En Ruta",1,0,0,0,0,1,0,"No Entregado",0,0,1,0,{"$f":"IF(V188=\"Lima\",NETWORKDAYS.INTL(D188,M188,11,'Dias Feriados'!$A$1:$A$15),IF(AND(V188=\"provincia\",X188=\"24hrs\"),1,IF(AND(V188=\"provincia\",X188=\"48hrs\"),2,NETWORKDAYS.INTL(D188,M188,11,'Dias Feriados'!$A$1:$A$15))))","v":-39255}]
["B001667575","May","2025-05-27","2025-05-28","G/I. 030-10132",188,"EUSEBIA ANGELICA SALLHUE MENDO","AV JUVENAL URIBE 298 REF RECTA COLISEO DE GALLOS","Provincia","ICA","LA TINGUIÑA","B001667575",null,"En Ruta",9730017589,"F",202508,203201,"En Ruta","Dia 1","CARMEL","PROVINCIA",{"$f":"NETWORKDAYS.INTL(D189,M189,11,'Dias Feriados'!$A$1:$A$15)","v":-39255},"En Ruta",22,"NO",null,0.9375,0.94722222222222219,1,"CRUCES CHO","2025-05-28",null,null,45804,"",{"$f":"IF(AS189=\"Devuelto\",\"\",IF(X189=\"24hrs\",\"Entregado\",CONSOLIDADO!S189))","v":"En Ruta"},"",{"$f":"IF(AK189=\"Entregado\",\"\",IF(X189=\"24hrs\",\"\",IF(X189=\"48hrs\",\"Entregado\",CONSOLIDADO!S189)))","v":"En Ruta"},"",{"$f":"IF(AK189=\"Entregado\",\"\",IF(OR(X189=\"24hrs\",X189=\"48hrs\"),\"\",IF(X189=\"72hrs\",\"Entregado\",CONSOLIDADO!S189)))","v":"En Ruta"},"",{"$f":"IF(AK189=\"Entregado\",\"\",IF(OR(X189=\"24hrs\",X189=\"48hrs\",X189=\"72hrs\"),\"\",IF(X189=\"+72hrs\",\"Entregado\",CONSOLIDADO!S189)))","v":"En Ruta"},"","En Ruta",1,0,0,0,0,1,0,"No Entregado",0,0,1,0,{"$f":"IF(V189=\"Lima\",NETWORKDAYS.INTL(D189,M189,11,'Dias Feriados'!$A$1:$A$15),IF(AND(V189=\"provincia\",X189=\"24hrs\"),1,IF(AND(V189=\"provincia\",X189=\"48hrs\"),2,NETWORKDAYS.INTL(D189,M189,11,'Dias Feriados'!$A$1:$A$15))))","v":-39255}]
["B001667531","May","2025-05-27","2025-05-28","G/I. 030-10132",189,"SILVIA MARIELA MITACC HUARCAYA","ASOCIACION 28 CON SAN MARTIN FABRICA DE POSTES","Provincia","ICA","LA TINGUIÑA","B001667531",null,"En Ruta",9730017604,"F",202508,203201,"En Ruta","Dia 1","CARMEL","PROVINCIA",{"$f":"NETWORKDAYS.INTL(D190,M190,11,'Dias Feriados'!$A$1:$A$15)","v":-39255},"En Ruta",22,"NO",null,0.9375,0.94722222222222219,1,"CRUCES CHO","2025-05-28",null,null,45804,"",{"$f":"IF(AS190=\"Devuelto\",\"\",IF(X190=\"24hrs\",\"Entregado\",CONSOLIDADO!S190))","v":"En Ruta"},"",{"$f":"IF(AK190=\"Entregado\",\"\",IF(X190=\"24hrs\",\"\",IF(X190=\"48hrs\",\"Entregado\",CONSOLIDADO!S190)))","v":"En Ruta"},"",{"$f":"IF(AK190=\"Entregado\",\"\",IF(OR(X190=\"24hrs\",X190=\"48hrs\"),\"\",IF(X190=\"72hrs\",\"Entregado\",CONSOLIDADO!S190)))","v":"En Ruta"},"",{"$f":"IF(AK190=\"Entregado\",\"\",IF(OR(X190=\"24hrs\",X190=\"48hrs\",X190=\"72hrs\"),\"\",IF(X190=\"+72hrs\",\"Entregado\",CONSOLIDADO!S190)))","v":"En Ruta"},"","En Ruta",1,0,0,0,0,1,0,"No Entregado",0,0,1,0,{"$f":"IF(V190=\"Lima\",NETWORKDAYS.INTL(D190,M190,11,'Dias Feriados'!$A$1:$A$15),IF(AND(V190=\"provincia\",X190=\"24hrs\"),1,IF(AND(V190=\"provincia\",X190=\"48hrs\"),2,NETWORKDAYS.INTL(D190,M190,11,'Dias Feriados'!$A$1:$A$15))))","v":-39255}]
["B001667612","May","2025-05-27","2025-05-28","G/I. 030-10132",190,"PAULO CESAR TREJO ORMENO","LLAXTA LOS AQUIJES MZ K1 LT 4 PASANDO YAURILLA LAS PIEDRAS DE BUENA VISTA LLAXTA","Provincia","ICA","LOS AQUIJES","B001667612","2025-05-28","Entregado",9730017078,"F",202508,203201,"Entregado","Dia 1","CARMEL","PROVINCIA",{"$f":"NETWORKDAYS.INTL(D191,M191,11,'Dias Feriados'!$A$1:$A$15)","v":1},"24hrs",22,"NO",null,0.9375,0.94722222222222219,1,"CRUCES CHO","2025-05-28",null,null,45804,45805,{"$f":"IF(AS191=\"Devuelto\",\"\",IF(X191=\"24hrs\",\"Entregado\",CONSOLIDADO!S191))","v":"Entregado"},"",{"$f":"IF(AK191=\"Entregado\",\"\",IF(X191=\"24hrs\",\"\",IF(X191=\"48hrs\",\"Entregado\",CONSOLIDADO!S191)))","v":""},"",{"$f":"IF(AK191=\"Entregado\",\"\",IF(OR(X191=\"24hrs\",X191=\"48hrs\"),\"\",IF(X191=\"72hrs\",\"Entregado\",CONSOLIDADO!S191)))","v":""},"",{"$f":"IF(AK191=\"Entregado\",\"\",IF(OR(X191=\"24hrs\",X191=\"48hrs\",X191=\"72hrs\"),\"\",IF(X191=\"+72hrs\",\"Entregado\",CONSOLIDADO!S191)))","v":""},45805,"Entregado",1,1,0,0,0,0,0,"A Tiempo",1,0,0,0,{"$f":"IF(V191=\"Lima\",NETWORKDAYS.INTL(D191,M191,11,'Dias Feriados'!$A$1:$A$15),IF(AND(V191=\"provincia\",X191=\"24hrs\"),1,IF(AND(V191=\"provincia\",X191=\"48hrs\"),2,NETWORKDAYS.INTL(D191,M191,11,'Dias Feriados'!$A$1:$A$15))))","v":1}]
["B001667586","May","2025-05-27","2025-05-28","G/I. 030-10132",191,"KATHERINE NOEMI SALAZAR CHACAL","CACERIO GARGANTO K1O B COSTADO REST MENDOZA","Provincia","ICA","LOS AQUIJES","B001667586",null,"En Ruta",9730017181,"F",202508,203201,"En Ruta","Dia 1","CARMEL","PROVINCIA",{"$f":"NETWORKDAYS.INTL(D192,M192,11,'Dias Feriados'!$A$1:$A$15)","v":-39255},"En Ruta",22,"NO",null,0.9375,0.94722222222222219,1,"CRUCES CHO","2025-05-28",null,null,45804,"",{"$f":"IF(AS192=\"Devuelto\",\"\",IF(X192=\"24hrs\",\"Entregado\",CONSOLIDADO!S192))","v":"En Ruta"},"",{"$f":"IF(AK192=\"Entregado\",\"\",IF(X192=\"24hrs\",\"\",IF(X192=\"48hrs\",\"Entregado\",CONSOLIDADO!S192)))","v":"En Ruta"},"",{"$f":"IF(AK192=\"Entregado\",\"\",IF(OR(X192=\"24hrs\",X192=\"48hrs\"),\"\",IF(X192=\"72hrs\",\"Entregado\",CONSOLIDADO!S192)))","v":"En Ruta"},"",{"$f":"IF(AK192=\"Entregado\",\"\",IF(OR(X192=\"24hrs\",X192=\"48hrs\",X192=\"72hrs\"),\"\",IF(X192=\"+72hrs\",\"Entregado\",CONSOLIDADO!S192)))","v":"En Ruta"},"","En Ruta",1,0,0,0,0,1,0,"No Entregado",0,0,1,0,{"$f":"IF(V192=\"Lima\",NETWORKDAYS.INTL(D192,M192,11,'Dias Feriados'!$A$1:$A$15),IF(AND(V192=\"provincia\",X192=\"24hrs\"),1,IF(AND(V192=\"provincia\",X192=\"48hrs\"),2,NETWORKDAYS.INTL(D192,M192,11,'Dias Feriados'!$A$1:$A$15))))","v":-39255}]
["B001667428",{"$f":"TEXT(C193,\"mmm\")","v":"May"},"2025-05-27","2025-05-28","G/I. 030-10132",192,"LISSETHE MILAGROS VENTURA CHAC","ALFONZO UGARTE EL ARENAL I 4 ESPALDA DE LA POLLERIA MELCHORITA","Provincia","ICA","LOS AQUIJES","B001667428",null,"En Ruta",9730017190,"F",202508,203201,"En Ruta","Dia 1","CARMEL","PROVINCIA",{"$f":"NETWORKDAYS.INTL(D193,M193,11,'Dias Feriados'!$A$1:$A$15)","v":-39255},"En Ruta",22,"NO",null,0.9375,0.94722222222222219,1,"CRUCES CHO",{"$f":"DATEVALUE(D193)","v":"2025-05-28"},null,null,{"$f":"C193","v":45804},{"$f":"IF(AK193=\"Entregado\",M193,\"\")","v":""},{"$f":"IF(AS193=\"Devuelto\",\"\",IF(X193=\"24hrs\",\"Entregado\",CONSOLIDADO!S193))","v":"En Ruta"},{"$f":"IF(AM193=\"Entregado\",M193,\"\")","v":""},{"$f":"IF(AK193=\"Entregado\",\"\",IF(X193=\"24hrs\",\"\",IF(X193=\"48hrs\",\"Entregado\",CONSOLIDADO!S193)))","v":"En Ruta"},{"$f":"IF(AO193=\"Entregado\",M193,\"\")","v":""},{"$f":"IF(AK193=\"Entregado\",\"\",IF(OR(X193=\"24hrs\",X193=\"48hrs\"),\"\",IF(X193=\"72hrs\",\"Entregado\",CONSOLIDADO!S193)))","v":"En Ruta"},{"$f":"IF(AQ193=\"Entregado\",M193,\"\")","v":""},{"$f":"IF(AK193=\"Entregado\",\"\",IF(OR(X193=\"24hrs\",X193=\"48hrs\",X193=\"72hrs\"),\"\",IF(X193=\"+72hrs\",\"Entregado\",CONSOLIDADO!S193)))","v":"En Ruta"},{"$f":"IF(M193=\"\",\"\",M193)","v":""},{"$f":"IF(AG193=\"Devuelto\",AG193,N193)","v":"En Ruta"},{"$f":"1+0","v":1},0,0,0,0,1,0,"No Entregado",0,0,1,0,{"$f":"IF(V193=\"Lima\",NETWORKDAYS.INTL(D193,M193,11,'Dias Feriados'!$A$1:$A$15),IF(AND(V193=\"provincia\",X193=\"24hrs\"),1,IF(AND(V193=\"provincia\",X193=\"48hrs\"),2,NETWORKDAYS.INTL(D193,M193,11,'Dias Feriados'!$A$1:$A$15))))","v":-39255}]
["B001667601","May","2025-05-27","2025-05-28","G/I. 030-10132",193,"LENY ARACELLI HERNANDEZ CHACAL","CASERIO GARGANTO MZ A K LT 6 11 RESTAURANTE MENDOZA","Provincia","ICA","LOS AQUIJES","B001667601",null,"En Ruta",9730017202,"F",202508,203201,"En Ruta","Dia 1",{"$f":"IF(MID(R194,1,2)=\"10\",\"PACIFIKA\",IF(MID(R194,1,2)=\"20\",\"CARMEL\",\"EMPLEADOS\"))","v":"CARMEL"},{"$f":"IF(I194=\"LIMA\",\"LIMA\",\"PROVINCIA\")","v":"PROVINCIA"},{"$f":"NETWORKDAYS.INTL(D194,M194,11,'Dias Feriados'!$A$1:$A$15)","v":-39255},{"$f":"IF(OR(M194=\"\",M194=\"En Ruta\"),\"En Ruta\",IF(M194=\"Motivado\",\"Motivado\",IF(W194<=1,\"24hrs\",IF(W194=2,\"48hrs\",IF(W194=3,\"72hrs\",\"+72hrs\")))))","v":"En Ruta"},{"$f":"WEEKNUM(C194)","v":22},"NO",null,0.9375,0.94722222222222219,1,"CRUCES CHO","2025-05-28",null,null,45804,"",{"$f":"IF(AS194=\"Devuelto\",\"\",IF(X194=\"24hrs\",\"Entregado\",CONSOLIDADO!S194))","v":"En Ruta"},"",{"$f":"IF(AK194=\"Entregado\",\"\",IF(X194=\"24hrs\",\"\",IF(X194=\"48hrs\",\"Entregado\",CONSOLIDADO!S194)))","v":"En Ruta"},"",{"$f":"IF(AK194=\"Entregado\",\"\",IF(OR(X194=\"24hrs\",X194=\"48hrs\"),\"\",IF(X194=\"72hrs\",\"Entregado\",CONSOLIDADO!S194)))","v":"En Ruta"},"",{"$f":"IF(AK194=\"Entregado\",\"\",IF(OR(X194=\"24hrs\",X194=\"48hrs\",X194=\"72hrs\"),\"\",IF(X194=\"+72hrs\",\"Entregado\",CONSOLIDADO!S194)))","v":"En Ruta"},"","En Ruta",1,{"$f":"IF(X194=\"24hrs\",1,0)","v":0},{"$f":"IF(X194=\"48hrs\",1,0)","v":0},{"$f":"IF(X194=\"72hrs\",1,0)","v":0},{"$f":"IF(X194=\"+72hrs\",1,0)","v":0},{"$f":"IF(X194=\"En Ruta\",1,0)","v":1},{"$f":"IF(X194=\"Motivado\",1,0)","v":0},{"$f":"IF(OR(N194=\"devuelto\",N194=\"siniestro\"),\"Nulo\",IF(OR(X194=\"24hrs\",X194=\"48hrs\"),\"A Tiempo\",IF(OR(X194=\"en ruta\",X194=\"motivado\"),\"No Entregado\",\"Fuera de Tiempo\")))","v":"No Entregado"},{"$f":"IF(BA194=\"a tiempo\",1,0)","v":0},{"$f":"IF(BA194=\"fuera de tiempo\",1,0)","v":0},{"$f":"IF(BA194=\"no entregado\",1,0)","v":1},{"$f":"IF(BA194=\"nulo\",1,0)","v":0},{"$f":"IF(V194=\"Lima\",NETWORKDAYS.INTL(D194,M194,11,'Dias Feriados'!$A$1:$A$15),IF(AND(V194=\"provincia\",X194=\"24hrs\"),1,IF(AND(V194=\"provincia\",X194=\"48hrs\"),2,NETWORKDAYS.INTL(D194,M194,11,'Dias Feriados'!$A$1:$A$15))))","v":-39255}]
["B001667360","May","2025-05-27","2025-05-28","G/I. 030-10132",194,"LOURDES HERNANDEZ BOHORQUEZ","LOS AQUIJES MZ R LT 2A TIENDA DE NAIDU LOS AQUIJES","Provincia","ICA","LOS AQUIJES","B001667360",null,"En Ruta",9730017259,"F",202508,203201,"En Ruta","Dia 1","CARMEL","PROVINCIA",{"$f":"NETWORKDAYS.INTL(D195,M195,11,'Dias Feriados'!$A$1:$A$15)","v":-39255},"En Ruta",22,"NO",null,0.9375,0.94722222222222219,1,"CRUCES CHO","2025-05-28",null,null,45804,"",{"$f":"IF(AS195=\"Devuelto\",\"\",IF(X195=\"24hrs\",\"Entregado\",CONSOLIDADO!S195))","v":"En Ruta"},"",{"$f":"IF(AK195=\"Entregado\",\"\",IF(X195=\"24hrs\",\"\",IF(X195=\"48hrs\",\"Entregado\",CONSOLIDADO!S195)))","v":"En Ruta"},"",{"$f":"IF(AK195=\"Entregado\",\"\",IF(OR(X195=\"24hrs\",X195=\"48hrs\"),\"\",IF(X195=\"72hrs\",\"Entregado\",CONSOLIDADO!S195)))","v":"En Ruta"},"",{"$f":"IF(AK195=\"Entregado\",\"\",IF(OR(X195=\"24hrs\",X195=\"48hrs\",X195=\"72hrs\"),\"\",IF(X195=\"+72hrs\",\"Entregado\",CONSOLIDADO!S195)))","v":"En Ruta"},"","En Ruta",1,0,0,0,0,1,0,"No Entregado",0,0,1,0,{"$f":"IF(V195=\"Lima\",NETWORKDAYS.INTL(D195,M195,11,'Dias Feriados'!$A$1:$A$15),IF(AND(V195=\"provincia\",X195=\"24hrs\"),1,IF(AND(V195=\"provincia\",X195=\"48hrs\"),2,NETWORKDAYS.INTL(D195,M195,11,'Dias Feriados'!$A$1:$A$15))))","v":-39255}]
["B001667438","May","2025-05-27","2025-05-28","G/I. 030-10132",195,"LUZ ROXANA HUARCAYA SAYRITUPAC","LOS AQUIJES MZ K LT 11B A UNA CUADRA DEL MERCADO LOS AQUIJES","Provincia","ICA","LOS AQUIJES","B001667438",null,"En Ruta",9730017276,"F",202508,203201,"En Ruta","Dia 1","CARMEL","PROVINCIA",{"$f":"NETWORKDAYS.INTL(D196,M196,11,'Dias Feriados'!$A$1:$A$15)","v":-39255},"En Ruta",22,"NO",null,0.9375,0.94722222222222219,1,"CRUCES CHO","2025-05-28",null,null,45804,"",{"$f":"IF(AS196=\"Devuelto\",\"\",IF(X196=\"24hrs\",\"Entregado\",CONSOLIDADO!S196))","v":"En Ruta"},"",{"$f":"IF(AK196=\"Entregado\",\"\",IF(X196=\"24hrs\",\"\",IF(X196=\"48hrs\",\"Entregado\",CONSOLIDADO!S196)))","v":"En Ruta"},"",{"$f":"IF(AK196=\"Entregado\",\"\",IF(OR(X196=\"24hrs\",X196=\"48hrs\"),\"\",IF(X196=\"72hrs\",\"Entregado\",CONSOLIDADO!S196)))","v":"En Ruta"},"",{"$f":"IF(AK196=\"Entregado\",\"\",IF(OR(X196=\"24hrs\",X196=\"48hrs\",X196=\"72hrs\"),\"\",IF(X196=\"+72hrs\",\"Entregado\",CONSOLIDADO!S196)))","v":"En Ruta"},"","En Ruta",1,0,0,0,0,1,0,"No Entregado",0,0,1,0,{"$f":"IF(V196=\"Lima\",NETWORKDAYS.INTL(D196,M196,11,'Dias Feriados'!$A$1:$A$15),IF(AND(V196=\"provincia\",X196=\"24hrs\"),1,IF(AND(V196=\"provincia\",X196=\"48hrs\"),2,NETWORKDAYS.INTL(D196,M196,11,'Dias Feriados'!$A$1:$A$15))))","v":-39255}]
["B001667701","May","2025-05-27","2025-05-28","G/I. 030-10132",196,"SUSY MARIA DE LA CRUZ APARCANA","MZ G LT 5 TALLAMANA COSTADO IGLESIA CENTRO POBLADO","Provincia","ICA","LOS AQUIJES","B001667701",null,"En Ruta",9730017363,"F",202508,203201,"En Ruta","Dia 1","CARMEL","PROVINCIA",{"$f":"NETWORKDAYS.INTL(D197,M197,11,'Dias Feriados'!$A$1:$A$15)","v":-39255},"En Ruta",22,"NO",null,0.9375,0.94722222222222219,1,"CRUCES CHO","2025-05-28",null,null,45804,"",{"$f":"IF(AS197=\"Devuelto\",\"\",IF(X197=\"24hrs\",\"Entregado\",CONSOLIDADO!S197))","v":"En Ruta"},"",{"$f":"IF(AK197=\"Entregado\",\"\",IF(X197=\"24hrs\",\"\",IF(X197=\"48hrs\",\"Entregado\",CONSOLIDADO!S197)))","v":"En Ruta"},"",{"$f":"IF(AK197=\"Entregado\",\"\",IF(OR(X197=\"24hrs\",X197=\"48hrs\"),\"\",IF(X197=\"72hrs\",\"Entregado\",CONSOLIDADO!S197)))","v":"En Ruta"},"",{"$f":"IF(AK197=\"Entregado\",\"\",IF(OR(X197=\"24hrs\",X197=\"48hrs\",X197=\"72hrs\"),\"\",IF(X197=\"+72hrs\",\"Entregado\",CONSOLIDADO!S197)))","v":"En Ruta"},"","En Ruta",1,0,0,0,0,1,0,"No Entregado",0,0,1,0,{"$f":"IF(V197=\"Lima\",NETWORKDAYS.INTL(D197,M197,11,'Dias Feriados'!$A$1:$A$15),IF(AND(V197=\"provincia\",X197=\"24hrs\"),1,IF(AND(V197=\"provincia\",X197=\"48hrs\"),2,NETWORKDAYS.INTL(D197,M197,11,'Dias Feriados'!$A$1:$A$15))))","v":-39255}]
["B001667571","May","2025-05-27","2025-05-28","G/I. 030-10132",197,"LUISA MARANON PARDO","CASUARINAS 30 MZ C LT 30 CASUARINAS","Provincia","ICA","LOS AQUIJES","B001667571",null,"En Ruta",9730017380,"F",202508,203201,"En Ruta","Dia 1","CARMEL","PROVINCIA",{"$f":"NETWORKDAYS.INTL(D198,M198,11,'Dias Feriados'!$A$1:$A$15)","v":-39255},"En Ruta",22,"NO",null,0.9375,0.94722222222222219,1,"CRUCES CHO","2025-05-28",null,null,45804,"",{"$f":"IF(AS198=\"Devuelto\",\"\",IF(X198=\"24hrs\",\"Entregado\",CONSOLIDADO!S198))","v":"En Ruta"},"",{"$f":"IF(AK198=\"Entregado\",\"\",IF(X198=\"24hrs\",\"\",IF(X198=\"48hrs\",\"Entregado\",CONSOLIDADO!S198)))","v":"En Ruta"},"",{"$f":"IF(AK198=\"Entregado\",\"\",IF(OR(X198=\"24hrs\",X198=\"48hrs\"),\"\",IF(X198=\"72hrs\",\"Entregado\",CONSOLIDADO!S198)))","v":"En Ruta"},"",{"$f":"IF(AK198=\"Entregado\",\"\",IF(OR(X198=\"24hrs\",X198=\"48hrs\",X198=\"72hrs\"),\"\",IF(X198=\"+72hrs\",\"Entregado\",CONSOLIDADO!S198)))","v":"En Ruta"},"","En Ruta",1,0,0,0,0,1,0,"No Entregado",0,0,1,0,{"$f":"IF(V198=\"Lima\",NETWORKDAYS.INTL(D198,M198,11,'Dias Feriados'!$A$1:$A$15),IF(AND(V198=\"provincia\",X198=\"24hrs\"),1,IF(AND(V198=\"provincia\",X198=\"48hrs\"),2,NETWORKDAYS.INTL(D198,M198,11,'Dias Feriados'!$A$1:$A$15))))","v":-39255}]
["B001667707","May","2025-05-27","2025-05-28","G/I. 030-10132",198,"MATIAS ENRIQUE CALDERON CARMON","AV PACHACUTEC Y61 PRIMERA CUADRA 3 CASAS DEL REST HUERTA","Provincia","ICA","PACHACUTEC","B001667707",null,"En Ruta",9730017045,"F",202508,203201,"En Ruta","Dia 1","CARMEL","PROVINCIA",{"$f":"NETWORKDAYS.INTL(D199,M199,11,'Dias Feriados'!$A$1:$A$15)","v":-39255},"En Ruta",22,"NO",null,0.9375,0.94722222222222219,1,"CRUCES CHO","2025-05-28",null,null,45804,"",{"$f":"IF(AS199=\"Devuelto\",\"\",IF(X199=\"24hrs\",\"Entregado\",CONSOLIDADO!S199))","v":"En Ruta"},"",{"$f":"IF(AK199=\"Entregado\",\"\",IF(X199=\"24hrs\",\"\",IF(X199=\"48hrs\",\"Entregado\",CONSOLIDADO!S199)))","v":"En Ruta"},"",{"$f":"IF(AK199=\"Entregado\",\"\",IF(OR(X199=\"24hrs\",X199=\"48hrs\"),\"\",IF(X199=\"72hrs\",\"Entregado\",CONSOLIDADO!S199)))","v":"En Ruta"},"",{"$f":"IF(AK199=\"Entregado\",\"\",IF(OR(X199=\"24hrs\",X199=\"48hrs\",X199=\"72hrs\"),\"\",IF(X199=\"+72hrs\",\"Entregado\",CONSOLIDADO!S199)))","v":"En Ruta"},"","En Ruta",1,0,0,0,0,1,0,"No Entregado",0,0,1,0,{"$f":"IF(V199=\"Lima\",NETWORKDAYS.INTL(D199,M199,11,'Dias Feriados'!$A$1:$A$15),IF(AND(V199=\"provincia\",X199=\"24hrs\"),1,IF(AND(V199=\"provincia\",X199=\"48hrs\"),2,NETWORKDAYS.INTL(D199,M199,11,'Dias Feriados'!$A$1:$A$15))))","v":-39255}]
["B001667411","May","2025-05-27","2025-05-28","G/I. 030-10132",199,"JESSICA LIZBET JIMENEZ MORALES","AV MIGUEL GRAU 199 ENT 18 FREBRERO PORL GRAU","Provincia","ICA","PARCONA","B001667411",null,"En Ruta",9730017028,"F",202508,203201,"En Ruta","Dia 1","CARMEL","PROVINCIA",{"$f":"NETWORKDAYS.INTL(D200,M200,11,'Dias Feriados'!$A$1:$A$15)","v":-39255},"En Ruta",22,"NO",null,0.9375,0.94722222222222219,1,"CRUCES CHO","2025-05-28",null,null,45804,"",{"$f":"IF(AS200=\"Devuelto\",\"\",IF(X200=\"24hrs\",\"Entregado\",CONSOLIDADO!S200))","v":"En Ruta"},"",{"$f":"IF(AK200=\"Entregado\",\"\",IF(X200=\"24hrs\",\"\",IF(X200=\"48hrs\",\"Entregado\",CONSOLIDADO!S200)))","v":"En Ruta"},"",{"$f":"IF(AK200=\"Entregado\",\"\",IF(OR(X200=\"24hrs\",X200=\"48hrs\"),\"\",IF(X200=\"72hrs\",\"Entregado\",CONSOLIDADO!S200)))","v":"En Ruta"},"",{"$f":"IF(AK200=\"Entregado\",\"\",IF(OR(X200=\"24hrs\",X200=\"48hrs\",X200=\"72hrs\"),\"\",IF(X200=\"+72hrs\",\"Entregado\",CONSOLIDADO!S200)))","v":"En Ruta"},"","En Ruta",1,0,0,0,0,1,0,"No Entregado",0,0,1,0,{"$f":"IF(V200=\"Lima\",NETWORKDAYS.INTL(D200,M200,11,'Dias Feriados'!$A$1:$A$15),IF(AND(V200=\"provincia\",X200=\"24hrs\"),1,IF(AND(V200=\"provincia\",X200=\"48hrs\"),2,NETWORKDAYS.INTL(D200,M200,11,'Dias Feriados'!$A$1:$A$15))))","v":-39255}]
["B001667481","May","2025-05-27","2025-05-28","G/I. 030-10132",200,"GRACCE LISSETE ENCIZO MENDOZA","CALLE MANUEL CARBAJAL 177 177 POR LA ENTRADA DE LA LLANTERIA SAN IDELFONSO","Provincia","ICA","PARCONA","B001667481",null,"En Ruta",9730017063,"F",202508,203201,"En Ruta","Dia 1","CARMEL","PROVINCIA",{"$f":"NETWORKDAYS.INTL(D201,M201,11,'Dias Feriados'!$A$1:$A$15)","v":-39255},"En Ruta",22,"NO",null,0.9375,0.94722222222222219,1,"CRUCES CHO","2025-05-28",null,null,45804,"",{"$f":"IF(AS201=\"Devuelto\",\"\",IF(X201=\"24hrs\",\"Entregado\",CONSOLIDADO!S201))","v":"En Ruta"},"",{"$f":"IF(AK201=\"Entregado\",\"\",IF(X201=\"24hrs\",\"\",IF(X201=\"48hrs\",\"Entregado\",CONSOLIDADO!S201)))","v":"En Ruta"},"",{"$f":"IF(AK201=\"Entregado\",\"\",IF(OR(X201=\"24hrs\",X201=\"48hrs\"),\"\",IF(X201=\"72hrs\",\"Entregado\",CONSOLIDADO!S201)))","v":"En Ruta"},"",{"$f":"IF(AK201=\"Entregado\",\"\",IF(OR(X201=\"24hrs\",X201=\"48hrs\",X201=\"72hrs\"),\"\",IF(X201=\"+72hrs\",\"Entregado\",CONSOLIDADO!S201)))","v":"En Ruta"},"","En Ruta",1,0,0,0,0,1,0,"No Entregado",0,0,1,0,{"$f":"IF(V201=\"Lima\",NETWORKDAYS.INTL(D201,M201,11,'Dias Feriados'!$A$1:$A$15),IF(AND(V201=\"provincia\",X201=\"24hrs\"),1,IF(AND(V201=\"provincia\",X201=\"48hrs\"),2,NETWORKDAYS.INTL(D201,M201,11,'Dias Feriados'!$A$1:$A$15))))","v":-39255}]
["B001667720","May","2025-05-27","2025-05-28","G/I. 030-10132",201,"CINTHIA YANINA CALDERON MERCAD","ANDRES AVELINO CACERES 308 MZ Q5 LT 32 ANTES DE LA LOZA DE LA ZONA SUR CENTRO POBLADO","Provincia","ICA","PARCONA","B001667720",null,"En Ruta",9730017064,"F",202508,203201,"En Ruta","Dia 1","CARMEL","PROVINCIA",{"$f":"NETWORKDAYS.INTL(D202,M202,11,'Dias Feriados'!$A$1:$A$15)","v":-39255},"En Ruta",22,"NO",null,0.9375,0.94722222222222219,1,"CRUCES CHO","2025-05-28",null,null,45804,"",{"$f":"IF(AS202=\"Devuelto\",\"\",IF(X202=\"24hrs\",\"Entregado\",CONSOLIDADO!S202))","v":"En Ruta"},"",{"$f":"IF(AK202=\"Entregado\",\"\",IF(X202=\"24hrs\",\"\",IF(X202=\"48hrs\",\"Entregado\",CONSOLIDADO!S202)))","v":"En Ruta"},"",{"$f":"IF(AK202=\"Entregado\",\"\",IF(OR(X202=\"24hrs\",X202=\"48hrs\"),\"\",IF(X202=\"72hrs\",\"Entregado\",CONSOLIDADO!S202)))","v":"En Ruta"},"",{"$f":"IF(AK202=\"Entregado\",\"\",IF(OR(X202=\"24hrs\",X202=\"48hrs\",X202=\"72hrs\"),\"\",IF(X202=\"+72hrs\",\"Entregado\",CONSOLIDADO!S202)))","v":"En Ruta"},"","En Ruta",1,0,0,0,0,1,0,"No Entregado",0,0,1,0,{"$f":"IF(V202=\"Lima\",NETWORKDAYS.INTL(D202,M202,11,'Dias Feriados'!$A$1:$A$15),IF(AND(V202=\"provincia\",X202=\"24hrs\"),1,IF(AND(V202=\"provincia\",X202=\"48hrs\"),2,NETWORKDAYS.INTL(D202,M202,11,'Dias Feriados'!$A$1:$A$15))))","v":-39255}]
["B001667794","May","2025-05-27","2025-05-28","G/I. 030-10132",202,"LALY DANEY GARAY DAVALOS","AV LA ANGOSTURA # 400 HOTEL LAS DUNAS PUERTA 2","Provincia","ICA","PARCONA","B001667794",null,"En Ruta",9730017081,"F",202508,203201,"En Ruta","Dia 1","CARMEL","PROVINCIA",{"$f":"NETWORKDAYS.INTL(D203,M203,11,'Dias Feriados'!$A$1:$A$15)","v":-39255},"En Ruta",22,"NO",null,0.9375,0.94722222222222219,1,"CRUCES CHO","2025-05-28",null,null,45804,"",{"$f":"IF(AS203=\"Devuelto\",\"\",IF(X203=\"24hrs\",\"Entregado\",CONSOLIDADO!S203))","v":"En Ruta"},"",{"$f":"IF(AK203=\"Entregado\",\"\",IF(X203=\"24hrs\",\"\",IF(X203=\"48hrs\",\"Entregado\",CONSOLIDADO!S203)))","v":"En Ruta"},"",{"$f":"IF(AK203=\"Entregado\",\"\",IF(OR(X203=\"24hrs\",X203=\"48hrs\"),\"\",IF(X203=\"72hrs\",\"Entregado\",CONSOLIDADO!S203)))","v":"En Ruta"},"",{"$f":"IF(AK203=\"Entregado\",\"\",IF(OR(X203=\"24hrs\",X203=\"48hrs\",X203=\"72hrs\"),\"\",IF(X203=\"+72hrs\",\"Entregado\",CONSOLIDADO!S203)))","v":"En Ruta"},"","En Ruta",1,0,0,0,0,1,0,"No Entregado",0,0,1,0,{"$f":"IF(V203=\"Lima\",NETWORKDAYS.INTL(D203,M203,11,'Dias Feriados'!$A$1:$A$15),IF(AND(V203=\"provincia\",X203=\"24hrs\"),1,IF(AND(V203=\"provincia\",X203=\"48hrs\"),2,NETWORKDAYS.INTL(D203,M203,11,'Dias Feriados'!$A$1:$A$15))))","v":-39255}]
["B001667629","May","2025-05-27","2025-05-28","G/I. 030-10132",203,"MARIA ISABEL PALACIOS APARICIO","SANTA ROSA DE II ETAPA L8 PARCONA PARCONA","Provincia","ICA","PARCONA","B001667629",null,"En Ruta",9730017095,"F",202508,203201,"En Ruta","Dia 1","CARMEL","PROVINCIA",{"$f":"NETWORKDAYS.INTL(D204,M204,11,'Dias Feriados'!$A$1:$A$15)","v":-39255},"En Ruta",22,"NO",null,0.9375,0.94722222222222219,1,"CRUCES CHO","2025-05-28",null,null,45804,"",{"$f":"IF(AS204=\"Devuelto\",\"\",IF(X204=\"24hrs\",\"Entregado\",CONSOLIDADO!S204))","v":"En Ruta"},"",{"$f":"IF(AK204=\"Entregado\",\"\",IF(X204=\"24hrs\",\"\",IF(X204=\"48hrs\",\"Entregado\",CONSOLIDADO!S204)))","v":"En Ruta"},"",{"$f":"IF(AK204=\"Entregado\",\"\",IF(OR(X204=\"24hrs\",X204=\"48hrs\"),\"\",IF(X204=\"72hrs\",\"Entregado\",CONSOLIDADO!S204)))","v":"En Ruta"},"",{"$f":"IF(AK204=\"Entregado\",\"\",IF(OR(X204=\"24hrs\",X204=\"48hrs\",X204=\"72hrs\"),\"\",IF(X204=\"+72hrs\",\"Entregado\",CONSOLIDADO!S204)))","v":"En Ruta"},"","En Ruta",1,0,0,0,0,1,0,"No Entregado",0,0,1,0,{"$f":"IF(V204=\"Lima\",NETWORKDAYS.INTL(D204,M204,11,'Dias Feriados'!$A$1:$A$15),IF(AND(V204=\"provincia\",X204=\"24hrs\"),1,IF(AND(V204=\"provincia\",X204=\"48hrs\"),2,NETWORKDAYS.INTL(D204,M204,11,'Dias Feriados'!$A$1:$A$15))))","v":-39255}]
["B001667404","May","2025-05-27","2025-05-28","G/I. 030-10132",204,"OLINDA EDITH BENDEZU BENDEZU","CLL AURORA FERNANDEZ NUM 290 FRENTE CLUB ESTRELLA ROJA","Provincia","ICA","PARCONA","B001667404",null,"En Ruta",9730017122,"F",202508,203201,"En Ruta","Dia 1","CARMEL","PROVINCIA",{"$f":"NETWORKDAYS.INTL(D205,M205,11,'Dias Feriados'!$A$1:$A$15)","v":-39255},"En Ruta",22,"NO",null,0.9375,0.94722222222222219,1,"CRUCES CHO","2025-05-28",null,null,45804,"",{"$f":"IF(AS205=\"Devuelto\",\"\",IF(X205=\"24hrs\",\"Entregado\",CONSOLIDADO!S205))","v":"En Ruta"},"",{"$f":"IF(AK205=\"Entregado\",\"\",IF(X205=\"24hrs\",\"\",IF(X205=\"48hrs\",\"Entregado\",CONSOLIDADO!S205)))","v":"En Ruta"},"",{"$f":"IF(AK205=\"Entregado\",\"\",IF(OR(X205=\"24hrs\",X205=\"48hrs\"),\"\",IF(X205=\"72hrs\",\"Entregado\",CONSOLIDADO!S205)))","v":"En Ruta"},"",{"$f":"IF(AK205=\"Entregado\",\"\",IF(OR(X205=\"24hrs\",X205=\"48hrs\",X205=\"72hrs\"),\"\",IF(X205=\"+72hrs\",\"Entregado\",CONSOLIDADO!S205)))","v":"En Ruta"},"","En Ruta",1,0,0,0,0,1,0,"No Entregado",0,0,1,0,{"$f":"IF(V205=\"Lima\",NETWORKDAYS.INTL(D205,M205,11,'Dias Feriados'!$A$1:$A$15),IF(AND(V205=\"provincia\",X205=\"24hrs\"),1,IF(AND(V205=\"provincia\",X205=\"48hrs\"),2,NETWORKDAYS.INTL(D205,M205,11,'Dias Feriados'!$A$1:$A$15))))","v":-39255}]
["B001667698","May","2025-05-27","2025-05-28","G/I. 030-10132",205,"CLARET IRIS URBANO LARA","CL ROSUEL CASTRO MZ K LT 7 RESPALDO DE LA ENCI","Provincia","ICA","PARCONA","B001667698",null,"En Ruta",9730017144,"F",202508,203201,"En Ruta","Dia 1","CARMEL","PROVINCIA",{"$f":"NETWORKDAYS.INTL(D206,M206,11,'Dias Feriados'!$A$1:$A$15)","v":-39255},"En Ruta",22,"NO",null,0.9375,0.94722222222222219,1,"CRUCES CHO","2025-05-28",null,null,45804,"",{"$f":"IF(AS206=\"Devuelto\",\"\",IF(X206=\"24hrs\",\"Entregado\",CONSOLIDADO!S206))","v":"En Ruta"},"",{"$f":"IF(AK206=\"Entregado\",\"\",IF(X206=\"24hrs\",\"\",IF(X206=\"48hrs\",\"Entregado\",CONSOLIDADO!S206)))","v":"En Ruta"},"",{"$f":"IF(AK206=\"Entregado\",\"\",IF(OR(X206=\"24hrs\",X206=\"48hrs\"),\"\",IF(X206=\"72hrs\",\"Entregado\",CONSOLIDADO!S206)))","v":"En Ruta"},"",{"$f":"IF(AK206=\"Entregado\",\"\",IF(OR(X206=\"24hrs\",X206=\"48hrs\",X206=\"72hrs\"),\"\",IF(X206=\"+72hrs\",\"Entregado\",CONSOLIDADO!S206)))","v":"En Ruta"},"","En Ruta",1,0,0,0,0,1,0,"No Entregado",0,0,1,0,{"$f":"IF(V206=\"Lima\",NETWORKDAYS.INTL(D206,M206,11,'Dias Feriados'!$A$1:$A$15),IF(AND(V206=\"provincia\",X206=\"24hrs\"),1,IF(AND(V206=\"provincia\",X206=\"48hrs\"),2,NETWORKDAYS.INTL(D206,M206,11,'Dias Feriados'!$A$1:$A$15))))","v":-39255}]
["B001667479","May","2025-05-27","2025-05-28","G/I. 030-10132",206,"GLADYS ALICIA LEON MITACC","RAMN CASTILLA 218 ALFN MERCADO","Provincia","ICA","PARCONA","B001667479",null,"En Ruta",9730017182,"F",202508,203201,"En Ruta","Dia 1","CARMEL","PROVINCIA",{"$f":"NETWORKDAYS.INTL(D207,M207,11,'Dias Feriados'!$A$1:$A$15)","v":-39255},"En Ruta",22,"NO",null,0.9375,0.94722222222222219,1,"CRUCES CHO","2025-05-28",null,null,45804,"",{"$f":"IF(AS207=\"Devuelto\",\"\",IF(X207=\"24hrs\",\"Entregado\",CONSOLIDADO!S207))","v":"En Ruta"},"",{"$f":"IF(AK207=\"Entregado\",\"\",IF(X207=\"24hrs\",\"\",IF(X207=\"48hrs\",\"Entregado\",CONSOLIDADO!S207)))","v":"En Ruta"},"",{"$f":"IF(AK207=\"Entregado\",\"\",IF(OR(X207=\"24hrs\",X207=\"48hrs\"),\"\",IF(X207=\"72hrs\",\"Entregado\",CONSOLIDADO!S207)))","v":"En Ruta"},"",{"$f":"IF(AK207=\"Entregado\",\"\",IF(OR(X207=\"24hrs\",X207=\"48hrs\",X207=\"72hrs\"),\"\",IF(X207=\"+72hrs\",\"Entregado\",CONSOLIDADO!S207)))","v":"En Ruta"},"","En Ruta",1,0,0,0,0,1,0,"No Entregado",0,0,1,0,{"$f":"IF(V207=\"Lima\",NETWORKDAYS.INTL(D207,M207,11,'Dias Feriados'!$A$1:$A$15),IF(AND(V207=\"provincia\",X207=\"24hrs\"),1,IF(AND(V207=\"provincia\",X207=\"48hrs\"),2,NETWORKDAYS.INTL(D207,M207,11,'Dias Feriados'!$A$1:$A$15))))","v":-39255}]
["B001667699","May","2025-05-27","2025-05-28","G/I. 030-10132",207,"CYNTHIA NATALI MISAJEL MARQUIN","CESAR VALLEJO 103 A DOS CASAS DE BODEGA CINTHYA PARCONA","Provincia","ICA","PARCONA","B001667699",null,"En Ruta",9730017187,"F",202508,203201,"En Ruta","Dia 1","CARMEL","PROVINCIA",{"$f":"NETWORKDAYS.INTL(D208,M208,11,'Dias Feriados'!$A$1:$A$15)","v":-39255},"En Ruta",22,"NO",null,0.9375,0.94722222222222219,1,"CRUCES CHO","2025-05-28",null,null,45804,"",{"$f":"IF(AS208=\"Devuelto\",\"\",IF(X208=\"24hrs\",\"Entregado\",CONSOLIDADO!S208))","v":"En Ruta"},"",{"$f":"IF(AK208=\"Entregado\",\"\",IF(X208=\"24hrs\",\"\",IF(X208=\"48hrs\",\"Entregado\",CONSOLIDADO!S208)))","v":"En Ruta"},"",{"$f":"IF(AK208=\"Entregado\",\"\",IF(OR(X208=\"24hrs\",X208=\"48hrs\"),\"\",IF(X208=\"72hrs\",\"Entregado\",CONSOLIDADO!S208)))","v":"En Ruta"},"",{"$f":"IF(AK208=\"Entregado\",\"\",IF(OR(X208=\"24hrs\",X208=\"48hrs\",X208=\"72hrs\"),\"\",IF(X208=\"+72hrs\",\"Entregado\",CONSOLIDADO!S208)))","v":"En Ruta"},"","En Ruta",1,0,0,0,0,1,0,"No Entregado",0,0,1,0,{"$f":"IF(V208=\"Lima\",NETWORKDAYS.INTL(D208,M208,11,'Dias Feriados'!$A$1:$A$15),IF(AND(V208=\"provincia\",X208=\"24hrs\"),1,IF(AND(V208=\"provincia\",X208=\"48hrs\"),2,NETWORKDAYS.INTL(D208,M208,11,'Dias Feriados'!$A$1:$A$15))))","v":-39255}]
["B001668189","May","2025-05-27","2025-05-28","G/I. 030-10132",208,"AHSLLIE DALLAM INFANTE TORREAL","1RA ETAPA MZ C1 LT 38 DOBLE VIA PRINCIPAL LA ALAMEDA","Provincia","ICA","PARCONA","B001668189",null,"En Ruta",9730017209,"F",202508,203201,"En Ruta","Dia 1","CARMEL","PROVINCIA",{"$f":"NETWORKDAYS.INTL(D209,M209,11,'Dias Feriados'!$A$1:$A$15)","v":-39255},"En Ruta",22,"NO",null,0.9375,0.94722222222222219,1,"CRUCES CHO","2025-05-28",null,null,45804,"",{"$f":"IF(AS209=\"Devuelto\",\"\",IF(X209=\"24hrs\",\"Entregado\",CONSOLIDADO!S209))","v":"En Ruta"},"",{"$f":"IF(AK209=\"Entregado\",\"\",IF(X209=\"24hrs\",\"\",IF(X209=\"48hrs\",\"Entregado\",CONSOLIDADO!S209)))","v":"En Ruta"},"",{"$f":"IF(AK209=\"Entregado\",\"\",IF(OR(X209=\"24hrs\",X209=\"48hrs\"),\"\",IF(X209=\"72hrs\",\"Entregado\",CONSOLIDADO!S209)))","v":"En Ruta"},"",{"$f":"IF(AK209=\"Entregado\",\"\",IF(OR(X209=\"24hrs\",X209=\"48hrs\",X209=\"72hrs\"),\"\",IF(X209=\"+72hrs\",\"Entregado\",CONSOLIDADO!S209)))","v":"En Ruta"},"","En Ruta",1,0,0,0,0,1,0,"No Entregado",0,0,1,0,{"$f":"IF(V209=\"Lima\",NETWORKDAYS.INTL(D209,M209,11,'Dias Feriados'!$A$1:$A$15),IF(AND(V209=\"provincia\",X209=\"24hrs\"),1,IF(AND(V209=\"provincia\",X209=\"48hrs\"),2,NETWORKDAYS.INTL(D209,M209,11,'Dias Feriados'!$A$1:$A$15))))","v":-39255}]
["B001667439","May","2025-05-27","2025-05-28","G/I. 030-10132",209,"MARIA ESMERALDA GUILLEN PALOMI","RICARDO PALMA 251 PASANDO IGLESIA DE LOS MORMONES RICARDO PALMA PARCONA","Provincia","ICA","PARCONA","B001667439",null,"En Ruta",9730017210,"F",202508,203201,"En Ruta","Dia 1","CARMEL","PROVINCIA",{"$f":"NETWORKDAYS.INTL(D210,M210,11,'Dias Feriados'!$A$1:$A$15)","v":-39255},"En Ruta",22,"NO",null,0.9375,0.94722222222222219,1,"CRUCES CHO","2025-05-28",null,null,45804,"",{"$f":"IF(AS210=\"Devuelto\",\"\",IF(X210=\"24hrs\",\"Entregado\",CONSOLIDADO!S210))","v":"En Ruta"},"",{"$f":"IF(AK210=\"Entregado\",\"\",IF(X210=\"24hrs\",\"\",IF(X210=\"48hrs\",\"Entregado\",CONSOLIDADO!S210)))","v":"En Ruta"},"",{"$f":"IF(AK210=\"Entregado\",\"\",IF(OR(X210=\"24hrs\",X210=\"48hrs\"),\"\",IF(X210=\"72hrs\",\"Entregado\",CONSOLIDADO!S210)))","v":"En Ruta"},"",{"$f":"IF(AK210=\"Entregado\",\"\",IF(OR(X210=\"24hrs\",X210=\"48hrs\",X210=\"72hrs\"),\"\",IF(X210=\"+72hrs\",\"Entregado\",CONSOLIDADO!S210)))","v":"En Ruta"},"","En Ruta",1,0,0,0,0,1,0,"No Entregado",0,0,1,0,{"$f":"IF(V210=\"Lima\",NETWORKDAYS.INTL(D210,M210,11,'Dias Feriados'!$A$1:$A$15),IF(AND(V210=\"provincia\",X210=\"24hrs\"),1,IF(AND(V210=\"provincia\",X210=\"48hrs\"),2,NETWORKDAYS.INTL(D210,M210,11,'Dias Feriados'!$A$1:$A$15))))","v":-39255}]
["B001667624","May","2025-05-27","2025-05-28","G/I. 030-10132",210,"ERICKA MERLY HUAMAN SIMON","ASC SANTA ROSA DE LIMA 1ET MZL L8 A UNA CUADRA DEL MERCADO DELOS HERMANOS","Provincia","ICA","PARCONA","B001667624",null,"En Ruta",9730017214,"F",202508,203201,"En Ruta","Dia 1","CARMEL","PROVINCIA",{"$f":"NETWORKDAYS.INTL(D211,M211,11,'Dias Feriados'!$A$1:$A$15)","v":-39255},"En Ruta",22,"NO",null,0.9375,0.94722222222222219,1,"CRUCES CHO","2025-05-28",null,null,45804,"",{"$f":"IF(AS211=\"Devuelto\",\"\",IF(X211=\"24hrs\",\"Entregado\",CONSOLIDADO!S211))","v":"En Ruta"},"",{"$f":"IF(AK211=\"Entregado\",\"\",IF(X211=\"24hrs\",\"\",IF(X211=\"48hrs\",\"Entregado\",CONSOLIDADO!S211)))","v":"En Ruta"},"",{"$f":"IF(AK211=\"Entregado\",\"\",IF(OR(X211=\"24hrs\",X211=\"48hrs\"),\"\",IF(X211=\"72hrs\",\"Entregado\",CONSOLIDADO!S211)))","v":"En Ruta"},"",{"$f":"IF(AK211=\"Entregado\",\"\",IF(OR(X211=\"24hrs\",X211=\"48hrs\",X211=\"72hrs\"),\"\",IF(X211=\"+72hrs\",\"Entregado\",CONSOLIDADO!S211)))","v":"En Ruta"},"","En Ruta",1,0,0,0,0,1,0,"No Entregado",0,0,1,0,{"$f":"IF(V211=\"Lima\",NETWORKDAYS.INTL(D211,M211,11,'Dias Feriados'!$A$1:$A$15),IF(AND(V211=\"provincia\",X211=\"24hrs\"),1,IF(AND(V211=\"provincia\",X211=\"48hrs\"),2,NETWORKDAYS.INTL(D211,M211,11,'Dias Feriados'!$A$1:$A$15))))","v":-39255}]
["B001667772","May","2025-05-27","2025-05-28","G/I. 030-10132",211,"ELIZABETH FARFAN SIMON","ACS SANTA ROSA L8 MZL LT CENTRO DE SALUD","Provincia","ICA","PARCONA","B001667772",null,"En Ruta",9730017227,"F",202508,203201,"En Ruta","Dia 1","CARMEL","PROVINCIA",{"$f":"NETWORKDAYS.INTL(D212,M212,11,'Dias Feriados'!$A$1:$A$15)","v":-39255},"En Ruta",22,"NO",null,0.9375,0.94722222222222219,1,"CRUCES CHO","2025-05-28",null,null,45804,"",{"$f":"IF(AS212=\"Devuelto\",\"\",IF(X212=\"24hrs\",\"Entregado\",CONSOLIDADO!S212))","v":"En Ruta"},"",{"$f":"IF(AK212=\"Entregado\",\"\",IF(X212=\"24hrs\",\"\",IF(X212=\"48hrs\",\"Entregado\",CONSOLIDADO!S212)))","v":"En Ruta"},"",{"$f":"IF(AK212=\"Entregado\",\"\",IF(OR(X212=\"24hrs\",X212=\"48hrs\"),\"\",IF(X212=\"72hrs\",\"Entregado\",CONSOLIDADO!S212)))","v":"En Ruta"},"",{"$f":"IF(AK212=\"Entregado\",\"\",IF(OR(X212=\"24hrs\",X212=\"48hrs\",X212=\"72hrs\"),\"\",IF(X212=\"+72hrs\",\"Entregado\",CONSOLIDADO!S212)))","v":"En Ruta"},"","En Ruta",1,0,0,0,0,1,0,"No Entregado",0,0,1,0,{"$f":"IF(V212=\"Lima\",NETWORKDAYS.INTL(D212,M212,11,'Dias Feriados'!$A$1:$A$15),IF(AND(V212=\"provincia\",X212=\"24hrs\"),1,IF(AND(V212=\"provincia\",X212=\"48hrs\"),2,NETWORKDAYS.INTL(D212,M212,11,'Dias Feriados'!$A$1:$A$15))))","v":-39255}]
["B001667348","May","2025-05-27","2025-05-28","G/I. 030-10132",212,"KAREN CUSQUISIBAN GARCIA","SANTA BARBARA B 4 POR SAN CAMILO PARCONA","Provincia","ICA","PARCONA","B001667348",null,"En Ruta",9730017229,"F",202508,203201,"En Ruta","Dia 1","CARMEL","PROVINCIA",{"$f":"NETWORKDAYS.INTL(D213,M213,11,'Dias Feriados'!$A$1:$A$15)","v":-39255},"En Ruta",22,"NO",null,0.9375,0.94722222222222219,1,"CRUCES CHO","2025-05-28",null,null,45804,"",{"$f":"IF(AS213=\"Devuelto\",\"\",IF(X213=\"24hrs\",\"Entregado\",CONSOLIDADO!S213))","v":"En Ruta"},"",{"$f":"IF(AK213=\"Entregado\",\"\",IF(X213=\"24hrs\",\"\",IF(X213=\"48hrs\",\"Entregado\",CONSOLIDADO!S213)))","v":"En Ruta"},"",{"$f":"IF(AK213=\"Entregado\",\"\",IF(OR(X213=\"24hrs\",X213=\"48hrs\"),\"\",IF(X213=\"72hrs\",\"Entregado\",CONSOLIDADO!S213)))","v":"En Ruta"},"",{"$f":"IF(AK213=\"Entregado\",\"\",IF(OR(X213=\"24hrs\",X213=\"48hrs\",X213=\"72hrs\"),\"\",IF(X213=\"+72hrs\",\"Entregado\",CONSOLIDADO!S213)))","v":"En Ruta"},"","En Ruta",1,0,0,0,0,1,0,"No Entregado",0,0,1,0,{"$f":"IF(V213=\"Lima\",NETWORKDAYS.INTL(D213,M213,11,'Dias Feriados'!$A$1:$A$15),IF(AND(V213=\"provincia\",X213=\"24hrs\"),1,IF(AND(V213=\"provincia\",X213=\"48hrs\"),2,NETWORKDAYS.INTL(D213,M213,11,'Dias Feriados'!$A$1:$A$15))))","v":-39255}]
["B001667432","May","2025-05-27","2025-05-28","G/I. 030-10132",213,"DAYANNE SANDYVETH RAMIREZ FARF","ASC SANTA ROSA DE LIMA 1ET MZP LT 16 A DOS ESPALDAS DE LA POSTA","Provincia","ICA","PARCONA","B001667432",null,"En Ruta",9730017237,"F",202508,203201,"En Ruta","Dia 1","CARMEL","PROVINCIA",{"$f":"NETWORKDAYS.INTL(D214,M214,11,'Dias Feriados'!$A$1:$A$15)","v":-39255},"En Ruta",22,"NO",null,0.9375,0.94722222222222219,1,"CRUCES CHO","2025-05-28",null,null,45804,"",{"$f":"IF(AS214=\"Devuelto\",\"\",IF(X214=\"24hrs\",\"Entregado\",CONSOLIDADO!S214))","v":"En Ruta"},"",{"$f":"IF(AK214=\"Entregado\",\"\",IF(X214=\"24hrs\",\"\",IF(X214=\"48hrs\",\"Entregado\",CONSOLIDADO!S214)))","v":"En Ruta"},"",{"$f":"IF(AK214=\"Entregado\",\"\",IF(OR(X214=\"24hrs\",X214=\"48hrs\"),\"\",IF(X214=\"72hrs\",\"Entregado\",CONSOLIDADO!S214)))","v":"En Ruta"},"",{"$f":"IF(AK214=\"Entregado\",\"\",IF(OR(X214=\"24hrs\",X214=\"48hrs\",X214=\"72hrs\"),\"\",IF(X214=\"+72hrs\",\"Entregado\",CONSOLIDADO!S214)))","v":"En Ruta"},"","En Ruta",1,0,0,0,0,1,0,"No Entregado",0,0,1,0,{"$f":"IF(V214=\"Lima\",NETWORKDAYS.INTL(D214,M214,11,'Dias Feriados'!$A$1:$A$15),IF(AND(V214=\"provincia\",X214=\"24hrs\"),1,IF(AND(V214=\"provincia\",X214=\"48hrs\"),2,NETWORKDAYS.INTL(D214,M214,11,'Dias Feriados'!$A$1:$A$15))))","v":-39255}]
["B001667520","May","2025-05-27","2025-05-28","G/I. 030-10132",214,"ISABEL LUISA TITO HUAMANI","JUAN PABLO FERNANDINI 371 A 3 CUADRAS DE IGLESIA DE PARCONA JUAN PABLO FERNANDINI","Provincia","ICA","PARCONA","B001667520",null,"En Ruta",9730017242,"F",202508,203201,"En Ruta","Dia 1","CARMEL","PROVINCIA",{"$f":"NETWORKDAYS.INTL(D215,M215,11,'Dias Feriados'!$A$1:$A$15)","v":-39255},"En Ruta",22,"NO",null,0.9375,0.94722222222222219,1,"CRUCES CHO","2025-05-28",null,null,45804,"",{"$f":"IF(AS215=\"Devuelto\",\"\",IF(X215=\"24hrs\",\"Entregado\",CONSOLIDADO!S215))","v":"En Ruta"},"",{"$f":"IF(AK215=\"Entregado\",\"\",IF(X215=\"24hrs\",\"\",IF(X215=\"48hrs\",\"Entregado\",CONSOLIDADO!S215)))","v":"En Ruta"},"",{"$f":"IF(AK215=\"Entregado\",\"\",IF(OR(X215=\"24hrs\",X215=\"48hrs\"),\"\",IF(X215=\"72hrs\",\"Entregado\",CONSOLIDADO!S215)))","v":"En Ruta"},"",{"$f":"IF(AK215=\"Entregado\",\"\",IF(OR(X215=\"24hrs\",X215=\"48hrs\",X215=\"72hrs\"),\"\",IF(X215=\"+72hrs\",\"Entregado\",CONSOLIDADO!S215)))","v":"En Ruta"},"","En Ruta",1,0,0,0,0,1,0,"No Entregado",0,0,1,0,{"$f":"IF(V215=\"Lima\",NETWORKDAYS.INTL(D215,M215,11,'Dias Feriados'!$A$1:$A$15),IF(AND(V215=\"provincia\",X215=\"24hrs\"),1,IF(AND(V215=\"provincia\",X215=\"48hrs\"),2,NETWORKDAYS.INTL(D215,M215,11,'Dias Feriados'!$A$1:$A$15))))","v":-39255}]
["B001667579","May","2025-05-27","2025-05-28","G/I. 030-10132",215,"CONSUELO AMPARO REYES DEFLORES","SANTA ROSA DE LIMA B 12 1 ET POLLERIA RAMIREZ DERECHA","Provincia","ICA","PARCONA","B001667579",null,"En Ruta",9730017249,"F",202508,203201,"En Ruta","Dia 1","CARMEL","PROVINCIA",{"$f":"NETWORKDAYS.INTL(D216,M216,11,'Dias Feriados'!$A$1:$A$15)","v":-39255},"En Ruta",22,"NO",null,0.9375,0.94722222222222219,1,"CRUCES CHO","2025-05-28",null,null,45804,"",{"$f":"IF(AS216=\"Devuelto\",\"\",IF(X216=\"24hrs\",\"Entregado\",CONSOLIDADO!S216))","v":"En Ruta"},"",{"$f":"IF(AK216=\"Entregado\",\"\",IF(X216=\"24hrs\",\"\",IF(X216=\"48hrs\",\"Entregado\",CONSOLIDADO!S216)))","v":"En Ruta"},"",{"$f":"IF(AK216=\"Entregado\",\"\",IF(OR(X216=\"24hrs\",X216=\"48hrs\"),\"\",IF(X216=\"72hrs\",\"Entregado\",CONSOLIDADO!S216)))","v":"En Ruta"},"",{"$f":"IF(AK216=\"Entregado\",\"\",IF(OR(X216=\"24hrs\",X216=\"48hrs\",X216=\"72hrs\"),\"\",IF(X216=\"+72hrs\",\"Entregado\",CONSOLIDADO!S216)))","v":"En Ruta"},"","En Ruta",1,0,0,0,0,1,0,"No Entregado",0,0,1,0,{"$f":"IF(V216=\"Lima\",NETWORKDAYS.INTL(D216,M216,11,'Dias Feriados'!$A$1:$A$15),IF(AND(V216=\"provincia\",X216=\"24hrs\"),1,IF(AND(V216=\"provincia\",X216=\"48hrs\"),2,NETWORKDAYS.INTL(D216,M216,11,'Dias Feriados'!$A$1:$A$15))))","v":-39255}]
["B001667424","May","2025-05-27","2025-05-28","G/I. 030-10132",216,"NEY ALARCON MEZA","JOSE GALVEZ 819 PUERTA PRINCIPAL DE ESTADIO HUGO SOTIL JOSE GALVEZ","Provincia","ICA","PARCONA","B001667424",null,"En Ruta",9730017270,"F",202508,203201,"En Ruta","Dia 1","CARMEL","PROVINCIA",{"$f":"NETWORKDAYS.INTL(D217,M217,11,'Dias Feriados'!$A$1:$A$15)","v":-39255},"En Ruta",22,"NO",null,0.9375,0.94722222222222219,1,"CRUCES CHO","2025-05-28",null,null,45804,"",{"$f":"IF(AS217=\"Devuelto\",\"\",IF(X217=\"24hrs\",\"Entregado\",CONSOLIDADO!S217))","v":"En Ruta"},"",{"$f":"IF(AK217=\"Entregado\",\"\",IF(X217=\"24hrs\",\"\",IF(X217=\"48hrs\",\"Entregado\",CONSOLIDADO!S217)))","v":"En Ruta"},"",{"$f":"IF(AK217=\"Entregado\",\"\",IF(OR(X217=\"24hrs\",X217=\"48hrs\"),\"\",IF(X217=\"72hrs\",\"Entregado\",CONSOLIDADO!S217)))","v":"En Ruta"},"",{"$f":"IF(AK217=\"Entregado\",\"\",IF(OR(X217=\"24hrs\",X217=\"48hrs\",X217=\"72hrs\"),\"\",IF(X217=\"+72hrs\",\"Entregado\",CONSOLIDADO!S217)))","v":"En Ruta"},"","En Ruta",1,0,0,0,0,1,0,"No Entregado",0,0,1,0,{"$f":"IF(V217=\"Lima\",NETWORKDAYS.INTL(D217,M217,11,'Dias Feriados'!$A$1:$A$15),IF(AND(V217=\"provincia\",X217=\"24hrs\"),1,IF(AND(V217=\"provincia\",X217=\"48hrs\"),2,NETWORKDAYS.INTL(D217,M217,11,'Dias Feriados'!$A$1:$A$15))))","v":-39255}]
["B001667652","May","2025-05-27","2025-05-28","G/I. 030-10132",217,"LIZ EVELYN SUAREZ VILLAGOMEZ","CL LIMA 224 CDRA DESPUES DE LA COMISARIA DE PARCONA","Provincia","ICA","PARCONA","B001667652",null,"En Ruta",9730017274,"F",202508,203201,"En Ruta","Dia 1","CARMEL","PROVINCIA",{"$f":"NETWORKDAYS.INTL(D218,M218,11,'Dias Feriados'!$A$1:$A$15)","v":-39255},"En Ruta",22,"NO",null,0.9375,0.94722222222222219,1,"CRUCES CHO","2025-05-28",null,null,45804,"",{"$f":"IF(AS218=\"Devuelto\",\"\",IF(X218=\"24hrs\",\"Entregado\",CONSOLIDADO!S218))","v":"En Ruta"},"",{"$f":"IF(AK218=\"Entregado\",\"\",IF(X218=\"24hrs\",\"\",IF(X218=\"48hrs\",\"Entregado\",CONSOLIDADO!S218)))","v":"En Ruta"},"",{"$f":"IF(AK218=\"Entregado\",\"\",IF(OR(X218=\"24hrs\",X218=\"48hrs\"),\"\",IF(X218=\"72hrs\",\"Entregado\",CONSOLIDADO!S218)))","v":"En Ruta"},"",{"$f":"IF(AK218=\"Entregado\",\"\",IF(OR(X218=\"24hrs\",X218=\"48hrs\",X218=\"72hrs\"),\"\",IF(X218=\"+72hrs\",\"Entregado\",CONSOLIDADO!S218)))","v":"En Ruta"},"","En Ruta",1,0,0,0,0,1,0,"No Entregado",0,0,1,0,{"$f":"IF(V218=\"Lima\",NETWORKDAYS.INTL(D218,M218,11,'Dias Feriados'!$A$1:$A$15),IF(AND(V218=\"provincia\",X218=\"24hrs\"),1,IF(AND(V218=\"provincia\",X218=\"48hrs\"),2,NETWORKDAYS.INTL(D218,M218,11,'Dias Feriados'!$A$1:$A$15))))","v":-39255}]
["B001667447","May","2025-05-27","2025-05-28","G/I. 030-10132",218,"DINA ROSARIO ORE GUILLEN","ALAMEDA DE PARCONA MZ B6 LT 59 FRENTE AL PARQUE ALAMEDA DE PARCONA SEGUNDA ETAPA","Provincia","ICA","PARCONA","B001667447",null,"En Ruta",9730017281,"F",202508,203201,"En Ruta","Dia 1","CARMEL","PROVINCIA",{"$f":"NETWORKDAYS.INTL(D219,M219,11,'Dias Feriados'!$A$1:$A$15)","v":-39255},"En Ruta",22,"NO",null,0.9375,0.94722222222222219,1,"CRUCES CHO","2025-05-28",null,null,45804,"",{"$f":"IF(AS219=\"Devuelto\",\"\",IF(X219=\"24hrs\",\"Entregado\",CONSOLIDADO!S219))","v":"En Ruta"},"",{"$f":"IF(AK219=\"Entregado\",\"\",IF(X219=\"24hrs\",\"\",IF(X219=\"48hrs\",\"Entregado\",CONSOLIDADO!S219)))","v":"En Ruta"},"",{"$f":"IF(AK219=\"Entregado\",\"\",IF(OR(X219=\"24hrs\",X219=\"48hrs\"),\"\",IF(X219=\"72hrs\",\"Entregado\",CONSOLIDADO!S219)))","v":"En Ruta"},"",{"$f":"IF(AK219=\"Entregado\",\"\",IF(OR(X219=\"24hrs\",X219=\"48hrs\",X219=\"72hrs\"),\"\",IF(X219=\"+72hrs\",\"Entregado\",CONSOLIDADO!S219)))","v":"En Ruta"},"","En Ruta",1,0,0,0,0,1,0,"No Entregado",0,0,1,0,{"$f":"IF(V219=\"Lima\",NETWORKDAYS.INTL(D219,M219,11,'Dias Feriados'!$A$1:$A$15),IF(AND(V219=\"provincia\",X219=\"24hrs\"),1,IF(AND(V219=\"provincia\",X219=\"48hrs\"),2,NETWORKDAYS.INTL(D219,M219,11,'Dias Feriados'!$A$1:$A$15))))","v":-39255}]
["B001667763","May","2025-05-27","2025-05-28","G/I. 030-10132",219,"KAREN GERALDINE ARCOS CAYO","COOP SANTA ROSA K1 URB ALAMEDA CENTRO POBLADO","Provincia","ICA","PARCONA","B001667763",null,"En Ruta",9730017304,"F",202508,203201,"En Ruta","Dia 1","CARMEL","PROVINCIA",{"$f":"NETWORKDAYS.INTL(D220,M220,11,'Dias Feriados'!$A$1:$A$15)","v":-39255},"En Ruta",22,"NO",null,0.9375,0.94722222222222219,1,"CRUCES CHO","2025-05-28",null,null,45804,"",{"$f":"IF(AS220=\"Devuelto\",\"\",IF(X220=\"24hrs\",\"Entregado\",CONSOLIDADO!S220))","v":"En Ruta"},"",{"$f":"IF(AK220=\"Entregado\",\"\",IF(X220=\"24hrs\",\"\",IF(X220=\"48hrs\",\"Entregado\",CONSOLIDADO!S220)))","v":"En Ruta"},"",{"$f":"IF(AK220=\"Entregado\",\"\",IF(OR(X220=\"24hrs\",X220=\"48hrs\"),\"\",IF(X220=\"72hrs\",\"Entregado\",CONSOLIDADO!S220)))","v":"En Ruta"},"",{"$f":"IF(AK220=\"Entregado\",\"\",IF(OR(X220=\"24hrs\",X220=\"48hrs\",X220=\"72hrs\"),\"\",IF(X220=\"+72hrs\",\"Entregado\",CONSOLIDADO!S220)))","v":"En Ruta"},"","En Ruta",1,0,0,0,0,1,0,"No Entregado",0,0,1,0,{"$f":"IF(V220=\"Lima\",NETWORKDAYS.INTL(D220,M220,11,'Dias Feriados'!$A$1:$A$15),IF(AND(V220=\"provincia\",X220=\"24hrs\"),1,IF(AND(V220=\"provincia\",X220=\"48hrs\"),2,NETWORKDAYS.INTL(D220,M220,11,'Dias Feriados'!$A$1:$A$15))))","v":-39255}]
["B001667482","May","2025-05-27","2025-05-28","G/I. 030-10132",220,"BREYDY LESLIE MACHACA GONZALES","AV7 MZ A LT 5 PASANDO GRIFO PHANY PSJE EL JUNCAL AV7 PARCONA","Provincia","ICA","PARCONA","B001667482",null,"En Ruta",9730017318,"F",202508,203201,"En Ruta","Dia 1","CARMEL","PROVINCIA",{"$f":"NETWORKDAYS.INTL(D221,M221,11,'Dias Feriados'!$A$1:$A$15)","v":-39255},"En Ruta",22,"NO",null,0.9375,0.94722222222222219,1,"CRUCES CHO","2025-05-28",null,null,45804,"",{"$f":"IF(AS221=\"Devuelto\",\"\",IF(X221=\"24hrs\",\"Entregado\",CONSOLIDADO!S221))","v":"En Ruta"},"",{"$f":"IF(AK221=\"Entregado\",\"\",IF(X221=\"24hrs\",\"\",IF(X221=\"48hrs\",\"Entregado\",CONSOLIDADO!S221)))","v":"En Ruta"},"",{"$f":"IF(AK221=\"Entregado\",\"\",IF(OR(X221=\"24hrs\",X221=\"48hrs\"),\"\",IF(X221=\"72hrs\",\"Entregado\",CONSOLIDADO!S221)))","v":"En Ruta"},"",{"$f":"IF(AK221=\"Entregado\",\"\",IF(OR(X221=\"24hrs\",X221=\"48hrs\",X221=\"72hrs\"),\"\",IF(X221=\"+72hrs\",\"Entregado\",CONSOLIDADO!S221)))","v":"En Ruta"},"","En Ruta",1,0,0,0,0,1,0,"No Entregado",0,0,1,0,{"$f":"IF(V221=\"Lima\",NETWORKDAYS.INTL(D221,M221,11,'Dias Feriados'!$A$1:$A$15),IF(AND(V221=\"provincia\",X221=\"24hrs\"),1,IF(AND(V221=\"provincia\",X221=\"48hrs\"),2,NETWORKDAYS.INTL(D221,M221,11,'Dias Feriados'!$A$1:$A$15))))","v":-39255}]
["B001667359","May","2025-05-27","2025-05-28","G/I. 030-10132",221,"SAYUMI HEIDY HUAMANI TELLEZ","AV TUPAC AMARU 501 CON RAUL PORRAS BARRENECHEA 501 MZ 04 LT 18 ESPALDA DE LA MUNICIPALIDAD DE PARCONA","Provincia","ICA","PARCONA","B001667359",null,"En Ruta",9730017329,"F",202508,203201,"En Ruta","Dia 1","CARMEL","PROVINCIA",{"$f":"NETWORKDAYS.INTL(D222,M222,11,'Dias Feriados'!$A$1:$A$15)","v":-39255},"En Ruta",22,"NO",null,0.9375,0.94722222222222219,1,"CRUCES CHO","2025-05-28",null,null,45804,"",{"$f":"IF(AS222=\"Devuelto\",\"\",IF(X222=\"24hrs\",\"Entregado\",CONSOLIDADO!S222))","v":"En Ruta"},"",{"$f":"IF(AK222=\"Entregado\",\"\",IF(X222=\"24hrs\",\"\",IF(X222=\"48hrs\",\"Entregado\",CONSOLIDADO!S222)))","v":"En Ruta"},"",{"$f":"IF(AK222=\"Entregado\",\"\",IF(OR(X222=\"24hrs\",X222=\"48hrs\"),\"\",IF(X222=\"72hrs\",\"Entregado\",CONSOLIDADO!S222)))","v":"En Ruta"},"",{"$f":"IF(AK222=\"Entregado\",\"\",IF(OR(X222=\"24hrs\",X222=\"48hrs\",X222=\"72hrs\"),\"\",IF(X222=\"+72hrs\",\"Entregado\",CONSOLIDADO!S222)))","v":"En Ruta"},"","En Ruta",1,0,0,0,0,1,0,"No Entregado",0,0,1,0,{"$f":"IF(V222=\"Lima\",NETWORKDAYS.INTL(D222,M222,11,'Dias Feriados'!$A$1:$A$15),IF(AND(V222=\"provincia\",X222=\"24hrs\"),1,IF(AND(V222=\"provincia\",X222=\"48hrs\"),2,NETWORKDAYS.INTL(D222,M222,11,'Dias Feriados'!$A$1:$A$15))))","v":-39255}]
["B001667361","May","2025-05-27","2025-05-28","G/I. 030-10132",222,"JENNY LEDIA GRADOS AVALOS","FRENTE A BODEGA FLICKS MZ R LT 19 POR LA POSTA MEDICA ACOMAYO","Provincia","ICA","PARCONA","B001667361",null,"En Ruta",9730017343,"F",202508,203201,"En Ruta","Dia 1","CARMEL","PROVINCIA",{"$f":"NETWORKDAYS.INTL(D223,M223,11,'Dias Feriados'!$A$1:$A$15)","v":-39255},"En Ruta",22,"NO",null,0.9375,0.94722222222222219,1,"CRUCES CHO","2025-05-28",null,null,45804,"",{"$f":"IF(AS223=\"Devuelto\",\"\",IF(X223=\"24hrs\",\"Entregado\",CONSOLIDADO!S223))","v":"En Ruta"},"",{"$f":"IF(AK223=\"Entregado\",\"\",IF(X223=\"24hrs\",\"\",IF(X223=\"48hrs\",\"Entregado\",CONSOLIDADO!S223)))","v":"En Ruta"},"",{"$f":"IF(AK223=\"Entregado\",\"\",IF(OR(X223=\"24hrs\",X223=\"48hrs\"),\"\",IF(X223=\"72hrs\",\"Entregado\",CONSOLIDADO!S223)))","v":"En Ruta"},"",{"$f":"IF(AK223=\"Entregado\",\"\",IF(OR(X223=\"24hrs\",X223=\"48hrs\",X223=\"72hrs\"),\"\",IF(X223=\"+72hrs\",\"Entregado\",CONSOLIDADO!S223)))","v":"En Ruta"},"","En Ruta",1,0,0,0,0,1,0,"No Entregado",0,0,1,0,{"$f":"IF(V223=\"Lima\",NETWORKDAYS.INTL(D223,M223,11,'Dias Feriados'!$A$1:$A$15),IF(AND(V223=\"provincia\",X223=\"24hrs\"),1,IF(AND(V223=\"provincia\",X223=\"48hrs\"),2,NETWORKDAYS.INTL(D223,M223,11,'Dias Feriados'!$A$1:$A$15))))","v":-39255}]
["B001667532","May","2025-05-27","2025-05-28","G/I. 030-10132",223,"JASMIN ESTEFANI MEZA MISAICO","CLL ANDRES AVELINO CACERES MZ N PUERTA 06","Provincia","ICA","PARCONA","B001667532",null,"En Ruta",9730017353,"F",202508,203201,"En Ruta","Dia 1","CARMEL","PROVINCIA",{"$f":"NETWORKDAYS.INTL(D224,M224,11,'Dias Feriados'!$A$1:$A$15)","v":-39255},"En Ruta",22,"NO",null,0.9375,0.94722222222222219,1,"CRUCES CHO","2025-05-28",null,null,45804,"",{"$f":"IF(AS224=\"Devuelto\",\"\",IF(X224=\"24hrs\",\"Entregado\",CONSOLIDADO!S224))","v":"En Ruta"},"",{"$f":"IF(AK224=\"Entregado\",\"\",IF(X224=\"24hrs\",\"\",IF(X224=\"48hrs\",\"Entregado\",CONSOLIDADO!S224)))","v":"En Ruta"},"",{"$f":"IF(AK224=\"Entregado\",\"\",IF(OR(X224=\"24hrs\",X224=\"48hrs\"),\"\",IF(X224=\"72hrs\",\"Entregado\",CONSOLIDADO!S224)))","v":"En Ruta"},"",{"$f":"IF(AK224=\"Entregado\",\"\",IF(OR(X224=\"24hrs\",X224=\"48hrs\",X224=\"72hrs\"),\"\",IF(X224=\"+72hrs\",\"Entregado\",CONSOLIDADO!S224)))","v":"En Ruta"},"","En Ruta",1,0,0,0,0,1,0,"No Entregado",0,0,1,0,{"$f":"IF(V224=\"Lima\",NETWORKDAYS.INTL(D224,M224,11,'Dias Feriados'!$A$1:$A$15),IF(AND(V224=\"provincia\",X224=\"24hrs\"),1,IF(AND(V224=\"provincia\",X224=\"48hrs\"),2,NETWORKDAYS.INTL(D224,M224,11,'Dias Feriados'!$A$1:$A$15))))","v":-39255}]
["B001667562","May","2025-05-27","2025-05-28","G/I. 030-10132",224,"SOLEDAD ELENA CANTORAL QUISPE","JIRON MARIA OLIVEROS 157 REF CUADRA 8 DE AV 18 DE FEBRERO A LA DERECHA","Provincia","ICA","PARCONA","B001667562",null,"En Ruta",9730017360,"F",202508,203201,"En Ruta","Dia 1","CARMEL","PROVINCIA",{"$f":"NETWORKDAYS.INTL(D225,M225,11,'Dias Feriados'!$A$1:$A$15)","v":-39255},"En Ruta",22,"NO",null,0.9375,0.94722222222222219,1,"CRUCES CHO","2025-05-28",null,null,45804,"",{"$f":"IF(AS225=\"Devuelto\",\"\",IF(X225=\"24hrs\",\"Entregado\",CONSOLIDADO!S225))","v":"En Ruta"},"",{"$f":"IF(AK225=\"Entregado\",\"\",IF(X225=\"24hrs\",\"\",IF(X225=\"48hrs\",\"Entregado\",CONSOLIDADO!S225)))","v":"En Ruta"},"",{"$f":"IF(AK225=\"Entregado\",\"\",IF(OR(X225=\"24hrs\",X225=\"48hrs\"),\"\",IF(X225=\"72hrs\",\"Entregado\",CONSOLIDADO!S225)))","v":"En Ruta"},"",{"$f":"IF(AK225=\"Entregado\",\"\",IF(OR(X225=\"24hrs\",X225=\"48hrs\",X225=\"72hrs\"),\"\",IF(X225=\"+72hrs\",\"Entregado\",CONSOLIDADO!S225)))","v":"En Ruta"},"","En Ruta",1,0,0,0,0,1,0,"No Entregado",0,0,1,0,{"$f":"IF(V225=\"Lima\",NETWORKDAYS.INTL(D225,M225,11,'Dias Feriados'!$A$1:$A$15),IF(AND(V225=\"provincia\",X225=\"24hrs\"),1,IF(AND(V225=\"provincia\",X225=\"48hrs\"),2,NETWORKDAYS.INTL(D225,M225,11,'Dias Feriados'!$A$1:$A$15))))","v":-39255}]
["B001667343","May","2025-05-27","2025-05-28","G/I. 030-10132",225,"SUSANA CRISTINA ESCATE FORONDA","POR COL NACIONAL DE MUJERES 695 FRENTE A COLEGIO 22319 CALLE 18 DE FEBRERO","Provincia","ICA","PARCONA","B001667343",null,"En Ruta",9730017401,"F",202508,203201,"En Ruta","Dia 1","CARMEL","PROVINCIA",{"$f":"NETWORKDAYS.INTL(D226,M226,11,'Dias Feriados'!$A$1:$A$15)","v":-39255},"En Ruta",22,"NO",null,0.9375,0.94722222222222219,1,"CRUCES CHO","2025-05-28",null,null,45804,"",{"$f":"IF(AS226=\"Devuelto\",\"\",IF(X226=\"24hrs\",\"Entregado\",CONSOLIDADO!S226))","v":"En Ruta"},"",{"$f":"IF(AK226=\"Entregado\",\"\",IF(X226=\"24hrs\",\"\",IF(X226=\"48hrs\",\"Entregado\",CONSOLIDADO!S226)))","v":"En Ruta"},"",{"$f":"IF(AK226=\"Entregado\",\"\",IF(OR(X226=\"24hrs\",X226=\"48hrs\"),\"\",IF(X226=\"72hrs\",\"Entregado\",CONSOLIDADO!S226)))","v":"En Ruta"},"",{"$f":"IF(AK226=\"Entregado\",\"\",IF(OR(X226=\"24hrs\",X226=\"48hrs\",X226=\"72hrs\"),\"\",IF(X226=\"+72hrs\",\"Entregado\",CONSOLIDADO!S226)))","v":"En Ruta"},"","En Ruta",1,0,0,0,0,1,0,"No Entregado",0,0,1,0,{"$f":"IF(V226=\"Lima\",NETWORKDAYS.INTL(D226,M226,11,'Dias Feriados'!$A$1:$A$15),IF(AND(V226=\"provincia\",X226=\"24hrs\"),1,IF(AND(V226=\"provincia\",X226=\"48hrs\"),2,NETWORKDAYS.INTL(D226,M226,11,'Dias Feriados'!$A$1:$A$15))))","v":-39255}]
["B001667617","May","2025-05-27","2025-05-28","G/I. 030-10132",226,"RAIZA DAMARIS RAMOS ARONI","AV MARIANA MELGAR 330 ASOC SANTA ROSA DE LIMA ETAPA 1","Provincia","ICA","PARCONA","B001667617",null,"En Ruta",9730017418,"F",202508,203201,"En Ruta","Dia 1","CARMEL","PROVINCIA",{"$f":"NETWORKDAYS.INTL(D227,M227,11,'Dias Feriados'!$A$1:$A$15)","v":-39255},"En Ruta",22,"NO",null,0.9375,0.94722222222222219,1,"CRUCES CHO","2025-05-28",null,null,45804,"",{"$f":"IF(AS227=\"Devuelto\",\"\",IF(X227=\"24hrs\",\"Entregado\",CONSOLIDADO!S227))","v":"En Ruta"},"",{"$f":"IF(AK227=\"Entregado\",\"\",IF(X227=\"24hrs\",\"\",IF(X227=\"48hrs\",\"Entregado\",CONSOLIDADO!S227)))","v":"En Ruta"},"",{"$f":"IF(AK227=\"Entregado\",\"\",IF(OR(X227=\"24hrs\",X227=\"48hrs\"),\"\",IF(X227=\"72hrs\",\"Entregado\",CONSOLIDADO!S227)))","v":"En Ruta"},"",{"$f":"IF(AK227=\"Entregado\",\"\",IF(OR(X227=\"24hrs\",X227=\"48hrs\",X227=\"72hrs\"),\"\",IF(X227=\"+72hrs\",\"Entregado\",CONSOLIDADO!S227)))","v":"En Ruta"},"","En Ruta",1,0,0,0,0,1,0,"No Entregado",0,0,1,0,{"$f":"IF(V227=\"Lima\",NETWORKDAYS.INTL(D227,M227,11,'Dias Feriados'!$A$1:$A$15),IF(AND(V227=\"provincia\",X227=\"24hrs\"),1,IF(AND(V227=\"provincia\",X227=\"48hrs\"),2,NETWORKDAYS.INTL(D227,M227,11,'Dias Feriados'!$A$1:$A$15))))","v":-39255}]
["B001667618","May","2025-05-27","2025-05-28","G/I. 030-10132",227,"LUIS RIVALDO PALOMINO CABRERA","CALLE SAN JORGE MZ B13 FRENTE COLEGIO SAN JORGE AV 7 MI NUEVO PERU B13","Provincia","ICA","PARCONA","B001667618",null,"En Ruta",9730017448,"F",202508,203201,"En Ruta","Dia 1","CARMEL","PROVINCIA",{"$f":"NETWORKDAYS.INTL(D228,M228,11,'Dias Feriados'!$A$1:$A$15)","v":-39255},"En Ruta",22,"NO",null,0.9375,0.94722222222222219,1,"CRUCES CHO","2025-05-28",null,null,45804,"",{"$f":"IF(AS228=\"Devuelto\",\"\",IF(X228=\"24hrs\",\"Entregado\",CONSOLIDADO!S228))","v":"En Ruta"},"",{"$f":"IF(AK228=\"Entregado\",\"\",IF(X228=\"24hrs\",\"\",IF(X228=\"48hrs\",\"Entregado\",CONSOLIDADO!S228)))","v":"En Ruta"},"",{"$f":"IF(AK228=\"Entregado\",\"\",IF(OR(X228=\"24hrs\",X228=\"48hrs\"),\"\",IF(X228=\"72hrs\",\"Entregado\",CONSOLIDADO!S228)))","v":"En Ruta"},"",{"$f":"IF(AK228=\"Entregado\",\"\",IF(OR(X228=\"24hrs\",X228=\"48hrs\",X228=\"72hrs\"),\"\",IF(X228=\"+72hrs\",\"Entregado\",CONSOLIDADO!S228)))","v":"En Ruta"},"","En Ruta",1,0,0,0,0,1,0,"No Entregado",0,0,1,0,{"$f":"IF(V228=\"Lima\",NETWORKDAYS.INTL(D228,M228,11,'Dias Feriados'!$A$1:$A$15),IF(AND(V228=\"provincia\",X228=\"24hrs\"),1,IF(AND(V228=\"provincia\",X228=\"48hrs\"),2,NETWORKDAYS.INTL(D228,M228,11,'Dias Feriados'!$A$1:$A$15))))","v":-39255}]
["B001667745","May","2025-05-27","2025-05-28","G/I. 030-10132",228,"MARIVID DELOSANGELES GUEVARA V","PARCONA ESTADIO A LA IZQUIERDA 2 CDRS","Provincia","ICA","PARCONA","B001667745",null,"En Ruta",9730017462,"F",202508,203201,"En Ruta","Dia 1","CARMEL","PROVINCIA",{"$f":"NETWORKDAYS.INTL(D229,M229,11,'Dias Feriados'!$A$1:$A$15)","v":-39255},"En Ruta",22,"NO",null,0.9375,0.94722222222222219,1,"CRUCES CHO","2025-05-28",null,null,45804,"",{"$f":"IF(AS229=\"Devuelto\",\"\",IF(X229=\"24hrs\",\"Entregado\",CONSOLIDADO!S229))","v":"En Ruta"},"",{"$f":"IF(AK229=\"Entregado\",\"\",IF(X229=\"24hrs\",\"\",IF(X229=\"48hrs\",\"Entregado\",CONSOLIDADO!S229)))","v":"En Ruta"},"",{"$f":"IF(AK229=\"Entregado\",\"\",IF(OR(X229=\"24hrs\",X229=\"48hrs\"),\"\",IF(X229=\"72hrs\",\"Entregado\",CONSOLIDADO!S229)))","v":"En Ruta"},"",{"$f":"IF(AK229=\"Entregado\",\"\",IF(OR(X229=\"24hrs\",X229=\"48hrs\",X229=\"72hrs\"),\"\",IF(X229=\"+72hrs\",\"Entregado\",CONSOLIDADO!S229)))","v":"En Ruta"},"","En Ruta",1,0,0,0,0,1,0,"No Entregado",0,0,1,0,{"$f":"IF(V229=\"Lima\",NETWORKDAYS.INTL(D229,M229,11,'Dias Feriados'!$A$1:$A$15),IF(AND(V229=\"provincia\",X229=\"24hrs\"),1,IF(AND(V229=\"provincia\",X229=\"48hrs\"),2,NETWORKDAYS.INTL(D229,M229,11,'Dias Feriados'!$A$1:$A$15))))","v":-39255}]
["B001667797","May","2025-05-27","2025-05-28","G/I. 030-10132",229,"YURIKO YULIANA SUICA QUISPE","PASAJE ORONGO MZ C LT 10 PASANDO HOTEL WANDA A LA DERECHA URB MARIA ELENA","Provincia","ICA","PARCONA","B001667797",null,"En Ruta",9730017504,"F",202508,203201,"En Ruta","Dia 1","CARMEL","PROVINCIA",{"$f":"NETWORKDAYS.INTL(D230,M230,11,'Dias Feriados'!$A$1:$A$15)","v":-39255},"En Ruta",22,"NO",null,0.9375,0.94722222222222219,1,"CRUCES CHO","2025-05-28",null,null,45804,"",{"$f":"IF(AS230=\"Devuelto\",\"\",IF(X230=\"24hrs\",\"Entregado\",CONSOLIDADO!S230))","v":"En Ruta"},"",{"$f":"IF(AK230=\"Entregado\",\"\",IF(X230=\"24hrs\",\"\",IF(X230=\"48hrs\",\"Entregado\",CONSOLIDADO!S230)))","v":"En Ruta"},"",{"$f":"IF(AK230=\"Entregado\",\"\",IF(OR(X230=\"24hrs\",X230=\"48hrs\"),\"\",IF(X230=\"72hrs\",\"Entregado\",CONSOLIDADO!S230)))","v":"En Ruta"},"",{"$f":"IF(AK230=\"Entregado\",\"\",IF(OR(X230=\"24hrs\",X230=\"48hrs\",X230=\"72hrs\"),\"\",IF(X230=\"+72hrs\",\"Entregado\",CONSOLIDADO!S230)))","v":"En Ruta"},"","En Ruta",1,0,0,0,0,1,0,"No Entregado",0,0,1,0,{"$f":"IF(V230=\"Lima\",NETWORKDAYS.INTL(D230,M230,11,'Dias Feriados'!$A$1:$A$15),IF(AND(V230=\"provincia\",X230=\"24hrs\"),1,IF(AND(V230=\"provincia\",X230=\"48hrs\"),2,NETWORKDAYS.INTL(D230,M230,11,'Dias Feriados'!$A$1:$A$15))))","v":-39255}]
["B001667649","May","2025-05-27","2025-05-28","G/I. 030-10132",230,"ROSS MARILEY REYES MENDOZA","C P YAJASI MZA C LT 9B PREGUNTAR POR CASA DE MALEY","Provincia","ICA","PUEBLO NUEVO","B001667649",null,"En Ruta",9730017009,"F",202508,203201,"En Ruta","Dia 1","CARMEL","PROVINCIA",{"$f":"NETWORKDAYS.INTL(D231,M231,11,'Dias Feriados'!$A$1:$A$15)","v":-39255},"En Ruta",22,"NO",null,0.9375,0.94722222222222219,1,"CRUCES CHO","2025-05-28",null,null,45804,"",{"$f":"IF(AS231=\"Devuelto\",\"\",IF(X231=\"24hrs\",\"Entregado\",CONSOLIDADO!S231))","v":"En Ruta"},"",{"$f":"IF(AK231=\"Entregado\",\"\",IF(X231=\"24hrs\",\"\",IF(X231=\"48hrs\",\"Entregado\",CONSOLIDADO!S231)))","v":"En Ruta"},"",{"$f":"IF(AK231=\"Entregado\",\"\",IF(OR(X231=\"24hrs\",X231=\"48hrs\"),\"\",IF(X231=\"72hrs\",\"Entregado\",CONSOLIDADO!S231)))","v":"En Ruta"},"",{"$f":"IF(AK231=\"Entregado\",\"\",IF(OR(X231=\"24hrs\",X231=\"48hrs\",X231=\"72hrs\"),\"\",IF(X231=\"+72hrs\",\"Entregado\",CONSOLIDADO!S231)))","v":"En Ruta"},"","En Ruta",1,0,0,0,0,1,0,"No Entregado",0,0,1,0,{"$f":"IF(V231=\"Lima\",NETWORKDAYS.INTL(D231,M231,11,'Dias Feriados'!$A$1:$A$15),IF(AND(V231=\"provincia\",X231=\"24hrs\"),1,IF(AND(V231=\"provincia\",X231=\"48hrs\"),2,NETWORKDAYS.INTL(D231,M231,11,'Dias Feriados'!$A$1:$A$15))))","v":-39255}]
["B001668094","May","2025-05-27","2025-05-28","G/I. 030-10132",231,"JUANA MARIA MORAN MORMORES","CASERIO DE YAJASI PASANDO CAPILLA CASERIO DE YAJASI","Provincia","ICA","PUEBLO NUEVO","B001668094",null,"En Ruta",9730017107,"F",202508,203201,"En Ruta","Dia 1","CARMEL","PROVINCIA",{"$f":"NETWORKDAYS.INTL(D232,M232,11,'Dias Feriados'!$A$1:$A$15)","v":-39255},"En Ruta",22,"NO",null,0.9375,0.94722222222222219,1,"CRUCES CHO","2025-05-28",null,null,45804,"",{"$f":"IF(AS232=\"Devuelto\",\"\",IF(X232=\"24hrs\",\"Entregado\",CONSOLIDADO!S232))","v":"En Ruta"},"",{"$f":"IF(AK232=\"Entregado\",\"\",IF(X232=\"24hrs\",\"\",IF(X232=\"48hrs\",\"Entregado\",CONSOLIDADO!S232)))","v":"En Ruta"},"",{"$f":"IF(AK232=\"Entregado\",\"\",IF(OR(X232=\"24hrs\",X232=\"48hrs\"),\"\",IF(X232=\"72hrs\",\"Entregado\",CONSOLIDADO!S232)))","v":"En Ruta"},"",{"$f":"IF(AK232=\"Entregado\",\"\",IF(OR(X232=\"24hrs\",X232=\"48hrs\",X232=\"72hrs\"),\"\",IF(X232=\"+72hrs\",\"Entregado\",CONSOLIDADO!S232)))","v":"En Ruta"},"","En Ruta",1,0,0,0,0,1,0,"No Entregado",0,0,1,0,{"$f":"IF(V232=\"Lima\",NETWORKDAYS.INTL(D232,M232,11,'Dias Feriados'!$A$1:$A$15),IF(AND(V232=\"provincia\",X232=\"24hrs\"),1,IF(AND(V232=\"provincia\",X232=\"48hrs\"),2,NETWORKDAYS.INTL(D232,M232,11,'Dias Feriados'!$A$1:$A$15))))","v":-39255}]
["B001667754","May","2025-05-27","2025-05-28","G/I. 030-10132",232,"ANA NOA OBREGON","URB NUEVA ESPERANZA 1RA FAMILIA MZ J LT 16 FARMACIA FARMA SANA","Provincia","ICA","SALAS","B001667754",null,"En Ruta",9730017134,"F",202508,203201,"En Ruta","Dia 1","CARMEL","PROVINCIA",{"$f":"NETWORKDAYS.INTL(D233,M233,11,'Dias Feriados'!$A$1:$A$15)","v":-39255},"En Ruta",22,"NO",null,0.9375,0.94722222222222219,1,"CRUCES CHO","2025-05-28",null,null,45804,"",{"$f":"IF(AS233=\"Devuelto\",\"\",IF(X233=\"24hrs\",\"Entregado\",CONSOLIDADO!S233))","v":"En Ruta"},"",{"$f":"IF(AK233=\"Entregado\",\"\",IF(X233=\"24hrs\",\"\",IF(X233=\"48hrs\",\"Entregado\",CONSOLIDADO!S233)))","v":"En Ruta"},"",{"$f":"IF(AK233=\"Entregado\",\"\",IF(OR(X233=\"24hrs\",X233=\"48hrs\"),\"\",IF(X233=\"72hrs\",\"Entregado\",CONSOLIDADO!S233)))","v":"En Ruta"},"",{"$f":"IF(AK233=\"Entregado\",\"\",IF(OR(X233=\"24hrs\",X233=\"48hrs\",X233=\"72hrs\"),\"\",IF(X233=\"+72hrs\",\"Entregado\",CONSOLIDADO!S233)))","v":"En Ruta"},"","En Ruta",1,0,0,0,0,1,0,"No Entregado",0,0,1,0,{"$f":"IF(V233=\"Lima\",NETWORKDAYS.INTL(D233,M233,11,'Dias Feriados'!$A$1:$A$15),IF(AND(V233=\"provincia\",X233=\"24hrs\"),1,IF(AND(V233=\"provincia\",X233=\"48hrs\"),2,NETWORKDAYS.INTL(D233,M233,11,'Dias Feriados'!$A$1:$A$15))))","v":-39255}]
["B001667645","May","2025-05-27","2025-05-28","G/I. 030-10132",233,"GISELLA YANINA RAMOS QUISPE","NUEVA MACACONA MZ A LT 34 POR EL COLEGIO DE EDUCACION PRIMARIA CENTRO POBLADO CERRO PRIETO","Provincia","ICA","SALAS","B001667645",null,"En Ruta",9730017417,"F",202508,203201,"En Ruta","Dia 1","CARMEL","PROVINCIA",{"$f":"NETWORKDAYS.INTL(D234,M234,11,'Dias Feriados'!$A$1:$A$15)","v":-39255},"En Ruta",22,"NO",null,0.9375,0.94722222222222219,1,"CRUCES CHO","2025-05-28",null,null,45804,"",{"$f":"IF(AS234=\"Devuelto\",\"\",IF(X234=\"24hrs\",\"Entregado\",CONSOLIDADO!S234))","v":"En Ruta"},"",{"$f":"IF(AK234=\"Entregado\",\"\",IF(X234=\"24hrs\",\"\",IF(X234=\"48hrs\",\"Entregado\",CONSOLIDADO!S234)))","v":"En Ruta"},"",{"$f":"IF(AK234=\"Entregado\",\"\",IF(OR(X234=\"24hrs\",X234=\"48hrs\"),\"\",IF(X234=\"72hrs\",\"Entregado\",CONSOLIDADO!S234)))","v":"En Ruta"},"",{"$f":"IF(AK234=\"Entregado\",\"\",IF(OR(X234=\"24hrs\",X234=\"48hrs\",X234=\"72hrs\"),\"\",IF(X234=\"+72hrs\",\"Entregado\",CONSOLIDADO!S234)))","v":"En Ruta"},"","En Ruta",1,0,0,0,0,1,0,"No Entregado",0,0,1,0,{"$f":"IF(V234=\"Lima\",NETWORKDAYS.INTL(D234,M234,11,'Dias Feriados'!$A$1:$A$15),IF(AND(V234=\"provincia\",X234=\"24hrs\"),1,IF(AND(V234=\"provincia\",X234=\"48hrs\"),2,NETWORKDAYS.INTL(D234,M234,11,'Dias Feriados'!$A$1:$A$15))))","v":-39255}]
["B001668091","May","2025-05-27","2025-05-28","G/I. 030-10132",234,"MARIA ELENA RAMOS HUARCAYA","AV CATALINA BUENDIA DE PECHO 47 ICA ICA","Provincia","ICA","SAN JOSE DE LOS MOLINOS","B001668091","2025-05-28","Entregado",9730017221,"F",202508,203201,"Entregado","Dia 1","CARMEL","PROVINCIA",{"$f":"NETWORKDAYS.INTL(D235,M235,11,'Dias Feriados'!$A$1:$A$15)","v":1},"24hrs",22,"NO",null,0.9375,0.94722222222222219,1,"CRUCES CHO","2025-05-28",null,null,45804,45805,{"$f":"IF(AS235=\"Devuelto\",\"\",IF(X235=\"24hrs\",\"Entregado\",CONSOLIDADO!S235))","v":"Entregado"},"",{"$f":"IF(AK235=\"Entregado\",\"\",IF(X235=\"24hrs\",\"\",IF(X235=\"48hrs\",\"Entregado\",CONSOLIDADO!S235)))","v":""},"",{"$f":"IF(AK235=\"Entregado\",\"\",IF(OR(X235=\"24hrs\",X235=\"48hrs\"),\"\",IF(X235=\"72hrs\",\"Entregado\",CONSOLIDADO!S235)))","v":""},"",{"$f":"IF(AK235=\"Entregado\",\"\",IF(OR(X235=\"24hrs\",X235=\"48hrs\",X235=\"72hrs\"),\"\",IF(X235=\"+72hrs\",\"Entregado\",CONSOLIDADO!S235)))","v":""},45805,"Entregado",1,1,0,0,0,0,0,"A Tiempo",1,0,0,0,{"$f":"IF(V235=\"Lima\",NETWORKDAYS.INTL(D235,M235,11,'Dias Feriados'!$A$1:$A$15),IF(AND(V235=\"provincia\",X235=\"24hrs\"),1,IF(AND(V235=\"provincia\",X235=\"48hrs\"),2,NETWORKDAYS.INTL(D235,M235,11,'Dias Feriados'!$A$1:$A$15))))","v":1}]
["B001667771","May","2025-05-27","2025-05-28","G/I. 030-10132",235,"MARIA DELOSANGELES PERALTA DIA","AV CATALINA BUENDIA DE PECHO MZQ LT 8 POSTA SALUD MANZANA G13","Provincia","ICA","SAN JOSE DE LOS MOLINOS","B001667771",null,"En Ruta",9730017365,"F",202508,203201,"En Ruta","Dia 1","CARMEL","PROVINCIA",{"$f":"NETWORKDAYS.INTL(D236,M236,11,'Dias Feriados'!$A$1:$A$15)","v":-39255},"En Ruta",22,"NO",null,0.9375,0.94722222222222219,1,"CRUCES CHO","2025-05-28",null,null,45804,"",{"$f":"IF(AS236=\"Devuelto\",\"\",IF(X236=\"24hrs\",\"Entregado\",CONSOLIDADO!S236))","v":"En Ruta"},"",{"$f":"IF(AK236=\"Entregado\",\"\",IF(X236=\"24hrs\",\"\",IF(X236=\"48hrs\",\"Entregado\",CONSOLIDADO!S236)))","v":"En Ruta"},"",{"$f":"IF(AK236=\"Entregado\",\"\",IF(OR(X236=\"24hrs\",X236=\"48hrs\"),\"\",IF(X236=\"72hrs\",\"Entregado\",CONSOLIDADO!S236)))","v":"En Ruta"},"",{"$f":"IF(AK236=\"Entregado\",\"\",IF(OR(X236=\"24hrs\",X236=\"48hrs\",X236=\"72hrs\"),\"\",IF(X236=\"+72hrs\",\"Entregado\",CONSOLIDADO!S236)))","v":"En Ruta"},"","En Ruta",1,0,0,0,0,1,0,"No Entregado",0,0,1,0,{"$f":"IF(V236=\"Lima\",NETWORKDAYS.INTL(D236,M236,11,'Dias Feriados'!$A$1:$A$15),IF(AND(V236=\"provincia\",X236=\"24hrs\"),1,IF(AND(V236=\"provincia\",X236=\"48hrs\"),2,NETWORKDAYS.INTL(D236,M236,11,'Dias Feriados'!$A$1:$A$15))))","v":-39255}]
["B001667500","May","2025-05-27","2025-05-28","G/I. 030-10132",236,"MARIBEL ROSA CABRERA FRANCO","CL EL PROGRESO 358 MZ F LT 04 FRENTE AL COLEGIO EL OLIVO","Provincia","ICA","SAN JUAN BAUTISTA","B001667500",null,"En Ruta",9730017058,"F",202508,203201,"En Ruta","Dia 1","CARMEL","PROVINCIA",{"$f":"NETWORKDAYS.INTL(D237,M237,11,'Dias Feriados'!$A$1:$A$15)","v":-39255},"En Ruta",22,"NO",null,0.9375,0.94722222222222219,1,"CRUCES CHO","2025-05-28",null,null,45804,"",{"$f":"IF(AS237=\"Devuelto\",\"\",IF(X237=\"24hrs\",\"Entregado\",CONSOLIDADO!S237))","v":"En Ruta"},"",{"$f":"IF(AK237=\"Entregado\",\"\",IF(X237=\"24hrs\",\"\",IF(X237=\"48hrs\",\"Entregado\",CONSOLIDADO!S237)))","v":"En Ruta"},"",{"$f":"IF(AK237=\"Entregado\",\"\",IF(OR(X237=\"24hrs\",X237=\"48hrs\"),\"\",IF(X237=\"72hrs\",\"Entregado\",CONSOLIDADO!S237)))","v":"En Ruta"},"",{"$f":"IF(AK237=\"Entregado\",\"\",IF(OR(X237=\"24hrs\",X237=\"48hrs\",X237=\"72hrs\"),\"\",IF(X237=\"+72hrs\",\"Entregado\",CONSOLIDADO!S237)))","v":"En Ruta"},"","En Ruta",1,0,0,0,0,1,0,"No Entregado",0,0,1,0,{"$f":"IF(V237=\"Lima\",NETWORKDAYS.INTL(D237,M237,11,'Dias Feriados'!$A$1:$A$15),IF(AND(V237=\"provincia\",X237=\"24hrs\"),1,IF(AND(V237=\"provincia\",X237=\"48hrs\"),2,NETWORKDAYS.INTL(D237,M237,11,'Dias Feriados'!$A$1:$A$15))))","v":-39255}]
["B001667471","May","2025-05-27","2025-05-28","G/I. 030-10132",237,"YULISSA ELIZABETH CUEVA CABRER","CASERIO LA ALTURA SN 3 PUERTAS DELCENTRO DE SALUD EL CARMEN","Provincia","ICA","SAN JUAN BAUTISTA","B001667471",null,"En Ruta",9730017100,"F",202508,203201,"En Ruta","Dia 1","CARMEL","PROVINCIA",{"$f":"NETWORKDAYS.INTL(D238,M238,11,'Dias Feriados'!$A$1:$A$15)","v":-39255},"En Ruta",22,"NO",null,0.9375,0.94722222222222219,1,"CRUCES CHO","2025-05-28",null,null,45804,"",{"$f":"IF(AS238=\"Devuelto\",\"\",IF(X238=\"24hrs\",\"Entregado\",CONSOLIDADO!S238))","v":"En Ruta"},"",{"$f":"IF(AK238=\"Entregado\",\"\",IF(X238=\"24hrs\",\"\",IF(X238=\"48hrs\",\"Entregado\",CONSOLIDADO!S238)))","v":"En Ruta"},"",{"$f":"IF(AK238=\"Entregado\",\"\",IF(OR(X238=\"24hrs\",X238=\"48hrs\"),\"\",IF(X238=\"72hrs\",\"Entregado\",CONSOLIDADO!S238)))","v":"En Ruta"},"",{"$f":"IF(AK238=\"Entregado\",\"\",IF(OR(X238=\"24hrs\",X238=\"48hrs\",X238=\"72hrs\"),\"\",IF(X238=\"+72hrs\",\"Entregado\",CONSOLIDADO!S238)))","v":"En Ruta"},"","En Ruta",1,0,0,0,0,1,0,"No Entregado",0,0,1,0,{"$f":"IF(V238=\"Lima\",NETWORKDAYS.INTL(D238,M238,11,'Dias Feriados'!$A$1:$A$15),IF(AND(V238=\"provincia\",X238=\"24hrs\"),1,IF(AND(V238=\"provincia\",X238=\"48hrs\"),2,NETWORKDAYS.INTL(D238,M238,11,'Dias Feriados'!$A$1:$A$15))))","v":-39255}]
["B001667415","May","2025-05-27","2025-05-28","G/I. 030-10132",238,"JARUKO GABRIEL TATAJE SIGUAS","2 CALLE DND ESTA IGLESIA A MANO DERECHA CASERIO EL OLIVO CALLE BUENOS AIRES C7B","Provincia","ICA","SAN JUAN BAUTISTA","B001667415",null,"En Ruta",9730017218,"F",202508,203201,"En Ruta","Dia 1","CARMEL","PROVINCIA",{"$f":"NETWORKDAYS.INTL(D239,M239,11,'Dias Feriados'!$A$1:$A$15)","v":-39255},"En Ruta",22,"NO",null,0.9375,0.94722222222222219,1,"CRUCES CHO","2025-05-28",null,null,45804,"",{"$f":"IF(AS239=\"Devuelto\",\"\",IF(X239=\"24hrs\",\"Entregado\",CONSOLIDADO!S239))","v":"En Ruta"},"",{"$f":"IF(AK239=\"Entregado\",\"\",IF(X239=\"24hrs\",\"\",IF(X239=\"48hrs\",\"Entregado\",CONSOLIDADO!S239)))","v":"En Ruta"},"",{"$f":"IF(AK239=\"Entregado\",\"\",IF(OR(X239=\"24hrs\",X239=\"48hrs\"),\"\",IF(X239=\"72hrs\",\"Entregado\",CONSOLIDADO!S239)))","v":"En Ruta"},"",{"$f":"IF(AK239=\"Entregado\",\"\",IF(OR(X239=\"24hrs\",X239=\"48hrs\",X239=\"72hrs\"),\"\",IF(X239=\"+72hrs\",\"Entregado\",CONSOLIDADO!S239)))","v":"En Ruta"},"","En Ruta",1,0,0,0,0,1,0,"No Entregado",0,0,1,0,{"$f":"IF(V239=\"Lima\",NETWORKDAYS.INTL(D239,M239,11,'Dias Feriados'!$A$1:$A$15),IF(AND(V239=\"provincia\",X239=\"24hrs\"),1,IF(AND(V239=\"provincia\",X239=\"48hrs\"),2,NETWORKDAYS.INTL(D239,M239,11,'Dias Feriados'!$A$1:$A$15))))","v":-39255}]
["B001667336","May","2025-05-27","2025-05-28","G/I. 030-10132",239,"MARIA MARGOTH CASTRO HUAROTO","FRANCISCO BOLOGNESI MZ I LT 6 PASANDO LOS PATOS PORTON DE MADERA FONAVI SAN MARTIN","Provincia","ICA","SAN JUAN BAUTISTA","B001667336",null,"En Ruta",9730017252,"F",202508,203201,"En Ruta","Dia 1","CARMEL","PROVINCIA",{"$f":"NETWORKDAYS.INTL(D240,M240,11,'Dias Feriados'!$A$1:$A$15)","v":-39255},"En Ruta",22,"NO",null,0.9375,0.94722222222222219,1,"CRUCES CHO","2025-05-28",null,null,45804,"",{"$f":"IF(AS240=\"Devuelto\",\"\",IF(X240=\"24hrs\",\"Entregado\",CONSOLIDADO!S240))","v":"En Ruta"},"",{"$f":"IF(AK240=\"Entregado\",\"\",IF(X240=\"24hrs\",\"\",IF(X240=\"48hrs\",\"Entregado\",CONSOLIDADO!S240)))","v":"En Ruta"},"",{"$f":"IF(AK240=\"Entregado\",\"\",IF(OR(X240=\"24hrs\",X240=\"48hrs\"),\"\",IF(X240=\"72hrs\",\"Entregado\",CONSOLIDADO!S240)))","v":"En Ruta"},"",{"$f":"IF(AK240=\"Entregado\",\"\",IF(OR(X240=\"24hrs\",X240=\"48hrs\",X240=\"72hrs\"),\"\",IF(X240=\"+72hrs\",\"Entregado\",CONSOLIDADO!S240)))","v":"En Ruta"},"","En Ruta",1,0,0,0,0,1,0,"No Entregado",0,0,1,0,{"$f":"IF(V240=\"Lima\",NETWORKDAYS.INTL(D240,M240,11,'Dias Feriados'!$A$1:$A$15),IF(AND(V240=\"provincia\",X240=\"24hrs\"),1,IF(AND(V240=\"provincia\",X240=\"48hrs\"),2,NETWORKDAYS.INTL(D240,M240,11,'Dias Feriados'!$A$1:$A$15))))","v":-39255}]
["B001668102","May","2025-05-27","2025-05-28","G/I. 030-10132",240,"RAQUEL SOLEDAD SAYRITUPAC VILC","FONAVI SAN MARTIN MZ Z LT 1 FONAVI SAN MARTIN 4TA ETAPA","Provincia","ICA","SAN JUAN BAUTISTA","B001668102",null,"En Ruta",9730017523,"F",202508,203201,"En Ruta","Dia 1","CARMEL","PROVINCIA",{"$f":"NETWORKDAYS.INTL(D241,M241,11,'Dias Feriados'!$A$1:$A$15)","v":-39255},"En Ruta",22,"NO",null,0.9375,0.94722222222222219,1,"CRUCES CHO","2025-05-28",null,null,45804,"",{"$f":"IF(AS241=\"Devuelto\",\"\",IF(X241=\"24hrs\",\"Entregado\",CONSOLIDADO!S241))","v":"En Ruta"},"",{"$f":"IF(AK241=\"Entregado\",\"\",IF(X241=\"24hrs\",\"\",IF(X241=\"48hrs\",\"Entregado\",CONSOLIDADO!S241)))","v":"En Ruta"},"",{"$f":"IF(AK241=\"Entregado\",\"\",IF(OR(X241=\"24hrs\",X241=\"48hrs\"),\"\",IF(X241=\"72hrs\",\"Entregado\",CONSOLIDADO!S241)))","v":"En Ruta"},"",{"$f":"IF(AK241=\"Entregado\",\"\",IF(OR(X241=\"24hrs\",X241=\"48hrs\",X241=\"72hrs\"),\"\",IF(X241=\"+72hrs\",\"Entregado\",CONSOLIDADO!S241)))","v":"En Ruta"},"","En Ruta",1,0,0,0,0,1,0,"No Entregado",0,0,1,0,{"$f":"IF(V241=\"Lima\",NETWORKDAYS.INTL(D241,M241,11,'Dias Feriados'!$A$1:$A$15),IF(AND(V241=\"provincia\",X241=\"24hrs\"),1,IF(AND(V241=\"provincia\",X241=\"48hrs\"),2,NETWORKDAYS.INTL(D241,M241,11,'Dias Feriados'!$A$1:$A$15))))","v":-39255}]
["B001668096","May","2025-05-27","2025-05-28","G/I. 030-10132",241,"STEPHANNY PIERINA HERRERA SANC","CALLE SANTA MARIA S11B PASANDO LA MUNICIPAL ANTES DEL TERCER SEMAFORO UBICADA EN LA CRUZ VERDE","Provincia","ICA","SANTIAGO","B001668096",null,"En Ruta",9730017022,"F",202508,203201,"En Ruta","Dia 1","CARMEL","PROVINCIA",{"$f":"NETWORKDAYS.INTL(D242,M242,11,'Dias Feriados'!$A$1:$A$15)","v":-39255},"En Ruta",22,"NO",null,0.9375,0.94722222222222219,1,"CRUCES CHO","2025-05-28",null,null,45804,"",{"$f":"IF(AS242=\"Devuelto\",\"\",IF(X242=\"24hrs\",\"Entregado\",CONSOLIDADO!S242))","v":"En Ruta"},"",{"$f":"IF(AK242=\"Entregado\",\"\",IF(X242=\"24hrs\",\"\",IF(X242=\"48hrs\",\"Entregado\",CONSOLIDADO!S242)))","v":"En Ruta"},"",{"$f":"IF(AK242=\"Entregado\",\"\",IF(OR(X242=\"24hrs\",X242=\"48hrs\"),\"\",IF(X242=\"72hrs\",\"Entregado\",CONSOLIDADO!S242)))","v":"En Ruta"},"",{"$f":"IF(AK242=\"Entregado\",\"\",IF(OR(X242=\"24hrs\",X242=\"48hrs\",X242=\"72hrs\"),\"\",IF(X242=\"+72hrs\",\"Entregado\",CONSOLIDADO!S242)))","v":"En Ruta"},"","En Ruta",1,0,0,0,0,1,0,"No Entregado",0,0,1,0,{"$f":"IF(V242=\"Lima\",NETWORKDAYS.INTL(D242,M242,11,'Dias Feriados'!$A$1:$A$15),IF(AND(V242=\"provincia\",X242=\"24hrs\"),1,IF(AND(V242=\"provincia\",X242=\"48hrs\"),2,NETWORKDAYS.INTL(D242,M242,11,'Dias Feriados'!$A$1:$A$15))))","v":-39255}]
["B001667746","May","2025-05-27","2025-05-28","G/I. 030-10132",242,"JUANA STEFANY VALENCIA FERNAND","SEC CENTRO SN 1RA ENTRADA DE LA PLAZA DE SANTIAGO","Provincia","ICA","SANTIAGO","B001667746",null,"En Ruta",9730017042,"F",202508,203201,"En Ruta","Dia 1","CARMEL","PROVINCIA",{"$f":"NETWORKDAYS.INTL(D243,M243,11,'Dias Feriados'!$A$1:$A$15)","v":-39255},"En Ruta",22,"NO",null,0.9375,0.94722222222222219,1,"CRUCES CHO","2025-05-28",null,null,45804,"",{"$f":"IF(AS243=\"Devuelto\",\"\",IF(X243=\"24hrs\",\"Entregado\",CONSOLIDADO!S243))","v":"En Ruta"},"",{"$f":"IF(AK243=\"Entregado\",\"\",IF(X243=\"24hrs\",\"\",IF(X243=\"48hrs\",\"Entregado\",CONSOLIDADO!S243)))","v":"En Ruta"},"",{"$f":"IF(AK243=\"Entregado\",\"\",IF(OR(X243=\"24hrs\",X243=\"48hrs\"),\"\",IF(X243=\"72hrs\",\"Entregado\",CONSOLIDADO!S243)))","v":"En Ruta"},"",{"$f":"IF(AK243=\"Entregado\",\"\",IF(OR(X243=\"24hrs\",X243=\"48hrs\",X243=\"72hrs\"),\"\",IF(X243=\"+72hrs\",\"Entregado\",CONSOLIDADO!S243)))","v":"En Ruta"},"","En Ruta",1,0,0,0,0,1,0,"No Entregado",0,0,1,0,{"$f":"IF(V243=\"Lima\",NETWORKDAYS.INTL(D243,M243,11,'Dias Feriados'!$A$1:$A$15),IF(AND(V243=\"provincia\",X243=\"24hrs\"),1,IF(AND(V243=\"provincia\",X243=\"48hrs\"),2,NETWORKDAYS.INTL(D243,M243,11,'Dias Feriados'!$A$1:$A$15))))","v":-39255}]
["B001667634","May","2025-05-27","2025-05-28","G/I. 030-10132",243,"LETICIA ROSA HUACHIN CORONADO","CALLE LOS JAYOS MZ K LT 23 FRENTE A COLEGIO SAN MARTIN SECTOR CASABLANCA","Provincia","ICA","SANTIAGO","B001667634",null,"En Ruta",9730017133,"F",202508,203201,"En Ruta","Dia 1","CARMEL","PROVINCIA",{"$f":"NETWORKDAYS.INTL(D244,M244,11,'Dias Feriados'!$A$1:$A$15)","v":-39255},"En Ruta",22,"NO",null,0.9375,0.94722222222222219,1,"CRUCES CHO","2025-05-28",null,null,45804,"",{"$f":"IF(AS244=\"Devuelto\",\"\",IF(X244=\"24hrs\",\"Entregado\",CONSOLIDADO!S244))","v":"En Ruta"},"",{"$f":"IF(AK244=\"Entregado\",\"\",IF(X244=\"24hrs\",\"\",IF(X244=\"48hrs\",\"Entregado\",CONSOLIDADO!S244)))","v":"En Ruta"},"",{"$f":"IF(AK244=\"Entregado\",\"\",IF(OR(X244=\"24hrs\",X244=\"48hrs\"),\"\",IF(X244=\"72hrs\",\"Entregado\",CONSOLIDADO!S244)))","v":"En Ruta"},"",{"$f":"IF(AK244=\"Entregado\",\"\",IF(OR(X244=\"24hrs\",X244=\"48hrs\",X244=\"72hrs\"),\"\",IF(X244=\"+72hrs\",\"Entregado\",CONSOLIDADO!S244)))","v":"En Ruta"},"","En Ruta",1,0,0,0,0,1,0,"No Entregado",0,0,1,0,{"$f":"IF(V244=\"Lima\",NETWORKDAYS.INTL(D244,M244,11,'Dias Feriados'!$A$1:$A$15),IF(AND(V244=\"provincia\",X244=\"24hrs\"),1,IF(AND(V244=\"provincia\",X244=\"48hrs\"),2,NETWORKDAYS.INTL(D244,M244,11,'Dias Feriados'!$A$1:$A$15))))","v":-39255}]
["B001667597","May","2025-05-27","2025-05-28","G/I. 030-10132",244,"YHOSELIN MARICIELO CORDERO HER","CENTRO POBLADO LOS MAYURIES MZ C LT 20A CERCA POLIDEPORTIVO EUGENIO","Provincia","ICA","SANTIAGO","B001667597",null,"En Ruta",9730017230,"F",202508,203201,"En Ruta","Dia 1","CARMEL","PROVINCIA",{"$f":"NETWORKDAYS.INTL(D245,M245,11,'Dias Feriados'!$A$1:$A$15)","v":-39255},"En Ruta",22,"NO",null,0.9375,0.94722222222222219,1,"CRUCES CHO","2025-05-28",null,null,45804,"",{"$f":"IF(AS245=\"Devuelto\",\"\",IF(X245=\"24hrs\",\"Entregado\",CONSOLIDADO!S245))","v":"En Ruta"},"",{"$f":"IF(AK245=\"Entregado\",\"\",IF(X245=\"24hrs\",\"\",IF(X245=\"48hrs\",\"Entregado\",CONSOLIDADO!S245)))","v":"En Ruta"},"",{"$f":"IF(AK245=\"Entregado\",\"\",IF(OR(X245=\"24hrs\",X245=\"48hrs\"),\"\",IF(X245=\"72hrs\",\"Entregado\",CONSOLIDADO!S245)))","v":"En Ruta"},"",{"$f":"IF(AK245=\"Entregado\",\"\",IF(OR(X245=\"24hrs\",X245=\"48hrs\",X245=\"72hrs\"),\"\",IF(X245=\"+72hrs\",\"Entregado\",CONSOLIDADO!S245)))","v":"En Ruta"},"","En Ruta",1,0,0,0,0,1,0,"No Entregado",0,0,1,0,{"$f":"IF(V245=\"Lima\",NETWORKDAYS.INTL(D245,M245,11,'Dias Feriados'!$A$1:$A$15),IF(AND(V245=\"provincia\",X245=\"24hrs\"),1,IF(AND(V245=\"provincia\",X245=\"48hrs\"),2,NETWORKDAYS.INTL(D245,M245,11,'Dias Feriados'!$A$1:$A$15))))","v":-39255}]
["B001667422","May","2025-05-27","2025-05-28","G/I. 030-10132",245,"VIVIANA ROSA DEL CARMEN PENA","URB ECHEGARAY 2 ESPALDA DEL ESTADIO ENTRADA COYOTES SN SANTIAGO","Provincia","ICA","SANTIAGO","B001667422",null,"En Ruta",9730017235,"F",202508,203201,"En Ruta","Dia 1","CARMEL","PROVINCIA",{"$f":"NETWORKDAYS.INTL(D246,M246,11,'Dias Feriados'!$A$1:$A$15)","v":-39255},"En Ruta",22,"NO",null,0.9375,0.94722222222222219,1,"CRUCES CHO","2025-05-28",null,null,45804,"",{"$f":"IF(AS246=\"Devuelto\",\"\",IF(X246=\"24hrs\",\"Entregado\",CONSOLIDADO!S246))","v":"En Ruta"},"",{"$f":"IF(AK246=\"Entregado\",\"\",IF(X246=\"24hrs\",\"\",IF(X246=\"48hrs\",\"Entregado\",CONSOLIDADO!S246)))","v":"En Ruta"},"",{"$f":"IF(AK246=\"Entregado\",\"\",IF(OR(X246=\"24hrs\",X246=\"48hrs\"),\"\",IF(X246=\"72hrs\",\"Entregado\",CONSOLIDADO!S246)))","v":"En Ruta"},"",{"$f":"IF(AK246=\"Entregado\",\"\",IF(OR(X246=\"24hrs\",X246=\"48hrs\",X246=\"72hrs\"),\"\",IF(X246=\"+72hrs\",\"Entregado\",CONSOLIDADO!S246)))","v":"En Ruta"},"","En Ruta",1,0,0,0,0,1,0,"No Entregado",0,0,1,0,{"$f":"IF(V246=\"Lima\",NETWORKDAYS.INTL(D246,M246,11,'Dias Feriados'!$A$1:$A$15),IF(AND(V246=\"provincia\",X246=\"24hrs\"),1,IF(AND(V246=\"provincia\",X246=\"48hrs\"),2,NETWORKDAYS.INTL(D246,M246,11,'Dias Feriados'!$A$1:$A$15))))","v":-39255}]
["B001667395","May","2025-05-27","2025-05-28","G/I. 030-10132",246,"PAULA SABINA TASAICO DE CANEDO","RANCHERIA STA MARGARITA C112 FRENTE A MINIMARKET MAX","Provincia","ICA","SANTIAGO","B001667395",null,"En Ruta",9730017243,"F",202508,203201,"En Ruta","Dia 1","CARMEL","PROVINCIA",{"$f":"NETWORKDAYS.INTL(D247,M247,11,'Dias Feriados'!$A$1:$A$15)","v":-39255},"En Ruta",22,"NO",null,0.9375,0.94722222222222219,1,"CRUCES CHO","2025-05-28",null,null,45804,"",{"$f":"IF(AS247=\"Devuelto\",\"\",IF(X247=\"24hrs\",\"Entregado\",CONSOLIDADO!S247))","v":"En Ruta"},"",{"$f":"IF(AK247=\"Entregado\",\"\",IF(X247=\"24hrs\",\"\",IF(X247=\"48hrs\",\"Entregado\",CONSOLIDADO!S247)))","v":"En Ruta"},"",{"$f":"IF(AK247=\"Entregado\",\"\",IF(OR(X247=\"24hrs\",X247=\"48hrs\"),\"\",IF(X247=\"72hrs\",\"Entregado\",CONSOLIDADO!S247)))","v":"En Ruta"},"",{"$f":"IF(AK247=\"Entregado\",\"\",IF(OR(X247=\"24hrs\",X247=\"48hrs\",X247=\"72hrs\"),\"\",IF(X247=\"+72hrs\",\"Entregado\",CONSOLIDADO!S247)))","v":"En Ruta"},"","En Ruta",1,0,0,0,0,1,0,"No Entregado",0,0,1,0,{"$f":"IF(V247=\"Lima\",NETWORKDAYS.INTL(D247,M247,11,'Dias Feriados'!$A$1:$A$15),IF(AND(V247=\"provincia\",X247=\"24hrs\"),1,IF(AND(V247=\"provincia\",X247=\"48hrs\"),2,NETWORKDAYS.INTL(D247,M247,11,'Dias Feriados'!$A$1:$A$15))))","v":-39255}]
["B001667675","May","2025-05-27","2025-05-28","G/I. 030-10132",247,"YANINA MARGARITA RAMOS UCHUYA","LA VENTA BAJA MZ C LT 43 PASANDO LA CAPILLA","Provincia","ICA","SANTIAGO","B001667675",null,"En Ruta",9730017282,"F",202508,203201,"En Ruta","Dia 1","CARMEL","PROVINCIA",{"$f":"NETWORKDAYS.INTL(D248,M248,11,'Dias Feriados'!$A$1:$A$15)","v":-39255},"En Ruta",22,"NO",null,0.9375,0.94722222222222219,1,"CRUCES CHO","2025-05-28",null,null,45804,"",{"$f":"IF(AS248=\"Devuelto\",\"\",IF(X248=\"24hrs\",\"Entregado\",CONSOLIDADO!S248))","v":"En Ruta"},"",{"$f":"IF(AK248=\"Entregado\",\"\",IF(X248=\"24hrs\",\"\",IF(X248=\"48hrs\",\"Entregado\",CONSOLIDADO!S248)))","v":"En Ruta"},"",{"$f":"IF(AK248=\"Entregado\",\"\",IF(OR(X248=\"24hrs\",X248=\"48hrs\"),\"\",IF(X248=\"72hrs\",\"Entregado\",CONSOLIDADO!S248)))","v":"En Ruta"},"",{"$f":"IF(AK248=\"Entregado\",\"\",IF(OR(X248=\"24hrs\",X248=\"48hrs\",X248=\"72hrs\"),\"\",IF(X248=\"+72hrs\",\"Entregado\",CONSOLIDADO!S248)))","v":"En Ruta"},"","En Ruta",1,0,0,0,0,1,0,"No Entregado",0,0,1,0,{"$f":"IF(V248=\"Lima\",NETWORKDAYS.INTL(D248,M248,11,'Dias Feriados'!$A$1:$A$15),IF(AND(V248=\"provincia\",X248=\"24hrs\"),1,IF(AND(V248=\"provincia\",X248=\"48hrs\"),2,NETWORKDAYS.INTL(D248,M248,11,'Dias Feriados'!$A$1:$A$15))))","v":-39255}]
["B001667662","May","2025-05-27","2025-05-28","G/I. 030-10132",248,"VIELKA KATIUSKA VELASQUEZ DIAZ","RESIDENCIAL EL HUERTO MZ H LT 6 COSTADO CONSORCIO SOLIS RESIDENCIAL EL HUERTO SANTIAGO","Provincia","ICA","SANTIAGO","B001667662",null,"En Ruta",9730017386,"F",202508,203201,"En Ruta","Dia 1","CARMEL","PROVINCIA",{"$f":"NETWORKDAYS.INTL(D249,M249,11,'Dias Feriados'!$A$1:$A$15)","v":-39255},"En Ruta",22,"NO",null,0.9375,0.94722222222222219,1,"CRUCES CHO","2025-05-28",null,null,45804,"",{"$f":"IF(AS249=\"Devuelto\",\"\",IF(X249=\"24hrs\",\"Entregado\",CONSOLIDADO!S249))","v":"En Ruta"},"",{"$f":"IF(AK249=\"Entregado\",\"\",IF(X249=\"24hrs\",\"\",IF(X249=\"48hrs\",\"Entregado\",CONSOLIDADO!S249)))","v":"En Ruta"},"",{"$f":"IF(AK249=\"Entregado\",\"\",IF(OR(X249=\"24hrs\",X249=\"48hrs\"),\"\",IF(X249=\"72hrs\",\"Entregado\",CONSOLIDADO!S249)))","v":"En Ruta"},"",{"$f":"IF(AK249=\"Entregado\",\"\",IF(OR(X249=\"24hrs\",X249=\"48hrs\",X249=\"72hrs\"),\"\",IF(X249=\"+72hrs\",\"Entregado\",CONSOLIDADO!S249)))","v":"En Ruta"},"","En Ruta",1,0,0,0,0,1,0,"No Entregado",0,0,1,0,{"$f":"IF(V249=\"Lima\",NETWORKDAYS.INTL(D249,M249,11,'Dias Feriados'!$A$1:$A$15),IF(AND(V249=\"provincia\",X249=\"24hrs\"),1,IF(AND(V249=\"provincia\",X249=\"48hrs\"),2,NETWORKDAYS.INTL(D249,M249,11,'Dias Feriados'!$A$1:$A$15))))","v":-39255}]
["B001667344","May","2025-05-27","2025-05-28","G/I. 030-10132",249,"ELADIA PAUCAR APARICIO","LA VENTA BAJA MZ C LT 43 ENTRANDO CALLEJON EN LA PANAMERICA LA VENTA BAJA","Provincia","ICA","SANTIAGO","B001667344",null,"En Ruta",9730017398,"F",202508,203201,"En Ruta","Dia 1","CARMEL","PROVINCIA",{"$f":"NETWORKDAYS.INTL(D250,M250,11,'Dias Feriados'!$A$1:$A$15)","v":-39255},"En Ruta",22,"NO",null,0.9375,0.94722222222222219,1,"CRUCES CHO","2025-05-28",null,null,45804,"",{"$f":"IF(AS250=\"Devuelto\",\"\",IF(X250=\"24hrs\",\"Entregado\",CONSOLIDADO!S250))","v":"En Ruta"},"",{"$f":"IF(AK250=\"Entregado\",\"\",IF(X250=\"24hrs\",\"\",IF(X250=\"48hrs\",\"Entregado\",CONSOLIDADO!S250)))","v":"En Ruta"},"",{"$f":"IF(AK250=\"Entregado\",\"\",IF(OR(X250=\"24hrs\",X250=\"48hrs\"),\"\",IF(X250=\"72hrs\",\"Entregado\",CONSOLIDADO!S250)))","v":"En Ruta"},"",{"$f":"IF(AK250=\"Entregado\",\"\",IF(OR(X250=\"24hrs\",X250=\"48hrs\",X250=\"72hrs\"),\"\",IF(X250=\"+72hrs\",\"Entregado\",CONSOLIDADO!S250)))","v":"En Ruta"},"","En Ruta",1,0,0,0,0,1,0,"No Entregado",0,0,1,0,{"$f":"IF(V250=\"Lima\",NETWORKDAYS.INTL(D250,M250,11,'Dias Feriados'!$A$1:$A$15),IF(AND(V250=\"provincia\",X250=\"24hrs\"),1,IF(AND(V250=\"provincia\",X250=\"48hrs\"),2,NETWORKDAYS.INTL(D250,M250,11,'Dias Feriados'!$A$1:$A$15))))","v":-39255}]
["B001667749","May","2025-05-27","2025-05-28","G/I. 030-10132",250,"DIANA ELIZABETH MUNANTE AQUIJE","BARRIO LOS ASENCIOS MZ D LT A1 ESPALDA DE LA COMISARIA DE SANTIAGO PANAMERICANA SUR KM 317","Provincia","ICA","SANTIAGO","B001667749",null,"En Ruta",9730017442,"F",202508,203201,"En Ruta","Dia 1","CARMEL","PROVINCIA",{"$f":"NETWORKDAYS.INTL(D251,M251,11,'Dias Feriados'!$A$1:$A$15)","v":-39255},"En Ruta",22,"NO",null,0.9375,0.94722222222222219,1,"CRUCES CHO","2025-05-28",null,null,45804,"",{"$f":"IF(AS251=\"Devuelto\",\"\",IF(X251=\"24hrs\",\"Entregado\",CONSOLIDADO!S251))","v":"En Ruta"},"",{"$f":"IF(AK251=\"Entregado\",\"\",IF(X251=\"24hrs\",\"\",IF(X251=\"48hrs\",\"Entregado\",CONSOLIDADO!S251)))","v":"En Ruta"},"",{"$f":"IF(AK251=\"Entregado\",\"\",IF(OR(X251=\"24hrs\",X251=\"48hrs\"),\"\",IF(X251=\"72hrs\",\"Entregado\",CONSOLIDADO!S251)))","v":"En Ruta"},"",{"$f":"IF(AK251=\"Entregado\",\"\",IF(OR(X251=\"24hrs\",X251=\"48hrs\",X251=\"72hrs\"),\"\",IF(X251=\"+72hrs\",\"Entregado\",CONSOLIDADO!S251)))","v":"En Ruta"},"","En Ruta",1,0,0,0,0,1,0,"No Entregado",0,0,1,0,{"$f":"IF(V251=\"Lima\",NETWORKDAYS.INTL(D251,M251,11,'Dias Feriados'!$A$1:$A$15),IF(AND(V251=\"provincia\",X251=\"24hrs\"),1,IF(AND(V251=\"provincia\",X251=\"48hrs\"),2,NETWORKDAYS.INTL(D251,M251,11,'Dias Feriados'!$A$1:$A$15))))","v":-39255}]
["B001667673","May","2025-05-27","2025-05-28","G/I. 030-10132",251,"JAQUELINA ESTEFANY CHAVEZ AURE","FONAVI SAN MARTIN X12 SEGUNDA ETAPA DEL SEMAFORO A LA IZQUIERDA FONAVI SAN MARTIN","Provincia","ICA","SUBTANJALLA","B001667673",null,"En Ruta",9730017032,"F",202508,203201,"En Ruta","Dia 1","CARMEL","PROVINCIA",{"$f":"NETWORKDAYS.INTL(D252,M252,11,'Dias Feriados'!$A$1:$A$15)","v":-39255},"En Ruta",22,"NO",null,0.9375,0.94722222222222219,1,"CRUCES CHO","2025-05-28",null,null,45804,"",{"$f":"IF(AS252=\"Devuelto\",\"\",IF(X252=\"24hrs\",\"Entregado\",CONSOLIDADO!S252))","v":"En Ruta"},"",{"$f":"IF(AK252=\"Entregado\",\"\",IF(X252=\"24hrs\",\"\",IF(X252=\"48hrs\",\"Entregado\",CONSOLIDADO!S252)))","v":"En Ruta"},"",{"$f":"IF(AK252=\"Entregado\",\"\",IF(OR(X252=\"24hrs\",X252=\"48hrs\"),\"\",IF(X252=\"72hrs\",\"Entregado\",CONSOLIDADO!S252)))","v":"En Ruta"},"",{"$f":"IF(AK252=\"Entregado\",\"\",IF(OR(X252=\"24hrs\",X252=\"48hrs\",X252=\"72hrs\"),\"\",IF(X252=\"+72hrs\",\"Entregado\",CONSOLIDADO!S252)))","v":"En Ruta"},"","En Ruta",1,0,0,0,0,1,0,"No Entregado",0,0,1,0,{"$f":"IF(V252=\"Lima\",NETWORKDAYS.INTL(D252,M252,11,'Dias Feriados'!$A$1:$A$15),IF(AND(V252=\"provincia\",X252=\"24hrs\"),1,IF(AND(V252=\"provincia\",X252=\"48hrs\"),2,NETWORKDAYS.INTL(D252,M252,11,'Dias Feriados'!$A$1:$A$15))))","v":-39255}]
["B001667603","May","2025-05-27","2025-05-28","G/I. 030-10132",252,"GRACE ANTONELLA AVILA CHUNGA","LOS HUERTOS DE SAN ANTONIO MZ 29 LT ALT COLG SAN ANTONIO","Provincia","ICA","SUBTANJALLA","B001667603",null,"En Ruta",9730017051,"F",202508,203201,"En Ruta","Dia 1","CARMEL","PROVINCIA",{"$f":"NETWORKDAYS.INTL(D253,M253,11,'Dias Feriados'!$A$1:$A$15)","v":-39255},"En Ruta",22,"NO",null,0.9375,0.94722222222222219,1,"CRUCES CHO","2025-05-28",null,null,45804,"",{"$f":"IF(AS253=\"Devuelto\",\"\",IF(X253=\"24hrs\",\"Entregado\",CONSOLIDADO!S253))","v":"En Ruta"},"",{"$f":"IF(AK253=\"Entregado\",\"\",IF(X253=\"24hrs\",\"\",IF(X253=\"48hrs\",\"Entregado\",CONSOLIDADO!S253)))","v":"En Ruta"},"",{"$f":"IF(AK253=\"Entregado\",\"\",IF(OR(X253=\"24hrs\",X253=\"48hrs\"),\"\",IF(X253=\"72hrs\",\"Entregado\",CONSOLIDADO!S253)))","v":"En Ruta"},"",{"$f":"IF(AK253=\"Entregado\",\"\",IF(OR(X253=\"24hrs\",X253=\"48hrs\",X253=\"72hrs\"),\"\",IF(X253=\"+72hrs\",\"Entregado\",CONSOLIDADO!S253)))","v":"En Ruta"},"","En Ruta",1,0,0,0,0,1,0,"No Entregado",0,0,1,0,{"$f":"IF(V253=\"Lima\",NETWORKDAYS.INTL(D253,M253,11,'Dias Feriados'!$A$1:$A$15),IF(AND(V253=\"provincia\",X253=\"24hrs\"),1,IF(AND(V253=\"provincia\",X253=\"48hrs\"),2,NETWORKDAYS.INTL(D253,M253,11,'Dias Feriados'!$A$1:$A$15))))","v":-39255}]
["B001667583","May","2025-05-27","2025-05-28","G/I. 030-10132",253,"VANIA QUEVEDO RIVAS","UR LAS LUNAS LA FLORIDA MZ A 26 CERCA RESTAURANTE DON MANUEL","Provincia","ICA","SUBTANJALLA","B001667583",null,"En Ruta",9730017056,"F",202508,203201,"En Ruta","Dia 1","CARMEL","PROVINCIA",{"$f":"NETWORKDAYS.INTL(D254,M254,11,'Dias Feriados'!$A$1:$A$15)","v":-39255},"En Ruta",22,"NO",null,0.9375,0.94722222222222219,1,"CRUCES CHO","2025-05-28",null,null,45804,"",{"$f":"IF(AS254=\"Devuelto\",\"\",IF(X254=\"24hrs\",\"Entregado\",CONSOLIDADO!S254))","v":"En Ruta"},"",{"$f":"IF(AK254=\"Entregado\",\"\",IF(X254=\"24hrs\",\"\",IF(X254=\"48hrs\",\"Entregado\",CONSOLIDADO!S254)))","v":"En Ruta"},"",{"$f":"IF(AK254=\"Entregado\",\"\",IF(OR(X254=\"24hrs\",X254=\"48hrs\"),\"\",IF(X254=\"72hrs\",\"Entregado\",CONSOLIDADO!S254)))","v":"En Ruta"},"",{"$f":"IF(AK254=\"Entregado\",\"\",IF(OR(X254=\"24hrs\",X254=\"48hrs\",X254=\"72hrs\"),\"\",IF(X254=\"+72hrs\",\"Entregado\",CONSOLIDADO!S254)))","v":"En Ruta"},"","En Ruta",1,0,0,0,0,1,0,"No Entregado",0,0,1,0,{"$f":"IF(V254=\"Lima\",NETWORKDAYS.INTL(D254,M254,11,'Dias Feriados'!$A$1:$A$15),IF(AND(V254=\"provincia\",X254=\"24hrs\"),1,IF(AND(V254=\"provincia\",X254=\"48hrs\"),2,NETWORKDAYS.INTL(D254,M254,11,'Dias Feriados'!$A$1:$A$15))))","v":-39255}]
["B001667742","May","2025-05-27","2025-05-28","G/I. 030-10132",254,"OLYN KLATETZKI ORMENO VARGAS","VIRGEN DE CHAPI MZ G LT 4 DEL TREN ROJO ALA DERECHA","Provincia","ICA","SUBTANJALLA","B001667742",null,"En Ruta",9730017145,"F",202508,203201,"En Ruta","Dia 1","CARMEL","PROVINCIA",{"$f":"NETWORKDAYS.INTL(D255,M255,11,'Dias Feriados'!$A$1:$A$15)","v":-39255},"En Ruta",22,"NO",null,0.9375,0.94722222222222219,1,"CRUCES CHO","2025-05-28",null,null,45804,"",{"$f":"IF(AS255=\"Devuelto\",\"\",IF(X255=\"24hrs\",\"Entregado\",CONSOLIDADO!S255))","v":"En Ruta"},"",{"$f":"IF(AK255=\"Entregado\",\"\",IF(X255=\"24hrs\",\"\",IF(X255=\"48hrs\",\"Entregado\",CONSOLIDADO!S255)))","v":"En Ruta"},"",{"$f":"IF(AK255=\"Entregado\",\"\",IF(OR(X255=\"24hrs\",X255=\"48hrs\"),\"\",IF(X255=\"72hrs\",\"Entregado\",CONSOLIDADO!S255)))","v":"En Ruta"},"",{"$f":"IF(AK255=\"Entregado\",\"\",IF(OR(X255=\"24hrs\",X255=\"48hrs\",X255=\"72hrs\"),\"\",IF(X255=\"+72hrs\",\"Entregado\",CONSOLIDADO!S255)))","v":"En Ruta"},"","En Ruta",1,0,0,0,0,1,0,"No Entregado",0,0,1,0,{"$f":"IF(V255=\"Lima\",NETWORKDAYS.INTL(D255,M255,11,'Dias Feriados'!$A$1:$A$15),IF(AND(V255=\"provincia\",X255=\"24hrs\"),1,IF(AND(V255=\"provincia\",X255=\"48hrs\"),2,NETWORKDAYS.INTL(D255,M255,11,'Dias Feriados'!$A$1:$A$15))))","v":-39255}]
["B001668167","May","2025-05-27","2025-05-28","G/I. 030-10132",255,"CARMEN MAGDALENA INJANTE ORE","ASOCIACION PRO VIVINEDA TEMISTOCLES ROCHA MZ D LT 6A FRENTE ALA PLAZUELA LINK ASOCIACION PRO VIVINEDA","Provincia","ICA","SUBTANJALLA","B001668167",null,"En Ruta",9730017155,"F",202508,203201,"En Ruta","Dia 1","CARMEL","PROVINCIA",{"$f":"NETWORKDAYS.INTL(D256,M256,11,'Dias Feriados'!$A$1:$A$15)","v":-39255},"En Ruta",22,"NO",null,0.9375,0.94722222222222219,1,"CRUCES CHO","2025-05-28",null,null,45804,"",{"$f":"IF(AS256=\"Devuelto\",\"\",IF(X256=\"24hrs\",\"Entregado\",CONSOLIDADO!S256))","v":"En Ruta"},"",{"$f":"IF(AK256=\"Entregado\",\"\",IF(X256=\"24hrs\",\"\",IF(X256=\"48hrs\",\"Entregado\",CONSOLIDADO!S256)))","v":"En Ruta"},"",{"$f":"IF(AK256=\"Entregado\",\"\",IF(OR(X256=\"24hrs\",X256=\"48hrs\"),\"\",IF(X256=\"72hrs\",\"Entregado\",CONSOLIDADO!S256)))","v":"En Ruta"},"",{"$f":"IF(AK256=\"Entregado\",\"\",IF(OR(X256=\"24hrs\",X256=\"48hrs\",X256=\"72hrs\"),\"\",IF(X256=\"+72hrs\",\"Entregado\",CONSOLIDADO!S256)))","v":"En Ruta"},"","En Ruta",1,0,0,0,0,1,0,"No Entregado",0,0,1,0,{"$f":"IF(V256=\"Lima\",NETWORKDAYS.INTL(D256,M256,11,'Dias Feriados'!$A$1:$A$15),IF(AND(V256=\"provincia\",X256=\"24hrs\"),1,IF(AND(V256=\"provincia\",X256=\"48hrs\"),2,NETWORKDAYS.INTL(D256,M256,11,'Dias Feriados'!$A$1:$A$15))))","v":-39255}]
["B001667578",{"$f":"TEXT(C257,\"mmm\")","v":"May"},"2025-05-27","2025-05-28","G/I. 030-10132",256,"MONICA MAGDALENA MARCIAL MOQUI","TACNA MZ J2 T8E PASANDO LA POSTA 3 CUADRA","Provincia","ICA","SUBTANJALLA","B001667578",null,"En Ruta",9730017241,"F",202508,203201,"En Ruta","Dia 1","CARMEL","PROVINCIA",{"$f":"NETWORKDAYS.INTL(D257,M257,11,'Dias Feriados'!$A$1:$A$15)","v":-39255},"En Ruta",22,"NO",null,0.9375,0.94722222222222219,1,"CRUCES CHO",{"$f":"DATEVALUE(D257)","v":"2025-05-28"},null,null,{"$f":"C257","v":45804},{"$f":"IF(AK257=\"Entregado\",M257,\"\")","v":""},{"$f":"IF(AS257=\"Devuelto\",\"\",IF(X257=\"24hrs\",\"Entregado\",CONSOLIDADO!S257))","v":"En Ruta"},{"$f":"IF(AM257=\"Entregado\",M257,\"\")","v":""},{"$f":"IF(AK257=\"Entregado\",\"\",IF(X257=\"24hrs\",\"\",IF(X257=\"48hrs\",\"Entregado\",CONSOLIDADO!S257)))","v":"En Ruta"},{"$f":"IF(AO257=\"Entregado\",M257,\"\")","v":""},{"$f":"IF(AK257=\"Entregado\",\"\",IF(OR(X257=\"24hrs\",X257=\"48hrs\"),\"\",IF(X257=\"72hrs\",\"Entregado\",CONSOLIDADO!S257)))","v":"En Ruta"},{"$f":"IF(AQ257=\"Entregado\",M257,\"\")","v":""},{"$f":"IF(AK257=\"Entregado\",\"\",IF(OR(X257=\"24hrs\",X257=\"48hrs\",X257=\"72hrs\"),\"\",IF(X257=\"+72hrs\",\"Entregado\",CONSOLIDADO!S257)))","v":"En Ruta"},{"$f":"IF(M257=\"\",\"\",M257)","v":""},{"$f":"IF(AG257=\"Devuelto\",AG257,N257)","v":"En Ruta"},{"$f":"1+0","v":1},0,0,0,0,1,0,"No Entregado",0,0,1,0,{"$f":"IF(V257=\"Lima\",NETWORKDAYS.INTL(D257,M257,11,'Dias Feriados'!$A$1:$A$15),IF(AND(V257=\"provincia\",X257=\"24hrs\"),1,IF(AND(V257=\"provincia\",X257=\"48hrs\"),2,NETWORKDAYS.INTL(D257,M257,11,'Dias Feriados'!$A$1:$A$15))))","v":-39255}]
["B001668092","May","2025-05-27","2025-05-28","G/I. 030-10132",257,"MERCEDES YOLANDA RAMOS RIOS","UBB LA ANGOSTURA 2 ETAPA N 31 FONAVI SAN MARTIN 2 ETAPA N31","Provincia","ICA","SUBTANJALLA","B001668092",null,"En Ruta",9730017269,"F",202508,203201,"En Ruta","Dia 1",{"$f":"IF(MID(R258,1,2)=\"10\",\"PACIFIKA\",IF(MID(R258,1,2)=\"20\",\"CARMEL\",\"EMPLEADOS\"))","v":"CARMEL"},{"$f":"IF(I258=\"LIMA\",\"LIMA\",\"PROVINCIA\")","v":"PROVINCIA"},{"$f":"NETWORKDAYS.INTL(D258,M258,11,'Dias Feriados'!$A$1:$A$15)","v":-39255},{"$f":"IF(OR(M258=\"\",M258=\"En Ruta\"),\"En Ruta\",IF(M258=\"Motivado\",\"Motivado\",IF(W258<=1,\"24hrs\",IF(W258=2,\"48hrs\",IF(W258=3,\"72hrs\",\"+72hrs\")))))","v":"En Ruta"},{"$f":"WEEKNUM(C258)","v":22},"NO",null,0.9375,0.94722222222222219,1,"CRUCES CHO","2025-05-28",null,null,45804,"",{"$f":"IF(AS258=\"Devuelto\",\"\",IF(X258=\"24hrs\",\"Entregado\",CONSOLIDADO!S258))","v":"En Ruta"},"",{"$f":"IF(AK258=\"Entregado\",\"\",IF(X258=\"24hrs\",\"\",IF(X258=\"48hrs\",\"Entregado\",CONSOLIDADO!S258)))","v":"En Ruta"},"",{"$f":"IF(AK258=\"Entregado\",\"\",IF(OR(X258=\"24hrs\",X258=\"48hrs\"),\"\",IF(X258=\"72hrs\",\"Entregado\",CONSOLIDADO!S258)))","v":"En Ruta"},"",{"$f":"IF(AK258=\"Entregado\",\"\",IF(OR(X258=\"24hrs\",X258=\"48hrs\",X258=\"72hrs\"),\"\",IF(X258=\"+72hrs\",\"Entregado\",CONSOLIDADO!S258)))","v":"En Ruta"},"","En Ruta",1,{"$f":"IF(X258=\"24hrs\",1,0)","v":0},{"$f":"IF(X258=\"48hrs\",1,0)","v":0},{"$f":"IF(X258=\"72hrs\",1,0)","v":0},{"$f":"IF(X258=\"+72hrs\",1,0)","v":0},{"$f":"IF(X258=\"En Ruta\",1,0)","v":1},{"$f":"IF(X258=\"Motivado\",1,0)","v":0},{"$f":"IF(OR(N258=\"devuelto\",N258=\"siniestro\"),\"Nulo\",IF(OR(X258=\"24hrs\",X258=\"48hrs\"),\"A Tiempo\",IF(OR(X258=\"en ruta\",X258=\"motivado\"),\"No Entregado\",\"Fuera de Tiempo\")))","v":"No Entregado"},{"$f":"IF(BA258=\"a tiempo\",1,0)","v":0},{"$f":"IF(BA258=\"fuera de tiempo\",1,0)","v":0},{"$f":"IF(BA258=\"no entregado\",1,0)","v":1},{"$f":"IF(BA258=\"nulo\",1,0)","v":0},{"$f":"IF(V258=\"Lima\",NETWORKDAYS.INTL(D258,M258,11,'Dias Feriados'!$A$1:$A$15),IF(AND(V258=\"provincia\",X258=\"24hrs\"),1,IF(AND(V258=\"provincia\",X258=\"48hrs\"),2,NETWORKDAYS.INTL(D258,M258,11,'Dias Feriados'!$A$1:$A$15))))","v":-39255}]
["B001667738","May","2025-05-27","2025-05-28","G/I. 030-10132",258,"JANET GIOVANNA PILLCO CURI","LOS OLIVOS MZ I PRIMA 18 I ET HABITACIONAL LA ANGOSTURA","Provincia","ICA","SUBTANJALLA","B001667738",null,"En Ruta",9730017275,"F",202508,203201,"En Ruta","Dia 1","CARMEL","PROVINCIA",{"$f":"NETWORKDAYS.INTL(D259,M259,11,'Dias Feriados'!$A$1:$A$15)","v":-39255},"En Ruta",22,"NO",null,0.9375,0.94722222222222219,1,"CRUCES CHO","2025-05-28",null,null,45804,"",{"$f":"IF(AS259=\"Devuelto\",\"\",IF(X259=\"24hrs\",\"Entregado\",CONSOLIDADO!S259))","v":"En Ruta"},"",{"$f":"IF(AK259=\"Entregado\",\"\",IF(X259=\"24hrs\",\"\",IF(X259=\"48hrs\",\"Entregado\",CONSOLIDADO!S259)))","v":"En Ruta"},"",{"$f":"IF(AK259=\"Entregado\",\"\",IF(OR(X259=\"24hrs\",X259=\"48hrs\"),\"\",IF(X259=\"72hrs\",\"Entregado\",CONSOLIDADO!S259)))","v":"En Ruta"},"",{"$f":"IF(AK259=\"Entregado\",\"\",IF(OR(X259=\"24hrs\",X259=\"48hrs\",X259=\"72hrs\"),\"\",IF(X259=\"+72hrs\",\"Entregado\",CONSOLIDADO!S259)))","v":"En Ruta"},"","En Ruta",1,0,0,0,0,1,0,"No Entregado",0,0,1,0,{"$f":"IF(V259=\"Lima\",NETWORKDAYS.INTL(D259,M259,11,'Dias Feriados'!$A$1:$A$15),IF(AND(V259=\"provincia\",X259=\"24hrs\"),1,IF(AND(V259=\"provincia\",X259=\"48hrs\"),2,NETWORKDAYS.INTL(D259,M259,11,'Dias Feriados'!$A$1:$A$15))))","v":-39255}]
["B001667452","May","2025-05-27","2025-05-28","G/I. 030-10132",259,"MARIA ELENA HUAYANCA PINEDA","COLINAS DE LA ANGOSTURA A 5 ESPALDA DE PROGRAMA MUNICIPAL","Provincia","ICA","SUBTANJALLA","B001667452",null,"En Ruta",9730017316,"F",202508,203201,"En Ruta","Dia 1","CARMEL","PROVINCIA",{"$f":"NETWORKDAYS.INTL(D260,M260,11,'Dias Feriados'!$A$1:$A$15)","v":-39255},"En Ruta",22,"NO",null,0.9375,0.94722222222222219,1,"CRUCES CHO","2025-05-28",null,null,45804,"",{"$f":"IF(AS260=\"Devuelto\",\"\",IF(X260=\"24hrs\",\"Entregado\",CONSOLIDADO!S260))","v":"En Ruta"},"",{"$f":"IF(AK260=\"Entregado\",\"\",IF(X260=\"24hrs\",\"\",IF(X260=\"48hrs\",\"Entregado\",CONSOLIDADO!S260)))","v":"En Ruta"},"",{"$f":"IF(AK260=\"Entregado\",\"\",IF(OR(X260=\"24hrs\",X260=\"48hrs\"),\"\",IF(X260=\"72hrs\",\"Entregado\",CONSOLIDADO!S260)))","v":"En Ruta"},"",{"$f":"IF(AK260=\"Entregado\",\"\",IF(OR(X260=\"24hrs\",X260=\"48hrs\",X260=\"72hrs\"),\"\",IF(X260=\"+72hrs\",\"Entregado\",CONSOLIDADO!S260)))","v":"En Ruta"},"","En Ruta",1,0,0,0,0,1,0,"No Entregado",0,0,1,0,{"$f":"IF(V260=\"Lima\",NETWORKDAYS.INTL(D260,M260,11,'Dias Feriados'!$A$1:$A$15),IF(AND(V260=\"provincia\",X260=\"24hrs\"),1,IF(AND(V260=\"provincia\",X260=\"48hrs\"),2,NETWORKDAYS.INTL(D260,M260,11,'Dias Feriados'!$A$1:$A$15))))","v":-39255}]
["B001667456","May","2025-05-27","2025-05-28","G/I. 030-10132",260,"JACQUELINE MARILU LOVERA GALVE","CL BOLOGNESI 125 A ESPALDAS DEL COLEGIO DE PRIMARIA","Provincia","ICA","SUBTANJALLA","B001667456",null,"En Ruta",9730017339,"F",202508,203201,"En Ruta","Dia 1","CARMEL","PROVINCIA",{"$f":"NETWORKDAYS.INTL(D261,M261,11,'Dias Feriados'!$A$1:$A$15)","v":-39255},"En Ruta",22,"NO",null,0.9375,0.94722222222222219,1,"CRUCES CHO","2025-05-28",null,null,45804,"",{"$f":"IF(AS261=\"Devuelto\",\"\",IF(X261=\"24hrs\",\"Entregado\",CONSOLIDADO!S261))","v":"En Ruta"},"",{"$f":"IF(AK261=\"Entregado\",\"\",IF(X261=\"24hrs\",\"\",IF(X261=\"48hrs\",\"Entregado\",CONSOLIDADO!S261)))","v":"En Ruta"},"",{"$f":"IF(AK261=\"Entregado\",\"\",IF(OR(X261=\"24hrs\",X261=\"48hrs\"),\"\",IF(X261=\"72hrs\",\"Entregado\",CONSOLIDADO!S261)))","v":"En Ruta"},"",{"$f":"IF(AK261=\"Entregado\",\"\",IF(OR(X261=\"24hrs\",X261=\"48hrs\",X261=\"72hrs\"),\"\",IF(X261=\"+72hrs\",\"Entregado\",CONSOLIDADO!S261)))","v":"En Ruta"},"","En Ruta",1,0,0,0,0,1,0,"No Entregado",0,0,1,0,{"$f":"IF(V261=\"Lima\",NETWORKDAYS.INTL(D261,M261,11,'Dias Feriados'!$A$1:$A$15),IF(AND(V261=\"provincia\",X261=\"24hrs\"),1,IF(AND(V261=\"provincia\",X261=\"48hrs\"),2,NETWORKDAYS.INTL(D261,M261,11,'Dias Feriados'!$A$1:$A$15))))","v":-39255}]
["B001668347","May","2025-05-27","2025-05-28","G/I. 030-10132",261,"JULEIDY MELISSA ESCOVAR PUMAYA","1 ET C 39 CONJU HABITACIONAL LA ANGOSTURA JARDIN DE NINOS 148","Provincia","ICA","SUBTANJALLA","B001668347",null,"En Ruta",9730017381,"F",202508,203201,"En Ruta","Dia 1","CARMEL","PROVINCIA",{"$f":"NETWORKDAYS.INTL(D262,M262,11,'Dias Feriados'!$A$1:$A$15)","v":-39255},"En Ruta",22,"NO",null,0.9375,0.94722222222222219,1,"CRUCES CHO","2025-05-28",null,null,45804,"",{"$f":"IF(AS262=\"Devuelto\",\"\",IF(X262=\"24hrs\",\"Entregado\",CONSOLIDADO!S262))","v":"En Ruta"},"",{"$f":"IF(AK262=\"Entregado\",\"\",IF(X262=\"24hrs\",\"\",IF(X262=\"48hrs\",\"Entregado\",CONSOLIDADO!S262)))","v":"En Ruta"},"",{"$f":"IF(AK262=\"Entregado\",\"\",IF(OR(X262=\"24hrs\",X262=\"48hrs\"),\"\",IF(X262=\"72hrs\",\"Entregado\",CONSOLIDADO!S262)))","v":"En Ruta"},"",{"$f":"IF(AK262=\"Entregado\",\"\",IF(OR(X262=\"24hrs\",X262=\"48hrs\",X262=\"72hrs\"),\"\",IF(X262=\"+72hrs\",\"Entregado\",CONSOLIDADO!S262)))","v":"En Ruta"},"","En Ruta",1,0,0,0,0,1,0,"No Entregado",0,0,1,0,{"$f":"IF(V262=\"Lima\",NETWORKDAYS.INTL(D262,M262,11,'Dias Feriados'!$A$1:$A$15),IF(AND(V262=\"provincia\",X262=\"24hrs\"),1,IF(AND(V262=\"provincia\",X262=\"48hrs\"),2,NETWORKDAYS.INTL(D262,M262,11,'Dias Feriados'!$A$1:$A$15))))","v":-39255}]
["B001667752","May","2025-05-27","2025-05-28","G/I. 030-10132",262,"TESSY LIZETH CORDOVA GUERRERO","LA CAPILLA MZ P LT 1 MUNICIPALIDAD","Provincia","ICA","TATE","B001667752",null,"En Ruta",9730017197,"F",202508,203201,"En Ruta","Dia 1","CARMEL","PROVINCIA",{"$f":"NETWORKDAYS.INTL(D263,M263,11,'Dias Feriados'!$A$1:$A$15)","v":-39255},"En Ruta",22,"NO",null,0.9375,0.94722222222222219,1,"CRUCES CHO","2025-05-28",null,null,45804,"",{"$f":"IF(AS263=\"Devuelto\",\"\",IF(X263=\"24hrs\",\"Entregado\",CONSOLIDADO!S263))","v":"En Ruta"},"",{"$f":"IF(AK263=\"Entregado\",\"\",IF(X263=\"24hrs\",\"\",IF(X263=\"48hrs\",\"Entregado\",CONSOLIDADO!S263)))","v":"En Ruta"},"",{"$f":"IF(AK263=\"Entregado\",\"\",IF(OR(X263=\"24hrs\",X263=\"48hrs\"),\"\",IF(X263=\"72hrs\",\"Entregado\",CONSOLIDADO!S263)))","v":"En Ruta"},"",{"$f":"IF(AK263=\"Entregado\",\"\",IF(OR(X263=\"24hrs\",X263=\"48hrs\",X263=\"72hrs\"),\"\",IF(X263=\"+72hrs\",\"Entregado\",CONSOLIDADO!S263)))","v":"En Ruta"},"","En Ruta",1,0,0,0,0,1,0,"No Entregado",0,0,1,0,{"$f":"IF(V263=\"Lima\",NETWORKDAYS.INTL(D263,M263,11,'Dias Feriados'!$A$1:$A$15),IF(AND(V263=\"provincia\",X263=\"24hrs\"),1,IF(AND(V263=\"provincia\",X263=\"48hrs\"),2,NETWORKDAYS.INTL(D263,M263,11,'Dias Feriados'!$A$1:$A$15))))","v":-39255}]
["B001667386","May","2025-05-27","2025-05-28","G/I. 030-10132",263,"ANGIE CAROLINA HUAMAN MARCOS","ROSARIO DE YAUCA E4CONJUNTO HABITAC CONJUNTO HABITACIONAL","Provincia","ICA","TATE","B001667386",null,"En Ruta",9730017358,"F",202508,203201,"En Ruta","Dia 1","CARMEL","PROVINCIA",{"$f":"NETWORKDAYS.INTL(D264,M264,11,'Dias Feriados'!$A$1:$A$15)","v":-39255},"En Ruta",22,"NO",null,0.9375,0.94722222222222219,1,"CRUCES CHO","2025-05-28",null,null,45804,"",{"$f":"IF(AS264=\"Devuelto\",\"\",IF(X264=\"24hrs\",\"Entregado\",CONSOLIDADO!S264))","v":"En Ruta"},"",{"$f":"IF(AK264=\"Entregado\",\"\",IF(X264=\"24hrs\",\"\",IF(X264=\"48hrs\",\"Entregado\",CONSOLIDADO!S264)))","v":"En Ruta"},"",{"$f":"IF(AK264=\"Entregado\",\"\",IF(OR(X264=\"24hrs\",X264=\"48hrs\"),\"\",IF(X264=\"72hrs\",\"Entregado\",CONSOLIDADO!S264)))","v":"En Ruta"},"",{"$f":"IF(AK264=\"Entregado\",\"\",IF(OR(X264=\"24hrs\",X264=\"48hrs\",X264=\"72hrs\"),\"\",IF(X264=\"+72hrs\",\"Entregado\",CONSOLIDADO!S264)))","v":"En Ruta"},"","En Ruta",1,0,0,0,0,1,0,"No Entregado",0,0,1,0,{"$f":"IF(V264=\"Lima\",NETWORKDAYS.INTL(D264,M264,11,'Dias Feriados'!$A$1:$A$15),IF(AND(V264=\"provincia\",X264=\"24hrs\"),1,IF(AND(V264=\"provincia\",X264=\"48hrs\"),2,NETWORKDAYS.INTL(D264,M264,11,'Dias Feriados'!$A$1:$A$15))))","v":-39255}]
["B001667394","May","2025-05-27","2025-05-28","G/I. 030-10132",264,"ROSA MARIA HERNANDEZ ANICAMA","MZG LT 34 C CENTRO POBLADO CAMINO GRANDE AL FRENTE DE LA FAMILA LOYOLA","Provincia","ICA","TATE","B001667394",null,"En Ruta",9730017430,"F",202508,203201,"En Ruta","Dia 1","CARMEL","PROVINCIA",{"$f":"NETWORKDAYS.INTL(D265,M265,11,'Dias Feriados'!$A$1:$A$15)","v":-39255},"En Ruta",22,"NO",null,0.9375,0.94722222222222219,1,"HUARCAYA M","2025-05-28",null,null,45804,"",{"$f":"IF(AS265=\"Devuelto\",\"\",IF(X265=\"24hrs\",\"Entregado\",CONSOLIDADO!S265))","v":"En Ruta"},"",{"$f":"IF(AK265=\"Entregado\",\"\",IF(X265=\"24hrs\",\"\",IF(X265=\"48hrs\",\"Entregado\",CONSOLIDADO!S265)))","v":"En Ruta"},"",{"$f":"IF(AK265=\"Entregado\",\"\",IF(OR(X265=\"24hrs\",X265=\"48hrs\"),\"\",IF(X265=\"72hrs\",\"Entregado\",CONSOLIDADO!S265)))","v":"En Ruta"},"",{"$f":"IF(AK265=\"Entregado\",\"\",IF(OR(X265=\"24hrs\",X265=\"48hrs\",X265=\"72hrs\"),\"\",IF(X265=\"+72hrs\",\"Entregado\",CONSOLIDADO!S265)))","v":"En Ruta"},"","En Ruta",1,0,0,0,0,1,0,"No Entregado",0,0,1,0,{"$f":"IF(V265=\"Lima\",NETWORKDAYS.INTL(D265,M265,11,'Dias Feriados'!$A$1:$A$15),IF(AND(V265=\"provincia\",X265=\"24hrs\"),1,IF(AND(V265=\"provincia\",X265=\"48hrs\"),2,NETWORKDAYS.INTL(D265,M265,11,'Dias Feriados'!$A$1:$A$15))))","v":-39255}]
["B001667474","May","2025-05-27","2025-05-28","G/I. 030-10132",265,"CLAUDIA BERNARDINA NIETO ARONE","CENTRO POBLADO SAN JOSE 2 ENTRADA POR LA RECTA DEL COMEDOR 2 ENTRADA","Provincia","NAZCA","EL INGENIO","B001667474",null,"En Ruta",9730017092,"F",202508,203201,"En Ruta","Dia 1","CARMEL","PROVINCIA",{"$f":"NETWORKDAYS.INTL(D266,M266,11,'Dias Feriados'!$A$1:$A$15)","v":-39255},"En Ruta",22,"NO",null,0.9375,0.94722222222222219,1,"HUARCAYA M","2025-05-28",null,null,45804,"",{"$f":"IF(AS266=\"Devuelto\",\"\",IF(X266=\"24hrs\",\"Entregado\",CONSOLIDADO!S266))","v":"En Ruta"},"",{"$f":"IF(AK266=\"Entregado\",\"\",IF(X266=\"24hrs\",\"\",IF(X266=\"48hrs\",\"Entregado\",CONSOLIDADO!S266)))","v":"En Ruta"},"",{"$f":"IF(AK266=\"Entregado\",\"\",IF(OR(X266=\"24hrs\",X266=\"48hrs\"),\"\",IF(X266=\"72hrs\",\"Entregado\",CONSOLIDADO!S266)))","v":"En Ruta"},"",{"$f":"IF(AK266=\"Entregado\",\"\",IF(OR(X266=\"24hrs\",X266=\"48hrs\",X266=\"72hrs\"),\"\",IF(X266=\"+72hrs\",\"Entregado\",CONSOLIDADO!S266)))","v":"En Ruta"},"","En Ruta",1,0,0,0,0,1,0,"No Entregado",0,0,1,0,{"$f":"IF(V266=\"Lima\",NETWORKDAYS.INTL(D266,M266,11,'Dias Feriados'!$A$1:$A$15),IF(AND(V266=\"provincia\",X266=\"24hrs\"),1,IF(AND(V266=\"provincia\",X266=\"48hrs\"),2,NETWORKDAYS.INTL(D266,M266,11,'Dias Feriados'!$A$1:$A$15))))","v":-39255}]
["B001667493","May","2025-05-27","2025-05-28","G/I. 030-10132",266,"BRENDA REBECA RUIZ VASQUEZ","CATEGORIA C MZ33 LOTE 52 PASAJE MI SENORA DE GUADALUPE","Provincia","NAZCA","MARCONA","B001667493",null,"En Ruta",9730017141,"F",202508,203201,"En Ruta","Dia 1","CARMEL","PROVINCIA",{"$f":"NETWORKDAYS.INTL(D267,M267,11,'Dias Feriados'!$A$1:$A$15)","v":-39255},"En Ruta",22,"NO",null,0.9375,0.94722222222222219,1,"HUARCAYA M","2025-05-28",null,null,45804,"",{"$f":"IF(AS267=\"Devuelto\",\"\",IF(X267=\"24hrs\",\"Entregado\",CONSOLIDADO!S267))","v":"En Ruta"},"",{"$f":"IF(AK267=\"Entregado\",\"\",IF(X267=\"24hrs\",\"\",IF(X267=\"48hrs\",\"Entregado\",CONSOLIDADO!S267)))","v":"En Ruta"},"",{"$f":"IF(AK267=\"Entregado\",\"\",IF(OR(X267=\"24hrs\",X267=\"48hrs\"),\"\",IF(X267=\"72hrs\",\"Entregado\",CONSOLIDADO!S267)))","v":"En Ruta"},"",{"$f":"IF(AK267=\"Entregado\",\"\",IF(OR(X267=\"24hrs\",X267=\"48hrs\",X267=\"72hrs\"),\"\",IF(X267=\"+72hrs\",\"Entregado\",CONSOLIDADO!S267)))","v":"En Ruta"},"","En Ruta",1,0,0,0,0,1,0,"No Entregado",0,0,1,0,{"$f":"IF(V267=\"Lima\",NETWORKDAYS.INTL(D267,M267,11,'Dias Feriados'!$A$1:$A$15),IF(AND(V267=\"provincia\",X267=\"24hrs\"),1,IF(AND(V267=\"provincia\",X267=\"48hrs\"),2,NETWORKDAYS.INTL(D267,M267,11,'Dias Feriados'!$A$1:$A$15))))","v":-39255}]
["B001667538","May","2025-05-27","2025-05-28","G/I. 030-10132",267,"KARIN AMELIA AURIS VILLALON DE","B 17 17 MZ B ESPALDA DEL COLEGIO SIMON RODRIGUEZ UNION VICTORIA","Provincia","NAZCA","NAZCA","B001667538",null,"En Ruta",9730017004,"F",202508,203201,"En Ruta","Dia 1","CARMEL","PROVINCIA",{"$f":"NETWORKDAYS.INTL(D268,M268,11,'Dias Feriados'!$A$1:$A$15)","v":-39255},"En Ruta",22,"NO",null,0.9375,0.94722222222222219,1,"HUARCAYA M","2025-05-28",null,null,45804,"",{"$f":"IF(AS268=\"Devuelto\",\"\",IF(X268=\"24hrs\",\"Entregado\",CONSOLIDADO!S268))","v":"En Ruta"},"",{"$f":"IF(AK268=\"Entregado\",\"\",IF(X268=\"24hrs\",\"\",IF(X268=\"48hrs\",\"Entregado\",CONSOLIDADO!S268)))","v":"En Ruta"},"",{"$f":"IF(AK268=\"Entregado\",\"\",IF(OR(X268=\"24hrs\",X268=\"48hrs\"),\"\",IF(X268=\"72hrs\",\"Entregado\",CONSOLIDADO!S268)))","v":"En Ruta"},"",{"$f":"IF(AK268=\"Entregado\",\"\",IF(OR(X268=\"24hrs\",X268=\"48hrs\",X268=\"72hrs\"),\"\",IF(X268=\"+72hrs\",\"Entregado\",CONSOLIDADO!S268)))","v":"En Ruta"},"","En Ruta",1,0,0,0,0,1,0,"No Entregado",0,0,1,0,{"$f":"IF(V268=\"Lima\",NETWORKDAYS.INTL(D268,M268,11,'Dias Feriados'!$A$1:$A$15),IF(AND(V268=\"provincia\",X268=\"24hrs\"),1,IF(AND(V268=\"provincia\",X268=\"48hrs\"),2,NETWORKDAYS.INTL(D268,M268,11,'Dias Feriados'!$A$1:$A$15))))","v":-39255}]
["B001667664","May","2025-05-27","2025-05-28","G/I. 030-10132",268,"JUANA NINFA CONDORI MOLINA","C FERMN DEL CASTILLO AL FRENTE RENIEC CTR PBD","Provincia","NAZCA","NAZCA","B001667664",null,"En Ruta",9730017035,"F",202508,203201,"En Ruta","Dia 1","CARMEL","PROVINCIA",{"$f":"NETWORKDAYS.INTL(D269,M269,11,'Dias Feriados'!$A$1:$A$15)","v":-39255},"En Ruta",22,"NO",null,0.9375,0.94722222222222219,1,"HUARCAYA M","2025-05-28",null,null,45804,"",{"$f":"IF(AS269=\"Devuelto\",\"\",IF(X269=\"24hrs\",\"Entregado\",CONSOLIDADO!S269))","v":"En Ruta"},"",{"$f":"IF(AK269=\"Entregado\",\"\",IF(X269=\"24hrs\",\"\",IF(X269=\"48hrs\",\"Entregado\",CONSOLIDADO!S269)))","v":"En Ruta"},"",{"$f":"IF(AK269=\"Entregado\",\"\",IF(OR(X269=\"24hrs\",X269=\"48hrs\"),\"\",IF(X269=\"72hrs\",\"Entregado\",CONSOLIDADO!S269)))","v":"En Ruta"},"",{"$f":"IF(AK269=\"Entregado\",\"\",IF(OR(X269=\"24hrs\",X269=\"48hrs\",X269=\"72hrs\"),\"\",IF(X269=\"+72hrs\",\"Entregado\",CONSOLIDADO!S269)))","v":"En Ruta"},"","En Ruta",1,0,0,0,0,1,0,"No Entregado",0,0,1,0,{"$f":"IF(V269=\"Lima\",NETWORKDAYS.INTL(D269,M269,11,'Dias Feriados'!$A$1:$A$15),IF(AND(V269=\"provincia\",X269=\"24hrs\"),1,IF(AND(V269=\"provincia\",X269=\"48hrs\"),2,NETWORKDAYS.INTL(D269,M269,11,'Dias Feriados'!$A$1:$A$15))))","v":-39255}]
["B001667674","May","2025-05-27","2025-05-28","G/I. 030-10132",269,"ROSA MARISOL CALLA QUISPE","CL CHICLAYO CASA 25 M8 SIN BARRIO CARCADO VISTA ALEGRE LA MISMA SUBIDA DE NUEVA UNION","Provincia","NAZCA","NAZCA","B001667674",null,"En Ruta",9730017101,"F",202508,203201,"En Ruta","Dia 1","CARMEL","PROVINCIA",{"$f":"NETWORKDAYS.INTL(D270,M270,11,'Dias Feriados'!$A$1:$A$15)","v":-39255},"En Ruta",22,"NO",null,0.9375,0.94722222222222219,1,"HUARCAYA M","2025-05-28",null,null,45804,"",{"$f":"IF(AS270=\"Devuelto\",\"\",IF(X270=\"24hrs\",\"Entregado\",CONSOLIDADO!S270))","v":"En Ruta"},"",{"$f":"IF(AK270=\"Entregado\",\"\",IF(X270=\"24hrs\",\"\",IF(X270=\"48hrs\",\"Entregado\",CONSOLIDADO!S270)))","v":"En Ruta"},"",{"$f":"IF(AK270=\"Entregado\",\"\",IF(OR(X270=\"24hrs\",X270=\"48hrs\"),\"\",IF(X270=\"72hrs\",\"Entregado\",CONSOLIDADO!S270)))","v":"En Ruta"},"",{"$f":"IF(AK270=\"Entregado\",\"\",IF(OR(X270=\"24hrs\",X270=\"48hrs\",X270=\"72hrs\"),\"\",IF(X270=\"+72hrs\",\"Entregado\",CONSOLIDADO!S270)))","v":"En Ruta"},"","En Ruta",1,0,0,0,0,1,0,"No Entregado",0,0,1,0,{"$f":"IF(V270=\"Lima\",NETWORKDAYS.INTL(D270,M270,11,'Dias Feriados'!$A$1:$A$15),IF(AND(V270=\"provincia\",X270=\"24hrs\"),1,IF(AND(V270=\"provincia\",X270=\"48hrs\"),2,NETWORKDAYS.INTL(D270,M270,11,'Dias Feriados'!$A$1:$A$15))))","v":-39255}]
["B001667755","May","2025-05-27","2025-05-28","G/I. 030-10132",270,"CARMEN IRENE BOHORQUEZ RAMOS","CL JUAN MATTA 510 510 A MEDIA CUADRA DE LA CLINICA JUAN PABLO","Provincia","NAZCA","NAZCA","B001667755",null,"En Ruta",9730017184,"F",202508,203201,"En Ruta","Dia 1","CARMEL","PROVINCIA",{"$f":"NETWORKDAYS.INTL(D271,M271,11,'Dias Feriados'!$A$1:$A$15)","v":-39255},"En Ruta",22,"NO",null,0.9375,0.94722222222222219,1,"HUARCAYA M","2025-05-28",null,null,45804,"",{"$f":"IF(AS271=\"Devuelto\",\"\",IF(X271=\"24hrs\",\"Entregado\",CONSOLIDADO!S271))","v":"En Ruta"},"",{"$f":"IF(AK271=\"Entregado\",\"\",IF(X271=\"24hrs\",\"\",IF(X271=\"48hrs\",\"Entregado\",CONSOLIDADO!S271)))","v":"En Ruta"},"",{"$f":"IF(AK271=\"Entregado\",\"\",IF(OR(X271=\"24hrs\",X271=\"48hrs\"),\"\",IF(X271=\"72hrs\",\"Entregado\",CONSOLIDADO!S271)))","v":"En Ruta"},"",{"$f":"IF(AK271=\"Entregado\",\"\",IF(OR(X271=\"24hrs\",X271=\"48hrs\",X271=\"72hrs\"),\"\",IF(X271=\"+72hrs\",\"Entregado\",CONSOLIDADO!S271)))","v":"En Ruta"},"","En Ruta",1,0,0,0,0,1,0,"No Entregado",0,0,1,0,{"$f":"IF(V271=\"Lima\",NETWORKDAYS.INTL(D271,M271,11,'Dias Feriados'!$A$1:$A$15),IF(AND(V271=\"provincia\",X271=\"24hrs\"),1,IF(AND(V271=\"provincia\",X271=\"48hrs\"),2,NETWORKDAYS.INTL(D271,M271,11,'Dias Feriados'!$A$1:$A$15))))","v":-39255}]
["B001667725","May","2025-05-27","2025-05-28","G/I. 030-10132",271,"MARIA TERESA ZAMBRANO QUISPE","CALLE JUAN MATTA 510 FRENTE GIMNASIO OLIMPO CERCADO NASCA","Provincia","NAZCA","NAZCA","B001667725",null,"En Ruta",9730017324,"F",202508,203201,"En Ruta","Dia 1","CARMEL","PROVINCIA",{"$f":"NETWORKDAYS.INTL(D272,M272,11,'Dias Feriados'!$A$1:$A$15)","v":-39255},"En Ruta",22,"NO",null,0.9375,0.94722222222222219,1,"HUARCAYA M","2025-05-28",null,null,45804,"",{"$f":"IF(AS272=\"Devuelto\",\"\",IF(X272=\"24hrs\",\"Entregado\",CONSOLIDADO!S272))","v":"En Ruta"},"",{"$f":"IF(AK272=\"Entregado\",\"\",IF(X272=\"24hrs\",\"\",IF(X272=\"48hrs\",\"Entregado\",CONSOLIDADO!S272)))","v":"En Ruta"},"",{"$f":"IF(AK272=\"Entregado\",\"\",IF(OR(X272=\"24hrs\",X272=\"48hrs\"),\"\",IF(X272=\"72hrs\",\"Entregado\",CONSOLIDADO!S272)))","v":"En Ruta"},"",{"$f":"IF(AK272=\"Entregado\",\"\",IF(OR(X272=\"24hrs\",X272=\"48hrs\",X272=\"72hrs\"),\"\",IF(X272=\"+72hrs\",\"Entregado\",CONSOLIDADO!S272)))","v":"En Ruta"},"","En Ruta",1,0,0,0,0,1,0,"No Entregado",0,0,1,0,{"$f":"IF(V272=\"Lima\",NETWORKDAYS.INTL(D272,M272,11,'Dias Feriados'!$A$1:$A$15),IF(AND(V272=\"provincia\",X272=\"24hrs\"),1,IF(AND(V272=\"provincia\",X272=\"48hrs\"),2,NETWORKDAYS.INTL(D272,M272,11,'Dias Feriados'!$A$1:$A$15))))","v":-39255}]
["B001667654","May","2025-05-27","2025-05-28","G/I. 030-10132",272,"CAROLINA MARISELA GARCIA TUERO","CL JOSE MARIA MEJIA SN COSTADO DEL INABIF CENTRO","Provincia","NAZCA","NAZCA","B001667654",null,"En Ruta",9730017334,"F",202508,203201,"En Ruta","Dia 1","CARMEL","PROVINCIA",{"$f":"NETWORKDAYS.INTL(D273,M273,11,'Dias Feriados'!$A$1:$A$15)","v":-39255},"En Ruta",22,"NO",null,0.9375,0.94722222222222219,1,"HUARCAYA M","2025-05-28",null,null,45804,"",{"$f":"IF(AS273=\"Devuelto\",\"\",IF(X273=\"24hrs\",\"Entregado\",CONSOLIDADO!S273))","v":"En Ruta"},"",{"$f":"IF(AK273=\"Entregado\",\"\",IF(X273=\"24hrs\",\"\",IF(X273=\"48hrs\",\"Entregado\",CONSOLIDADO!S273)))","v":"En Ruta"},"",{"$f":"IF(AK273=\"Entregado\",\"\",IF(OR(X273=\"24hrs\",X273=\"48hrs\"),\"\",IF(X273=\"72hrs\",\"Entregado\",CONSOLIDADO!S273)))","v":"En Ruta"},"",{"$f":"IF(AK273=\"Entregado\",\"\",IF(OR(X273=\"24hrs\",X273=\"48hrs\",X273=\"72hrs\"),\"\",IF(X273=\"+72hrs\",\"Entregado\",CONSOLIDADO!S273)))","v":"En Ruta"},"","En Ruta",1,0,0,0,0,1,0,"No Entregado",0,0,1,0,{"$f":"IF(V273=\"Lima\",NETWORKDAYS.INTL(D273,M273,11,'Dias Feriados'!$A$1:$A$15),IF(AND(V273=\"provincia\",X273=\"24hrs\"),1,IF(AND(V273=\"provincia\",X273=\"48hrs\"),2,NETWORKDAYS.INTL(D273,M273,11,'Dias Feriados'!$A$1:$A$15))))","v":-39255}]
["B001667464","May","2025-05-27","2025-05-28","G/I. 030-10132",273,"AGAVITA VIRGINIA QUISPE POMASO","ENTRANDO A LA IZQUIERDA MZ C LT 11 A 3 CDRAS DE IGLESIA EVANGELICA PAJONAL BAJO MICAELA BASTIDAS","Provincia","NAZCA","NAZCA","B001667464",null,"En Ruta",9730017359,"F",202508,203201,"En Ruta","Dia 1","CARMEL","PROVINCIA",{"$f":"NETWORKDAYS.INTL(D274,M274,11,'Dias Feriados'!$A$1:$A$15)","v":-39255},"En Ruta",22,"NO",null,0.9375,0.94722222222222219,1,"HUARCAYA M","2025-05-28",null,null,45804,"",{"$f":"IF(AS274=\"Devuelto\",\"\",IF(X274=\"24hrs\",\"Entregado\",CONSOLIDADO!S274))","v":"En Ruta"},"",{"$f":"IF(AK274=\"Entregado\",\"\",IF(X274=\"24hrs\",\"\",IF(X274=\"48hrs\",\"Entregado\",CONSOLIDADO!S274)))","v":"En Ruta"},"",{"$f":"IF(AK274=\"Entregado\",\"\",IF(OR(X274=\"24hrs\",X274=\"48hrs\"),\"\",IF(X274=\"72hrs\",\"Entregado\",CONSOLIDADO!S274)))","v":"En Ruta"},"",{"$f":"IF(AK274=\"Entregado\",\"\",IF(OR(X274=\"24hrs\",X274=\"48hrs\",X274=\"72hrs\"),\"\",IF(X274=\"+72hrs\",\"Entregado\",CONSOLIDADO!S274)))","v":"En Ruta"},"","En Ruta",1,0,0,0,0,1,0,"No Entregado",0,0,1,0,{"$f":"IF(V274=\"Lima\",NETWORKDAYS.INTL(D274,M274,11,'Dias Feriados'!$A$1:$A$15),IF(AND(V274=\"provincia\",X274=\"24hrs\"),1,IF(AND(V274=\"provincia\",X274=\"48hrs\"),2,NETWORKDAYS.INTL(D274,M274,11,'Dias Feriados'!$A$1:$A$15))))","v":-39255}]
["B001667408","May","2025-05-27","2025-05-28","G/I. 030-10132",274,"REILI MARITA CHAYA CHUMBILE","ALFONZO UGARTE MZE LT 8 POR EL FRANCO PERUANO RIO 5 CASAS","Provincia","NAZCA","NAZCA","B001667408",null,"En Ruta",9730017364,"F",202508,203201,"En Ruta","Dia 1","CARMEL","PROVINCIA",{"$f":"NETWORKDAYS.INTL(D275,M275,11,'Dias Feriados'!$A$1:$A$15)","v":-39255},"En Ruta",22,"NO",null,0.9375,0.94722222222222219,1,"HUARCAYA M","2025-05-28",null,null,45804,"",{"$f":"IF(AS275=\"Devuelto\",\"\",IF(X275=\"24hrs\",\"Entregado\",CONSOLIDADO!S275))","v":"En Ruta"},"",{"$f":"IF(AK275=\"Entregado\",\"\",IF(X275=\"24hrs\",\"\",IF(X275=\"48hrs\",\"Entregado\",CONSOLIDADO!S275)))","v":"En Ruta"},"",{"$f":"IF(AK275=\"Entregado\",\"\",IF(OR(X275=\"24hrs\",X275=\"48hrs\"),\"\",IF(X275=\"72hrs\",\"Entregado\",CONSOLIDADO!S275)))","v":"En Ruta"},"",{"$f":"IF(AK275=\"Entregado\",\"\",IF(OR(X275=\"24hrs\",X275=\"48hrs\",X275=\"72hrs\"),\"\",IF(X275=\"+72hrs\",\"Entregado\",CONSOLIDADO!S275)))","v":"En Ruta"},"","En Ruta",1,0,0,0,0,1,0,"No Entregado",0,0,1,0,{"$f":"IF(V275=\"Lima\",NETWORKDAYS.INTL(D275,M275,11,'Dias Feriados'!$A$1:$A$15),IF(AND(V275=\"provincia\",X275=\"24hrs\"),1,IF(AND(V275=\"provincia\",X275=\"48hrs\"),2,NETWORKDAYS.INTL(D275,M275,11,'Dias Feriados'!$A$1:$A$15))))","v":-39255}]
["B001667371","May","2025-05-27","2025-05-28","G/I. 030-10132",275,"CINDY ADABEL ACHATA ZEGARRA","CL JOS MARIA MEJA SN AL COSTADO DEL INABIF","Provincia","NAZCA","NAZCA","B001667371",null,"En Ruta",9730017384,"F",202508,203201,"En Ruta","Dia 1","CARMEL","PROVINCIA",{"$f":"NETWORKDAYS.INTL(D276,M276,11,'Dias Feriados'!$A$1:$A$15)","v":-39255},"En Ruta",22,"NO",null,0.9375,0.94722222222222219,1,"HUARCAYA M","2025-05-28",null,null,45804,"",{"$f":"IF(AS276=\"Devuelto\",\"\",IF(X276=\"24hrs\",\"Entregado\",CONSOLIDADO!S276))","v":"En Ruta"},"",{"$f":"IF(AK276=\"Entregado\",\"\",IF(X276=\"24hrs\",\"\",IF(X276=\"48hrs\",\"Entregado\",CONSOLIDADO!S276)))","v":"En Ruta"},"",{"$f":"IF(AK276=\"Entregado\",\"\",IF(OR(X276=\"24hrs\",X276=\"48hrs\"),\"\",IF(X276=\"72hrs\",\"Entregado\",CONSOLIDADO!S276)))","v":"En Ruta"},"",{"$f":"IF(AK276=\"Entregado\",\"\",IF(OR(X276=\"24hrs\",X276=\"48hrs\",X276=\"72hrs\"),\"\",IF(X276=\"+72hrs\",\"Entregado\",CONSOLIDADO!S276)))","v":"En Ruta"},"","En Ruta",1,0,0,0,0,1,0,"No Entregado",0,0,1,0,{"$f":"IF(V276=\"Lima\",NETWORKDAYS.INTL(D276,M276,11,'Dias Feriados'!$A$1:$A$15),IF(AND(V276=\"provincia\",X276=\"24hrs\"),1,IF(AND(V276=\"provincia\",X276=\"48hrs\"),2,NETWORKDAYS.INTL(D276,M276,11,'Dias Feriados'!$A$1:$A$15))))","v":-39255}]
["B001667743","May","2025-05-27","2025-05-28","G/I. 030-10132",276,"DYANDRA STEPHANIE SHIRLEY GAVA","JUAN MATTA 510 POR ELJARDIJ SANTA RITA DE CASIA JUAN MATTA","Provincia","NAZCA","NAZCA","B001667743",null,"En Ruta",9730017605,"F",202508,203201,"En Ruta","Dia 1","CARMEL","PROVINCIA",{"$f":"NETWORKDAYS.INTL(D277,M277,11,'Dias Feriados'!$A$1:$A$15)","v":-39255},"En Ruta",22,"NO",null,0.9375,0.94722222222222219,1,"HUARCAYA M","2025-05-28",null,null,45804,"",{"$f":"IF(AS277=\"Devuelto\",\"\",IF(X277=\"24hrs\",\"Entregado\",CONSOLIDADO!S277))","v":"En Ruta"},"",{"$f":"IF(AK277=\"Entregado\",\"\",IF(X277=\"24hrs\",\"\",IF(X277=\"48hrs\",\"Entregado\",CONSOLIDADO!S277)))","v":"En Ruta"},"",{"$f":"IF(AK277=\"Entregado\",\"\",IF(OR(X277=\"24hrs\",X277=\"48hrs\"),\"\",IF(X277=\"72hrs\",\"Entregado\",CONSOLIDADO!S277)))","v":"En Ruta"},"",{"$f":"IF(AK277=\"Entregado\",\"\",IF(OR(X277=\"24hrs\",X277=\"48hrs\",X277=\"72hrs\"),\"\",IF(X277=\"+72hrs\",\"Entregado\",CONSOLIDADO!S277)))","v":"En Ruta"},"","En Ruta",1,0,0,0,0,1,0,"No Entregado",0,0,1,0,{"$f":"IF(V277=\"Lima\",NETWORKDAYS.INTL(D277,M277,11,'Dias Feriados'!$A$1:$A$15),IF(AND(V277=\"provincia\",X277=\"24hrs\"),1,IF(AND(V277=\"provincia\",X277=\"48hrs\"),2,NETWORKDAYS.INTL(D277,M277,11,'Dias Feriados'!$A$1:$A$15))))","v":-39255}]
["B001667740","May","2025-05-27","2025-05-28","G/I. 030-10132",277,"LUCY AMPARO ESPINOZA NACIMIENT","CL PALPA 570 LA COMISARIA UNA CDRA HACIA ARRIBA","Provincia","NAZCA","VISTA ALEGRE","B001667740",null,"En Ruta",9730017059,"F",202508,203201,"En Ruta","Dia 1","CARMEL","PROVINCIA",{"$f":"NETWORKDAYS.INTL(D278,M278,11,'Dias Feriados'!$A$1:$A$15)","v":-39255},"En Ruta",22,"NO",null,0.9375,0.94722222222222219,1,"HUARCAYA M","2025-05-28",null,null,45804,"",{"$f":"IF(AS278=\"Devuelto\",\"\",IF(X278=\"24hrs\",\"Entregado\",CONSOLIDADO!S278))","v":"En Ruta"},"",{"$f":"IF(AK278=\"Entregado\",\"\",IF(X278=\"24hrs\",\"\",IF(X278=\"48hrs\",\"Entregado\",CONSOLIDADO!S278)))","v":"En Ruta"},"",{"$f":"IF(AK278=\"Entregado\",\"\",IF(OR(X278=\"24hrs\",X278=\"48hrs\"),\"\",IF(X278=\"72hrs\",\"Entregado\",CONSOLIDADO!S278)))","v":"En Ruta"},"",{"$f":"IF(AK278=\"Entregado\",\"\",IF(OR(X278=\"24hrs\",X278=\"48hrs\",X278=\"72hrs\"),\"\",IF(X278=\"+72hrs\",\"Entregado\",CONSOLIDADO!S278)))","v":"En Ruta"},"","En Ruta",1,0,0,0,0,1,0,"No Entregado",0,0,1,0,{"$f":"IF(V278=\"Lima\",NETWORKDAYS.INTL(D278,M278,11,'Dias Feriados'!$A$1:$A$15),IF(AND(V278=\"provincia\",X278=\"24hrs\"),1,IF(AND(V278=\"provincia\",X278=\"48hrs\"),2,NETWORKDAYS.INTL(D278,M278,11,'Dias Feriados'!$A$1:$A$15))))","v":-39255}]
["B001667401","May","2025-05-27","2025-05-28","G/I. 030-10132",278,"ROSA MARIA TORRES PISCONTI","CL TALPA 562 COMISARIA VISTA ALEGRE","Provincia","NAZCA","VISTA ALEGRE","B001667401",null,"En Ruta",9730017236,"F",202508,203201,"En Ruta","Dia 1","CARMEL","PROVINCIA",{"$f":"NETWORKDAYS.INTL(D279,M279,11,'Dias Feriados'!$A$1:$A$15)","v":-39255},"En Ruta",22,"NO",null,0.9375,0.94722222222222219,1,"HUARCAYA M","2025-05-28",null,null,45804,"",{"$f":"IF(AS279=\"Devuelto\",\"\",IF(X279=\"24hrs\",\"Entregado\",CONSOLIDADO!S279))","v":"En Ruta"},"",{"$f":"IF(AK279=\"Entregado\",\"\",IF(X279=\"24hrs\",\"\",IF(X279=\"48hrs\",\"Entregado\",CONSOLIDADO!S279)))","v":"En Ruta"},"",{"$f":"IF(AK279=\"Entregado\",\"\",IF(OR(X279=\"24hrs\",X279=\"48hrs\"),\"\",IF(X279=\"72hrs\",\"Entregado\",CONSOLIDADO!S279)))","v":"En Ruta"},"",{"$f":"IF(AK279=\"Entregado\",\"\",IF(OR(X279=\"24hrs\",X279=\"48hrs\",X279=\"72hrs\"),\"\",IF(X279=\"+72hrs\",\"Entregado\",CONSOLIDADO!S279)))","v":"En Ruta"},"","En Ruta",1,0,0,0,0,1,0,"No Entregado",0,0,1,0,{"$f":"IF(V279=\"Lima\",NETWORKDAYS.INTL(D279,M279,11,'Dias Feriados'!$A$1:$A$15),IF(AND(V279=\"provincia\",X279=\"24hrs\"),1,IF(AND(V279=\"provincia\",X279=\"48hrs\"),2,NETWORKDAYS.INTL(D279,M279,11,'Dias Feriados'!$A$1:$A$15))))","v":-39255}]
["B001667757","May","2025-05-27","2025-05-28","G/I. 030-10132",279,"VERONICA CALLA QUISPE","CHICLAYO CASA M8 25 MZ M8 POR LA SUBIDA DEL MERCADO VISTA ALEGRE VISTA ALEGRE","Provincia","NAZCA","VISTA ALEGRE","B001667757",null,"En Ruta",9730017395,"F",202508,203201,"En Ruta","Dia 1","CARMEL","PROVINCIA",{"$f":"NETWORKDAYS.INTL(D280,M280,11,'Dias Feriados'!$A$1:$A$15)","v":-39255},"En Ruta",22,"NO",null,0.9375,0.94722222222222219,1,"HUARCAYA M","2025-05-28",null,null,45804,"",{"$f":"IF(AS280=\"Devuelto\",\"\",IF(X280=\"24hrs\",\"Entregado\",CONSOLIDADO!S280))","v":"En Ruta"},"",{"$f":"IF(AK280=\"Entregado\",\"\",IF(X280=\"24hrs\",\"\",IF(X280=\"48hrs\",\"Entregado\",CONSOLIDADO!S280)))","v":"En Ruta"},"",{"$f":"IF(AK280=\"Entregado\",\"\",IF(OR(X280=\"24hrs\",X280=\"48hrs\"),\"\",IF(X280=\"72hrs\",\"Entregado\",CONSOLIDADO!S280)))","v":"En Ruta"},"",{"$f":"IF(AK280=\"Entregado\",\"\",IF(OR(X280=\"24hrs\",X280=\"48hrs\",X280=\"72hrs\"),\"\",IF(X280=\"+72hrs\",\"Entregado\",CONSOLIDADO!S280)))","v":"En Ruta"},"","En Ruta",1,0,0,0,0,1,0,"No Entregado",0,0,1,0,{"$f":"IF(V280=\"Lima\",NETWORKDAYS.INTL(D280,M280,11,'Dias Feriados'!$A$1:$A$15),IF(AND(V280=\"provincia\",X280=\"24hrs\"),1,IF(AND(V280=\"provincia\",X280=\"48hrs\"),2,NETWORKDAYS.INTL(D280,M280,11,'Dias Feriados'!$A$1:$A$15))))","v":-39255}]
["B001667367","May","2025-05-27","2025-05-28","G/I. 030-10132",280,"RUTH MARLENI QUISPE VELASQUEZ","CALLE ENRRIQUE PAREDES MZ Z LT 32B LA TERCERA ENTRADA VINIENDO DE ICA","Provincia","PALPA","RIO GRANDE","B001667367",null,"En Ruta",9730017392,"F",202508,203201,"En Ruta","Dia 1","CARMEL","PROVINCIA",{"$f":"NETWORKDAYS.INTL(D281,M281,11,'Dias Feriados'!$A$1:$A$15)","v":-39255},"En Ruta",22,"NO",null,0.9375,0.94722222222222219,1,"ROMERO ACE","2025-05-28",null,null,45804,"",{"$f":"IF(AS281=\"Devuelto\",\"\",IF(X281=\"24hrs\",\"Entregado\",CONSOLIDADO!S281))","v":"En Ruta"},"",{"$f":"IF(AK281=\"Entregado\",\"\",IF(X281=\"24hrs\",\"\",IF(X281=\"48hrs\",\"Entregado\",CONSOLIDADO!S281)))","v":"En Ruta"},"",{"$f":"IF(AK281=\"Entregado\",\"\",IF(OR(X281=\"24hrs\",X281=\"48hrs\"),\"\",IF(X281=\"72hrs\",\"Entregado\",CONSOLIDADO!S281)))","v":"En Ruta"},"",{"$f":"IF(AK281=\"Entregado\",\"\",IF(OR(X281=\"24hrs\",X281=\"48hrs\",X281=\"72hrs\"),\"\",IF(X281=\"+72hrs\",\"Entregado\",CONSOLIDADO!S281)))","v":"En Ruta"},"","En Ruta",1,0,0,0,0,1,0,"No Entregado",0,0,1,0,{"$f":"IF(V281=\"Lima\",NETWORKDAYS.INTL(D281,M281,11,'Dias Feriados'!$A$1:$A$15),IF(AND(V281=\"provincia\",X281=\"24hrs\"),1,IF(AND(V281=\"provincia\",X281=\"48hrs\"),2,NETWORKDAYS.INTL(D281,M281,11,'Dias Feriados'!$A$1:$A$15))))","v":-39255}]
["B001667537","May","2025-05-27","2025-05-28","G/I. 030-10132",281,"MARTHA MARIA SALINAS VALENTIN","CONDE MONCLOVA 271 BODEGA 3 MELLIZOS","Provincia","PISCO","INDEPENDENCIA","B001667537",null,"En Ruta",9730017121,"F",202508,203201,"En Ruta","Dia 1","CARMEL","PROVINCIA",{"$f":"NETWORKDAYS.INTL(D282,M282,11,'Dias Feriados'!$A$1:$A$15)","v":-39255},"En Ruta",22,"NO",null,0.9375,0.94722222222222219,1,"ROMERO ACE","2025-05-28",null,null,45804,"",{"$f":"IF(AS282=\"Devuelto\",\"\",IF(X282=\"24hrs\",\"Entregado\",CONSOLIDADO!S282))","v":"En Ruta"},"",{"$f":"IF(AK282=\"Entregado\",\"\",IF(X282=\"24hrs\",\"\",IF(X282=\"48hrs\",\"Entregado\",CONSOLIDADO!S282)))","v":"En Ruta"},"",{"$f":"IF(AK282=\"Entregado\",\"\",IF(OR(X282=\"24hrs\",X282=\"48hrs\"),\"\",IF(X282=\"72hrs\",\"Entregado\",CONSOLIDADO!S282)))","v":"En Ruta"},"",{"$f":"IF(AK282=\"Entregado\",\"\",IF(OR(X282=\"24hrs\",X282=\"48hrs\",X282=\"72hrs\"),\"\",IF(X282=\"+72hrs\",\"Entregado\",CONSOLIDADO!S282)))","v":"En Ruta"},"","En Ruta",1,0,0,0,0,1,0,"No Entregado",0,0,1,0,{"$f":"IF(V282=\"Lima\",NETWORKDAYS.INTL(D282,M282,11,'Dias Feriados'!$A$1:$A$15),IF(AND(V282=\"provincia\",X282=\"24hrs\"),1,IF(AND(V282=\"provincia\",X282=\"48hrs\"),2,NETWORKDAYS.INTL(D282,M282,11,'Dias Feriados'!$A$1:$A$15))))","v":-39255}]
["B001667737","May","2025-05-27","2025-05-28","G/I. 030-10132",282,"CINTHIA ISABEL TAPIA CORDOVA","CLL JORGE CHAVEZ # 202 PASANDO CLUB JORGE CHAVEZ","Provincia","PISCO","PISCO","B001667737",null,"En Ruta",9730017015,"F",202508,203201,"En Ruta","Dia 1","CARMEL","PROVINCIA",{"$f":"NETWORKDAYS.INTL(D283,M283,11,'Dias Feriados'!$A$1:$A$15)","v":-39255},"En Ruta",22,"NO",null,0.9375,0.94722222222222219,1,"ROMERO ACE","2025-05-28",null,null,45804,"",{"$f":"IF(AS283=\"Devuelto\",\"\",IF(X283=\"24hrs\",\"Entregado\",CONSOLIDADO!S283))","v":"En Ruta"},"",{"$f":"IF(AK283=\"Entregado\",\"\",IF(X283=\"24hrs\",\"\",IF(X283=\"48hrs\",\"Entregado\",CONSOLIDADO!S283)))","v":"En Ruta"},"",{"$f":"IF(AK283=\"Entregado\",\"\",IF(OR(X283=\"24hrs\",X283=\"48hrs\"),\"\",IF(X283=\"72hrs\",\"Entregado\",CONSOLIDADO!S283)))","v":"En Ruta"},"",{"$f":"IF(AK283=\"Entregado\",\"\",IF(OR(X283=\"24hrs\",X283=\"48hrs\",X283=\"72hrs\"),\"\",IF(X283=\"+72hrs\",\"Entregado\",CONSOLIDADO!S283)))","v":"En Ruta"},"","En Ruta",1,0,0,0,0,1,0,"No Entregado",0,0,1,0,{"$f":"IF(V283=\"Lima\",NETWORKDAYS.INTL(D283,M283,11,'Dias Feriados'!$A$1:$A$15),IF(AND(V283=\"provincia\",X283=\"24hrs\"),1,IF(AND(V283=\"provincia\",X283=\"48hrs\"),2,NETWORKDAYS.INTL(D283,M283,11,'Dias Feriados'!$A$1:$A$15))))","v":-39255}]
["B001667650","May","2025-05-27","2025-05-28","G/I. 030-10132",283,"PAOLA CARMEN GUERRA LUYO","AV BOLOGNESI 1203 PISCO PLAYA REF ALT COLEGIO BOTONES ROJOS","Provincia","PISCO","PISCO","B001667650",null,"En Ruta",9730017025,"F",202508,203201,"En Ruta","Dia 1","CARMEL","PROVINCIA",{"$f":"NETWORKDAYS.INTL(D284,M284,11,'Dias Feriados'!$A$1:$A$15)","v":-39255},"En Ruta",22,"NO",null,0.9375,0.94722222222222219,1,"ROMERO ACE","2025-05-28",null,null,45804,"",{"$f":"IF(AS284=\"Devuelto\",\"\",IF(X284=\"24hrs\",\"Entregado\",CONSOLIDADO!S284))","v":"En Ruta"},"",{"$f":"IF(AK284=\"Entregado\",\"\",IF(X284=\"24hrs\",\"\",IF(X284=\"48hrs\",\"Entregado\",CONSOLIDADO!S284)))","v":"En Ruta"},"",{"$f":"IF(AK284=\"Entregado\",\"\",IF(OR(X284=\"24hrs\",X284=\"48hrs\"),\"\",IF(X284=\"72hrs\",\"Entregado\",CONSOLIDADO!S284)))","v":"En Ruta"},"",{"$f":"IF(AK284=\"Entregado\",\"\",IF(OR(X284=\"24hrs\",X284=\"48hrs\",X284=\"72hrs\"),\"\",IF(X284=\"+72hrs\",\"Entregado\",CONSOLIDADO!S284)))","v":"En Ruta"},"","En Ruta",1,0,0,0,0,1,0,"No Entregado",0,0,1,0,{"$f":"IF(V284=\"Lima\",NETWORKDAYS.INTL(D284,M284,11,'Dias Feriados'!$A$1:$A$15),IF(AND(V284=\"provincia\",X284=\"24hrs\"),1,IF(AND(V284=\"provincia\",X284=\"48hrs\"),2,NETWORKDAYS.INTL(D284,M284,11,'Dias Feriados'!$A$1:$A$15))))","v":-39255}]
["B001667677","May","2025-05-27","2025-05-28","G/I. 030-10132",284,"KARINA MILAGROS FALCON JORGES","CL DOS DE MAYO 382 CENTRO DE PISCO REF FRENTE A LA CASETA DE SERENAZG","Provincia","PISCO","PISCO","B001667677",null,"En Ruta",9730017093,"F",202508,203201,"En Ruta","Dia 1","CARMEL","PROVINCIA",{"$f":"NETWORKDAYS.INTL(D285,M285,11,'Dias Feriados'!$A$1:$A$15)","v":-39255},"En Ruta",22,"NO",null,0.9375,0.94722222222222219,1,"ROMERO ACE","2025-05-28",null,null,45804,"",{"$f":"IF(AS285=\"Devuelto\",\"\",IF(X285=\"24hrs\",\"Entregado\",CONSOLIDADO!S285))","v":"En Ruta"},"",{"$f":"IF(AK285=\"Entregado\",\"\",IF(X285=\"24hrs\",\"\",IF(X285=\"48hrs\",\"Entregado\",CONSOLIDADO!S285)))","v":"En Ruta"},"",{"$f":"IF(AK285=\"Entregado\",\"\",IF(OR(X285=\"24hrs\",X285=\"48hrs\"),\"\",IF(X285=\"72hrs\",\"Entregado\",CONSOLIDADO!S285)))","v":"En Ruta"},"",{"$f":"IF(AK285=\"Entregado\",\"\",IF(OR(X285=\"24hrs\",X285=\"48hrs\",X285=\"72hrs\"),\"\",IF(X285=\"+72hrs\",\"Entregado\",CONSOLIDADO!S285)))","v":"En Ruta"},"","En Ruta",1,0,0,0,0,1,0,"No Entregado",0,0,1,0,{"$f":"IF(V285=\"Lima\",NETWORKDAYS.INTL(D285,M285,11,'Dias Feriados'!$A$1:$A$15),IF(AND(V285=\"provincia\",X285=\"24hrs\"),1,IF(AND(V285=\"provincia\",X285=\"48hrs\"),2,NETWORKDAYS.INTL(D285,M285,11,'Dias Feriados'!$A$1:$A$15))))","v":-39255}]
["B001667351","May","2025-05-27","2025-05-28","G/I. 030-10132",285,"NAEKO NOGAMI CAMPOS","AV SAN MARTN 501 1 CDR ANTES OVALO SAN MARTIN","Provincia","PISCO","PISCO","B001667351",null,"En Ruta",9730017108,"F",202508,203201,"En Ruta","Dia 1","CARMEL","PROVINCIA",{"$f":"NETWORKDAYS.INTL(D286,M286,11,'Dias Feriados'!$A$1:$A$15)","v":-39255},"En Ruta",22,"NO",null,0.9375,0.94722222222222219,1,"ROMERO ACE","2025-05-28",null,null,45804,"",{"$f":"IF(AS286=\"Devuelto\",\"\",IF(X286=\"24hrs\",\"Entregado\",CONSOLIDADO!S286))","v":"En Ruta"},"",{"$f":"IF(AK286=\"Entregado\",\"\",IF(X286=\"24hrs\",\"\",IF(X286=\"48hrs\",\"Entregado\",CONSOLIDADO!S286)))","v":"En Ruta"},"",{"$f":"IF(AK286=\"Entregado\",\"\",IF(OR(X286=\"24hrs\",X286=\"48hrs\"),\"\",IF(X286=\"72hrs\",\"Entregado\",CONSOLIDADO!S286)))","v":"En Ruta"},"",{"$f":"IF(AK286=\"Entregado\",\"\",IF(OR(X286=\"24hrs\",X286=\"48hrs\",X286=\"72hrs\"),\"\",IF(X286=\"+72hrs\",\"Entregado\",CONSOLIDADO!S286)))","v":"En Ruta"},"","En Ruta",1,0,0,0,0,1,0,"No Entregado",0,0,1,0,{"$f":"IF(V286=\"Lima\",NETWORKDAYS.INTL(D286,M286,11,'Dias Feriados'!$A$1:$A$15),IF(AND(V286=\"provincia\",X286=\"24hrs\"),1,IF(AND(V286=\"provincia\",X286=\"48hrs\"),2,NETWORKDAYS.INTL(D286,M286,11,'Dias Feriados'!$A$1:$A$15))))","v":-39255}]
["B001667584","May","2025-05-27","2025-05-28","G/I. 030-10132",286,"LILIA JANNET SALAZAR VASQUEZ","CL GENARO MEDRANO SN LT 2 MZA VILLA LA FAP PASANDO LOS JARDINES","Provincia","PISCO","PISCO","B001667584",null,"En Ruta",9730017110,"F",202508,203201,"En Ruta","Dia 1","CARMEL","PROVINCIA",{"$f":"NETWORKDAYS.INTL(D287,M287,11,'Dias Feriados'!$A$1:$A$15)","v":-39255},"En Ruta",22,"NO",null,0.9375,0.94722222222222219,1,"ROMERO ACE","2025-05-28",null,null,45804,"",{"$f":"IF(AS287=\"Devuelto\",\"\",IF(X287=\"24hrs\",\"Entregado\",CONSOLIDADO!S287))","v":"En Ruta"},"",{"$f":"IF(AK287=\"Entregado\",\"\",IF(X287=\"24hrs\",\"\",IF(X287=\"48hrs\",\"Entregado\",CONSOLIDADO!S287)))","v":"En Ruta"},"",{"$f":"IF(AK287=\"Entregado\",\"\",IF(OR(X287=\"24hrs\",X287=\"48hrs\"),\"\",IF(X287=\"72hrs\",\"Entregado\",CONSOLIDADO!S287)))","v":"En Ruta"},"",{"$f":"IF(AK287=\"Entregado\",\"\",IF(OR(X287=\"24hrs\",X287=\"48hrs\",X287=\"72hrs\"),\"\",IF(X287=\"+72hrs\",\"Entregado\",CONSOLIDADO!S287)))","v":"En Ruta"},"","En Ruta",1,0,0,0,0,1,0,"No Entregado",0,0,1,0,{"$f":"IF(V287=\"Lima\",NETWORKDAYS.INTL(D287,M287,11,'Dias Feriados'!$A$1:$A$15),IF(AND(V287=\"provincia\",X287=\"24hrs\"),1,IF(AND(V287=\"provincia\",X287=\"48hrs\"),2,NETWORKDAYS.INTL(D287,M287,11,'Dias Feriados'!$A$1:$A$15))))","v":-39255}]
["B001667651","May","2025-05-27","2025-05-28","G/I. 030-10132",287,"KARINA ARACELI MAYURI GAMBOA","MARTHA REYES 158 REF PISCO PUEBLO","Provincia","PISCO","PISCO","B001667651",null,"En Ruta",9730017111,"F",202508,203201,"En Ruta","Dia 1","CARMEL","PROVINCIA",{"$f":"NETWORKDAYS.INTL(D288,M288,11,'Dias Feriados'!$A$1:$A$15)","v":-39255},"En Ruta",22,"NO",null,0.9375,0.94722222222222219,1,"ROMERO ACE","2025-05-28",null,null,45804,"",{"$f":"IF(AS288=\"Devuelto\",\"\",IF(X288=\"24hrs\",\"Entregado\",CONSOLIDADO!S288))","v":"En Ruta"},"",{"$f":"IF(AK288=\"Entregado\",\"\",IF(X288=\"24hrs\",\"\",IF(X288=\"48hrs\",\"Entregado\",CONSOLIDADO!S288)))","v":"En Ruta"},"",{"$f":"IF(AK288=\"Entregado\",\"\",IF(OR(X288=\"24hrs\",X288=\"48hrs\"),\"\",IF(X288=\"72hrs\",\"Entregado\",CONSOLIDADO!S288)))","v":"En Ruta"},"",{"$f":"IF(AK288=\"Entregado\",\"\",IF(OR(X288=\"24hrs\",X288=\"48hrs\",X288=\"72hrs\"),\"\",IF(X288=\"+72hrs\",\"Entregado\",CONSOLIDADO!S288)))","v":"En Ruta"},"","En Ruta",1,0,0,0,0,1,0,"No Entregado",0,0,1,0,{"$f":"IF(V288=\"Lima\",NETWORKDAYS.INTL(D288,M288,11,'Dias Feriados'!$A$1:$A$15),IF(AND(V288=\"provincia\",X288=\"24hrs\"),1,IF(AND(V288=\"provincia\",X288=\"48hrs\"),2,NETWORKDAYS.INTL(D288,M288,11,'Dias Feriados'!$A$1:$A$15))))","v":-39255}]
["B001667342","May","2025-05-27","2025-05-28","G/I. 030-10132",288,"ANA CLAUDIA DONAYRE MARTINEZ","CL MARQUEZ DE MANCERA 356 PISCO COLEGIO SIMON BOLIVAR","Provincia","PISCO","PISCO","B001667342",null,"En Ruta",9730017116,"F",202508,203201,"En Ruta","Dia 1","CARMEL","PROVINCIA",{"$f":"NETWORKDAYS.INTL(D289,M289,11,'Dias Feriados'!$A$1:$A$15)","v":-39255},"En Ruta",22,"NO",null,0.9375,0.94722222222222219,1,"ROMERO ACE","2025-05-28",null,null,45804,"",{"$f":"IF(AS289=\"Devuelto\",\"\",IF(X289=\"24hrs\",\"Entregado\",CONSOLIDADO!S289))","v":"En Ruta"},"",{"$f":"IF(AK289=\"Entregado\",\"\",IF(X289=\"24hrs\",\"\",IF(X289=\"48hrs\",\"Entregado\",CONSOLIDADO!S289)))","v":"En Ruta"},"",{"$f":"IF(AK289=\"Entregado\",\"\",IF(OR(X289=\"24hrs\",X289=\"48hrs\"),\"\",IF(X289=\"72hrs\",\"Entregado\",CONSOLIDADO!S289)))","v":"En Ruta"},"",{"$f":"IF(AK289=\"Entregado\",\"\",IF(OR(X289=\"24hrs\",X289=\"48hrs\",X289=\"72hrs\"),\"\",IF(X289=\"+72hrs\",\"Entregado\",CONSOLIDADO!S289)))","v":"En Ruta"},"","En Ruta",1,0,0,0,0,1,0,"No Entregado",0,0,1,0,{"$f":"IF(V289=\"Lima\",NETWORKDAYS.INTL(D289,M289,11,'Dias Feriados'!$A$1:$A$15),IF(AND(V289=\"provincia\",X289=\"24hrs\"),1,IF(AND(V289=\"provincia\",X289=\"48hrs\"),2,NETWORKDAYS.INTL(D289,M289,11,'Dias Feriados'!$A$1:$A$15))))","v":-39255}]
["B001667724","May","2025-05-27","2025-05-28","G/I. 030-10132",289,"CARMEN ROSARIO AYALA IVALA","URB SAN ALBERTO MZR LT 7 PAR ZONAL PISCO","Provincia","PISCO","PISCO","B001667724",null,"En Ruta",9730017119,"F",202508,203201,"En Ruta","Dia 1","CARMEL","PROVINCIA",{"$f":"NETWORKDAYS.INTL(D290,M290,11,'Dias Feriados'!$A$1:$A$15)","v":-39255},"En Ruta",22,"NO",null,0.9375,0.94722222222222219,1,"ROMERO ACE","2025-05-28",null,null,45804,"",{"$f":"IF(AS290=\"Devuelto\",\"\",IF(X290=\"24hrs\",\"Entregado\",CONSOLIDADO!S290))","v":"En Ruta"},"",{"$f":"IF(AK290=\"Entregado\",\"\",IF(X290=\"24hrs\",\"\",IF(X290=\"48hrs\",\"Entregado\",CONSOLIDADO!S290)))","v":"En Ruta"},"",{"$f":"IF(AK290=\"Entregado\",\"\",IF(OR(X290=\"24hrs\",X290=\"48hrs\"),\"\",IF(X290=\"72hrs\",\"Entregado\",CONSOLIDADO!S290)))","v":"En Ruta"},"",{"$f":"IF(AK290=\"Entregado\",\"\",IF(OR(X290=\"24hrs\",X290=\"48hrs\",X290=\"72hrs\"),\"\",IF(X290=\"+72hrs\",\"Entregado\",CONSOLIDADO!S290)))","v":"En Ruta"},"","En Ruta",1,0,0,0,0,1,0,"No Entregado",0,0,1,0,{"$f":"IF(V290=\"Lima\",NETWORKDAYS.INTL(D290,M290,11,'Dias Feriados'!$A$1:$A$15),IF(AND(V290=\"provincia\",X290=\"24hrs\"),1,IF(AND(V290=\"provincia\",X290=\"48hrs\"),2,NETWORKDAYS.INTL(D290,M290,11,'Dias Feriados'!$A$1:$A$15))))","v":-39255}]
["B001667678","May","2025-05-27","2025-05-28","G/I. 030-10132",290,"CARMEN LUISA AMADO FLORES DE C","CLL CALLAO 222 2PS PLZ DE ARMAS HOTEL CANDELABRO","Provincia","PISCO","PISCO","B001667678",null,"En Ruta",9730017146,"F",202508,203201,"En Ruta","Dia 1","CARMEL","PROVINCIA",{"$f":"NETWORKDAYS.INTL(D291,M291,11,'Dias Feriados'!$A$1:$A$15)","v":-39255},"En Ruta",22,"NO",null,0.9375,0.94722222222222219,1,"ROMERO ACE","2025-05-28",null,null,45804,"",{"$f":"IF(AS291=\"Devuelto\",\"\",IF(X291=\"24hrs\",\"Entregado\",CONSOLIDADO!S291))","v":"En Ruta"},"",{"$f":"IF(AK291=\"Entregado\",\"\",IF(X291=\"24hrs\",\"\",IF(X291=\"48hrs\",\"Entregado\",CONSOLIDADO!S291)))","v":"En Ruta"},"",{"$f":"IF(AK291=\"Entregado\",\"\",IF(OR(X291=\"24hrs\",X291=\"48hrs\"),\"\",IF(X291=\"72hrs\",\"Entregado\",CONSOLIDADO!S291)))","v":"En Ruta"},"",{"$f":"IF(AK291=\"Entregado\",\"\",IF(OR(X291=\"24hrs\",X291=\"48hrs\",X291=\"72hrs\"),\"\",IF(X291=\"+72hrs\",\"Entregado\",CONSOLIDADO!S291)))","v":"En Ruta"},"","En Ruta",1,0,0,0,0,1,0,"No Entregado",0,0,1,0,{"$f":"IF(V291=\"Lima\",NETWORKDAYS.INTL(D291,M291,11,'Dias Feriados'!$A$1:$A$15),IF(AND(V291=\"provincia\",X291=\"24hrs\"),1,IF(AND(V291=\"provincia\",X291=\"48hrs\"),2,NETWORKDAYS.INTL(D291,M291,11,'Dias Feriados'!$A$1:$A$15))))","v":-39255}]
["B001667959","May","2025-05-27","2025-05-28","G/I. 030-10132",291,"TERESA TOVAR DEPINEDO","CL MARTHA REYES 206 ESP DEL BOSQUE CENTRO DE PISXI","Provincia","PISCO","PISCO","B001667959",null,"En Ruta",9730017222,"F",202508,203201,"En Ruta","Dia 1","CARMEL","PROVINCIA",{"$f":"NETWORKDAYS.INTL(D292,M292,11,'Dias Feriados'!$A$1:$A$15)","v":-39255},"En Ruta",22,"NO",null,0.9375,0.94722222222222219,1,"ROMERO ACE","2025-05-28",null,null,45804,"",{"$f":"IF(AS292=\"Devuelto\",\"\",IF(X292=\"24hrs\",\"Entregado\",CONSOLIDADO!S292))","v":"En Ruta"},"",{"$f":"IF(AK292=\"Entregado\",\"\",IF(X292=\"24hrs\",\"\",IF(X292=\"48hrs\",\"Entregado\",CONSOLIDADO!S292)))","v":"En Ruta"},"",{"$f":"IF(AK292=\"Entregado\",\"\",IF(OR(X292=\"24hrs\",X292=\"48hrs\"),\"\",IF(X292=\"72hrs\",\"Entregado\",CONSOLIDADO!S292)))","v":"En Ruta"},"",{"$f":"IF(AK292=\"Entregado\",\"\",IF(OR(X292=\"24hrs\",X292=\"48hrs\",X292=\"72hrs\"),\"\",IF(X292=\"+72hrs\",\"Entregado\",CONSOLIDADO!S292)))","v":"En Ruta"},"","En Ruta",1,0,0,0,0,1,0,"No Entregado",0,0,1,0,{"$f":"IF(V292=\"Lima\",NETWORKDAYS.INTL(D292,M292,11,'Dias Feriados'!$A$1:$A$15),IF(AND(V292=\"provincia\",X292=\"24hrs\"),1,IF(AND(V292=\"provincia\",X292=\"48hrs\"),2,NETWORKDAYS.INTL(D292,M292,11,'Dias Feriados'!$A$1:$A$15))))","v":-39255}]
["B001668293","May","2025-05-27","2025-05-28","G/I. 030-10132",292,"MARIA ELENA TORRES CARRIZALES","MZ 44 LT 803 A ESPALDAS DE FABRICA SACOSPISCO URB RENACER","Provincia","PISCO","PISCO","B001668293",null,"En Ruta",9730017225,"F",202508,203201,"En Ruta","Dia 1","CARMEL","PROVINCIA",{"$f":"NETWORKDAYS.INTL(D293,M293,11,'Dias Feriados'!$A$1:$A$15)","v":-39255},"En Ruta",22,"NO",null,0.9375,0.94722222222222219,1,"ROMERO ACE","2025-05-28",null,null,45804,"",{"$f":"IF(AS293=\"Devuelto\",\"\",IF(X293=\"24hrs\",\"Entregado\",CONSOLIDADO!S293))","v":"En Ruta"},"",{"$f":"IF(AK293=\"Entregado\",\"\",IF(X293=\"24hrs\",\"\",IF(X293=\"48hrs\",\"Entregado\",CONSOLIDADO!S293)))","v":"En Ruta"},"",{"$f":"IF(AK293=\"Entregado\",\"\",IF(OR(X293=\"24hrs\",X293=\"48hrs\"),\"\",IF(X293=\"72hrs\",\"Entregado\",CONSOLIDADO!S293)))","v":"En Ruta"},"",{"$f":"IF(AK293=\"Entregado\",\"\",IF(OR(X293=\"24hrs\",X293=\"48hrs\",X293=\"72hrs\"),\"\",IF(X293=\"+72hrs\",\"Entregado\",CONSOLIDADO!S293)))","v":"En Ruta"},"","En Ruta",1,0,0,0,0,1,0,"No Entregado",0,0,1,0,{"$f":"IF(V293=\"Lima\",NETWORKDAYS.INTL(D293,M293,11,'Dias Feriados'!$A$1:$A$15),IF(AND(V293=\"provincia\",X293=\"24hrs\"),1,IF(AND(V293=\"provincia\",X293=\"48hrs\"),2,NETWORKDAYS.INTL(D293,M293,11,'Dias Feriados'!$A$1:$A$15))))","v":-39255}]
["B001667756","May","2025-05-27","2025-05-28","G/I. 030-10132",293,"CARLA VANESSA CALDERON CANELO","CL GUILLERMO QUINONEZ 451 AV AMERICAS ANTES COL SAN MARTIN","Provincia","PISCO","PISCO","B001667756",null,"En Ruta",9730017246,"F",202508,203201,"En Ruta","Dia 1","CARMEL","PROVINCIA",{"$f":"NETWORKDAYS.INTL(D294,M294,11,'Dias Feriados'!$A$1:$A$15)","v":-39255},"En Ruta",22,"NO",null,0.9375,0.94722222222222219,1,"ROMERO ACE","2025-05-28",null,null,45804,"",{"$f":"IF(AS294=\"Devuelto\",\"\",IF(X294=\"24hrs\",\"Entregado\",CONSOLIDADO!S294))","v":"En Ruta"},"",{"$f":"IF(AK294=\"Entregado\",\"\",IF(X294=\"24hrs\",\"\",IF(X294=\"48hrs\",\"Entregado\",CONSOLIDADO!S294)))","v":"En Ruta"},"",{"$f":"IF(AK294=\"Entregado\",\"\",IF(OR(X294=\"24hrs\",X294=\"48hrs\"),\"\",IF(X294=\"72hrs\",\"Entregado\",CONSOLIDADO!S294)))","v":"En Ruta"},"",{"$f":"IF(AK294=\"Entregado\",\"\",IF(OR(X294=\"24hrs\",X294=\"48hrs\",X294=\"72hrs\"),\"\",IF(X294=\"+72hrs\",\"Entregado\",CONSOLIDADO!S294)))","v":"En Ruta"},"","En Ruta",1,0,0,0,0,1,0,"No Entregado",0,0,1,0,{"$f":"IF(V294=\"Lima\",NETWORKDAYS.INTL(D294,M294,11,'Dias Feriados'!$A$1:$A$15),IF(AND(V294=\"provincia\",X294=\"24hrs\"),1,IF(AND(V294=\"provincia\",X294=\"48hrs\"),2,NETWORKDAYS.INTL(D294,M294,11,'Dias Feriados'!$A$1:$A$15))))","v":-39255}]
["B001667661","May","2025-05-27","2025-05-28","G/I. 030-10132",294,"GLORIA EMILY UCHUYA MARTINEZ","PROLONGACION INDEPENDENCIA 910 LA ESPERANZA POR LAS CAMARAS DE SEGURIDAD","Provincia","PISCO","PISCO","B001667661",null,"En Ruta",9730017258,"F",202508,203201,"En Ruta","Dia 1","CARMEL","PROVINCIA",{"$f":"NETWORKDAYS.INTL(D295,M295,11,'Dias Feriados'!$A$1:$A$15)","v":-39255},"En Ruta",22,"NO",null,0.9375,0.94722222222222219,1,"ROMERO ACE","2025-05-28",null,null,45804,"",{"$f":"IF(AS295=\"Devuelto\",\"\",IF(X295=\"24hrs\",\"Entregado\",CONSOLIDADO!S295))","v":"En Ruta"},"",{"$f":"IF(AK295=\"Entregado\",\"\",IF(X295=\"24hrs\",\"\",IF(X295=\"48hrs\",\"Entregado\",CONSOLIDADO!S295)))","v":"En Ruta"},"",{"$f":"IF(AK295=\"Entregado\",\"\",IF(OR(X295=\"24hrs\",X295=\"48hrs\"),\"\",IF(X295=\"72hrs\",\"Entregado\",CONSOLIDADO!S295)))","v":"En Ruta"},"",{"$f":"IF(AK295=\"Entregado\",\"\",IF(OR(X295=\"24hrs\",X295=\"48hrs\",X295=\"72hrs\"),\"\",IF(X295=\"+72hrs\",\"Entregado\",CONSOLIDADO!S295)))","v":"En Ruta"},"","En Ruta",1,0,0,0,0,1,0,"No Entregado",0,0,1,0,{"$f":"IF(V295=\"Lima\",NETWORKDAYS.INTL(D295,M295,11,'Dias Feriados'!$A$1:$A$15),IF(AND(V295=\"provincia\",X295=\"24hrs\"),1,IF(AND(V295=\"provincia\",X295=\"48hrs\"),2,NETWORKDAYS.INTL(D295,M295,11,'Dias Feriados'!$A$1:$A$15))))","v":-39255}]
["B001667470","May","2025-05-27","2025-05-28","G/I. 030-10132",295,"CESAR JESUS ANDRADE VARGAS","CALLE SAN JOSE 159 POR LA CEVICHERIA EL RINCON PERUCHO CALLE SAN JOSE","Provincia","PISCO","PISCO","B001667470",null,"En Ruta",9730017320,"F",202508,203201,"En Ruta","Dia 1","CARMEL","PROVINCIA",{"$f":"NETWORKDAYS.INTL(D296,M296,11,'Dias Feriados'!$A$1:$A$15)","v":-39255},"En Ruta",22,"NO",null,0.9375,0.94722222222222219,1,"ROMERO ACE","2025-05-28",null,null,45804,"",{"$f":"IF(AS296=\"Devuelto\",\"\",IF(X296=\"24hrs\",\"Entregado\",CONSOLIDADO!S296))","v":"En Ruta"},"",{"$f":"IF(AK296=\"Entregado\",\"\",IF(X296=\"24hrs\",\"\",IF(X296=\"48hrs\",\"Entregado\",CONSOLIDADO!S296)))","v":"En Ruta"},"",{"$f":"IF(AK296=\"Entregado\",\"\",IF(OR(X296=\"24hrs\",X296=\"48hrs\"),\"\",IF(X296=\"72hrs\",\"Entregado\",CONSOLIDADO!S296)))","v":"En Ruta"},"",{"$f":"IF(AK296=\"Entregado\",\"\",IF(OR(X296=\"24hrs\",X296=\"48hrs\",X296=\"72hrs\"),\"\",IF(X296=\"+72hrs\",\"Entregado\",CONSOLIDADO!S296)))","v":"En Ruta"},"","En Ruta",1,0,0,0,0,1,0,"No Entregado",0,0,1,0,{"$f":"IF(V296=\"Lima\",NETWORKDAYS.INTL(D296,M296,11,'Dias Feriados'!$A$1:$A$15),IF(AND(V296=\"provincia\",X296=\"24hrs\"),1,IF(AND(V296=\"provincia\",X296=\"48hrs\"),2,NETWORKDAYS.INTL(D296,M296,11,'Dias Feriados'!$A$1:$A$15))))","v":-39255}]
["B001667573","May","2025-05-27","2025-05-28","G/I. 030-10132",296,"CLAUDIA RAQUEL MONTANEZ CANCIN","CL PROGRESO 325 HOSTAL LOS FLAMENCOSREF 2 CUADRAS PLAZA DE ARMAS 2 CUADRAS PLAZA DE ARMAS","Provincia","PISCO","PISCO","B001667573",null,"En Ruta",9730017336,"F",202508,203201,"En Ruta","Dia 1","CARMEL","PROVINCIA",{"$f":"NETWORKDAYS.INTL(D297,M297,11,'Dias Feriados'!$A$1:$A$15)","v":-39255},"En Ruta",22,"NO",null,0.9375,0.94722222222222219,1,"ROMERO ACE","2025-05-28",null,null,45804,"",{"$f":"IF(AS297=\"Devuelto\",\"\",IF(X297=\"24hrs\",\"Entregado\",CONSOLIDADO!S297))","v":"En Ruta"},"",{"$f":"IF(AK297=\"Entregado\",\"\",IF(X297=\"24hrs\",\"\",IF(X297=\"48hrs\",\"Entregado\",CONSOLIDADO!S297)))","v":"En Ruta"},"",{"$f":"IF(AK297=\"Entregado\",\"\",IF(OR(X297=\"24hrs\",X297=\"48hrs\"),\"\",IF(X297=\"72hrs\",\"Entregado\",CONSOLIDADO!S297)))","v":"En Ruta"},"",{"$f":"IF(AK297=\"Entregado\",\"\",IF(OR(X297=\"24hrs\",X297=\"48hrs\",X297=\"72hrs\"),\"\",IF(X297=\"+72hrs\",\"Entregado\",CONSOLIDADO!S297)))","v":"En Ruta"},"","En Ruta",1,0,0,0,0,1,0,"No Entregado",0,0,1,0,{"$f":"IF(V297=\"Lima\",NETWORKDAYS.INTL(D297,M297,11,'Dias Feriados'!$A$1:$A$15),IF(AND(V297=\"provincia\",X297=\"24hrs\"),1,IF(AND(V297=\"provincia\",X297=\"48hrs\"),2,NETWORKDAYS.INTL(D297,M297,11,'Dias Feriados'!$A$1:$A$15))))","v":-39255}]
["B001667758","May","2025-05-27","2025-05-28","G/I. 030-10132",297,"JENNY EDITH ARIAS NEYRA","URB TERRA BLANCA I 17 ULTIMA CUADRA AV JHON F KENNEDY","Provincia","PISCO","PISCO","B001667758",null,"En Ruta",9730017345,"F",202508,203201,"En Ruta","Dia 1","CARMEL","PROVINCIA",{"$f":"NETWORKDAYS.INTL(D298,M298,11,'Dias Feriados'!$A$1:$A$15)","v":-39255},"En Ruta",22,"NO",null,0.9375,0.94722222222222219,1,"ROMERO ACE","2025-05-28",null,null,45804,"",{"$f":"IF(AS298=\"Devuelto\",\"\",IF(X298=\"24hrs\",\"Entregado\",CONSOLIDADO!S298))","v":"En Ruta"},"",{"$f":"IF(AK298=\"Entregado\",\"\",IF(X298=\"24hrs\",\"\",IF(X298=\"48hrs\",\"Entregado\",CONSOLIDADO!S298)))","v":"En Ruta"},"",{"$f":"IF(AK298=\"Entregado\",\"\",IF(OR(X298=\"24hrs\",X298=\"48hrs\"),\"\",IF(X298=\"72hrs\",\"Entregado\",CONSOLIDADO!S298)))","v":"En Ruta"},"",{"$f":"IF(AK298=\"Entregado\",\"\",IF(OR(X298=\"24hrs\",X298=\"48hrs\",X298=\"72hrs\"),\"\",IF(X298=\"+72hrs\",\"Entregado\",CONSOLIDADO!S298)))","v":"En Ruta"},"","En Ruta",1,0,0,0,0,1,0,"No Entregado",0,0,1,0,{"$f":"IF(V298=\"Lima\",NETWORKDAYS.INTL(D298,M298,11,'Dias Feriados'!$A$1:$A$15),IF(AND(V298=\"provincia\",X298=\"24hrs\"),1,IF(AND(V298=\"provincia\",X298=\"48hrs\"),2,NETWORKDAYS.INTL(D298,M298,11,'Dias Feriados'!$A$1:$A$15))))","v":-39255}]
["B001667459","May","2025-05-27","2025-05-28","G/I. 030-10132",298,"CLAUDIA PAOLA SIGUAS BERNAOLA","ASOC SAN PEDRO MZ E LT 25 REF POR LA LOSA","Provincia","PISCO","PISCO","B001667459",null,"En Ruta",9730017377,"F",202508,203201,"En Ruta","Dia 1","CARMEL","PROVINCIA",{"$f":"NETWORKDAYS.INTL(D299,M299,11,'Dias Feriados'!$A$1:$A$15)","v":-39255},"En Ruta",22,"NO",null,0.9375,0.94722222222222219,1,"ROMERO ACE","2025-05-28",null,null,45804,"",{"$f":"IF(AS299=\"Devuelto\",\"\",IF(X299=\"24hrs\",\"Entregado\",CONSOLIDADO!S299))","v":"En Ruta"},"",{"$f":"IF(AK299=\"Entregado\",\"\",IF(X299=\"24hrs\",\"\",IF(X299=\"48hrs\",\"Entregado\",CONSOLIDADO!S299)))","v":"En Ruta"},"",{"$f":"IF(AK299=\"Entregado\",\"\",IF(OR(X299=\"24hrs\",X299=\"48hrs\"),\"\",IF(X299=\"72hrs\",\"Entregado\",CONSOLIDADO!S299)))","v":"En Ruta"},"",{"$f":"IF(AK299=\"Entregado\",\"\",IF(OR(X299=\"24hrs\",X299=\"48hrs\",X299=\"72hrs\"),\"\",IF(X299=\"+72hrs\",\"Entregado\",CONSOLIDADO!S299)))","v":"En Ruta"},"","En Ruta",1,0,0,0,0,1,0,"No Entregado",0,0,1,0,{"$f":"IF(V299=\"Lima\",NETWORKDAYS.INTL(D299,M299,11,'Dias Feriados'!$A$1:$A$15),IF(AND(V299=\"provincia\",X299=\"24hrs\"),1,IF(AND(V299=\"provincia\",X299=\"48hrs\"),2,NETWORKDAYS.INTL(D299,M299,11,'Dias Feriados'!$A$1:$A$15))))","v":-39255}]
["B001667596","May","2025-05-27","2025-05-28","G/I. 030-10132",299,"DHESLY CAROLINA CASTILLO","COMERCIO 820 POR TIENDA PRECIO UNO","Provincia","PISCO","PISCO","B001667596",null,"En Ruta",9730017382,"F",202508,203201,"En Ruta","Dia 1","CARMEL","PROVINCIA",{"$f":"NETWORKDAYS.INTL(D300,M300,11,'Dias Feriados'!$A$1:$A$15)","v":-39255},"En Ruta",22,"NO",null,0.9375,0.94722222222222219,1,"ROMERO ACE","2025-05-28",null,null,45804,"",{"$f":"IF(AS300=\"Devuelto\",\"\",IF(X300=\"24hrs\",\"Entregado\",CONSOLIDADO!S300))","v":"En Ruta"},"",{"$f":"IF(AK300=\"Entregado\",\"\",IF(X300=\"24hrs\",\"\",IF(X300=\"48hrs\",\"Entregado\",CONSOLIDADO!S300)))","v":"En Ruta"},"",{"$f":"IF(AK300=\"Entregado\",\"\",IF(OR(X300=\"24hrs\",X300=\"48hrs\"),\"\",IF(X300=\"72hrs\",\"Entregado\",CONSOLIDADO!S300)))","v":"En Ruta"},"",{"$f":"IF(AK300=\"Entregado\",\"\",IF(OR(X300=\"24hrs\",X300=\"48hrs\",X300=\"72hrs\"),\"\",IF(X300=\"+72hrs\",\"Entregado\",CONSOLIDADO!S300)))","v":"En Ruta"},"","En Ruta",1,0,0,0,0,1,0,"No Entregado",0,0,1,0,{"$f":"IF(V300=\"Lima\",NETWORKDAYS.INTL(D300,M300,11,'Dias Feriados'!$A$1:$A$15),IF(AND(V300=\"provincia\",X300=\"24hrs\"),1,IF(AND(V300=\"provincia\",X300=\"48hrs\"),2,NETWORKDAYS.INTL(D300,M300,11,'Dias Feriados'!$A$1:$A$15))))","v":-39255}]
["B001667514","May","2025-05-27","2025-05-28","G/I. 030-10132",300,"ROSA MIRANDA LOPEZ","AAHH MEDRANO MZ B LT 17 ESPALDAS INSTITUTO TECNOLOGICO","Provincia","PISCO","PISCO","B001667514",null,"En Ruta",9730017425,"F",202508,203201,"En Ruta","Dia 1","CARMEL","PROVINCIA",{"$f":"NETWORKDAYS.INTL(D301,M301,11,'Dias Feriados'!$A$1:$A$15)","v":-39255},"En Ruta",22,"NO",null,0.9375,0.94722222222222219,1,"ROMERO ACE","2025-05-28",null,null,45804,"",{"$f":"IF(AS301=\"Devuelto\",\"\",IF(X301=\"24hrs\",\"Entregado\",CONSOLIDADO!S301))","v":"En Ruta"},"",{"$f":"IF(AK301=\"Entregado\",\"\",IF(X301=\"24hrs\",\"\",IF(X301=\"48hrs\",\"Entregado\",CONSOLIDADO!S301)))","v":"En Ruta"},"",{"$f":"IF(AK301=\"Entregado\",\"\",IF(OR(X301=\"24hrs\",X301=\"48hrs\"),\"\",IF(X301=\"72hrs\",\"Entregado\",CONSOLIDADO!S301)))","v":"En Ruta"},"",{"$f":"IF(AK301=\"Entregado\",\"\",IF(OR(X301=\"24hrs\",X301=\"48hrs\",X301=\"72hrs\"),\"\",IF(X301=\"+72hrs\",\"Entregado\",CONSOLIDADO!S301)))","v":"En Ruta"},"","En Ruta",1,0,0,0,0,1,0,"No Entregado",0,0,1,0,{"$f":"IF(V301=\"Lima\",NETWORKDAYS.INTL(D301,M301,11,'Dias Feriados'!$A$1:$A$15),IF(AND(V301=\"provincia\",X301=\"24hrs\"),1,IF(AND(V301=\"provincia\",X301=\"48hrs\"),2,NETWORKDAYS.INTL(D301,M301,11,'Dias Feriados'!$A$1:$A$15))))","v":-39255}]
["B001667710","May","2025-05-27","2025-05-28","G/I. 030-10132",301,"NELLY ESTHER ARROYO PIZARRO","AV BOLOGNESI 492 RECTA DEL COL SANTA LUISA DE MARILLA","Provincia","PISCO","PISCO","B001667710",null,"En Ruta",9730017449,"F",202508,203201,"En Ruta","Dia 1","CARMEL","PROVINCIA",{"$f":"NETWORKDAYS.INTL(D302,M302,11,'Dias Feriados'!$A$1:$A$15)","v":-39255},"En Ruta",22,"NO",null,0.9375,0.94722222222222219,1,"ROMERO ACE","2025-05-28",null,null,45804,"",{"$f":"IF(AS302=\"Devuelto\",\"\",IF(X302=\"24hrs\",\"Entregado\",CONSOLIDADO!S302))","v":"En Ruta"},"",{"$f":"IF(AK302=\"Entregado\",\"\",IF(X302=\"24hrs\",\"\",IF(X302=\"48hrs\",\"Entregado\",CONSOLIDADO!S302)))","v":"En Ruta"},"",{"$f":"IF(AK302=\"Entregado\",\"\",IF(OR(X302=\"24hrs\",X302=\"48hrs\"),\"\",IF(X302=\"72hrs\",\"Entregado\",CONSOLIDADO!S302)))","v":"En Ruta"},"",{"$f":"IF(AK302=\"Entregado\",\"\",IF(OR(X302=\"24hrs\",X302=\"48hrs\",X302=\"72hrs\"),\"\",IF(X302=\"+72hrs\",\"Entregado\",CONSOLIDADO!S302)))","v":"En Ruta"},"","En Ruta",1,0,0,0,0,1,0,"No Entregado",0,0,1,0,{"$f":"IF(V302=\"Lima\",NETWORKDAYS.INTL(D302,M302,11,'Dias Feriados'!$A$1:$A$15),IF(AND(V302=\"provincia\",X302=\"24hrs\"),1,IF(AND(V302=\"provincia\",X302=\"48hrs\"),2,NETWORKDAYS.INTL(D302,M302,11,'Dias Feriados'!$A$1:$A$15))))","v":-39255}]
["B001667726","May","2025-05-27","2025-05-28","G/I. 030-10132",302,"JUANA ELVIRA DE LA CRUZ GARCIA","CL PEDEMONTE 825 INTC MEDIA CDRA AUTOP LAS AMERICAS","Provincia","PISCO","PISCO","B001667726",null,"En Ruta",9730017502,"F",202508,203201,"En Ruta","Dia 1","CARMEL","PROVINCIA",{"$f":"NETWORKDAYS.INTL(D303,M303,11,'Dias Feriados'!$A$1:$A$15)","v":-39255},"En Ruta",22,"NO",null,0.9375,0.94722222222222219,1,"ROMERO ACE","2025-05-28",null,null,45804,"",{"$f":"IF(AS303=\"Devuelto\",\"\",IF(X303=\"24hrs\",\"Entregado\",CONSOLIDADO!S303))","v":"En Ruta"},"",{"$f":"IF(AK303=\"Entregado\",\"\",IF(X303=\"24hrs\",\"\",IF(X303=\"48hrs\",\"Entregado\",CONSOLIDADO!S303)))","v":"En Ruta"},"",{"$f":"IF(AK303=\"Entregado\",\"\",IF(OR(X303=\"24hrs\",X303=\"48hrs\"),\"\",IF(X303=\"72hrs\",\"Entregado\",CONSOLIDADO!S303)))","v":"En Ruta"},"",{"$f":"IF(AK303=\"Entregado\",\"\",IF(OR(X303=\"24hrs\",X303=\"48hrs\",X303=\"72hrs\"),\"\",IF(X303=\"+72hrs\",\"Entregado\",CONSOLIDADO!S303)))","v":"En Ruta"},"","En Ruta",1,0,0,0,0,1,0,"No Entregado",0,0,1,0,{"$f":"IF(V303=\"Lima\",NETWORKDAYS.INTL(D303,M303,11,'Dias Feriados'!$A$1:$A$15),IF(AND(V303=\"provincia\",X303=\"24hrs\"),1,IF(AND(V303=\"provincia\",X303=\"48hrs\"),2,NETWORKDAYS.INTL(D303,M303,11,'Dias Feriados'!$A$1:$A$15))))","v":-39255}]
["B001667735","May","2025-05-27","2025-05-28","G/I. 030-10132",303,"ANA YSABEL NOA CARTAGENA","CONDE MONCLOVA 271 POR LA TIENDA LOS 3 MELLIZOS CONDE MONCLOVA","Provincia","PISCO","PISCO","B001667735",null,"En Ruta",9730017569,"F",202508,203201,"En Ruta","Dia 1","CARMEL","PROVINCIA",{"$f":"NETWORKDAYS.INTL(D304,M304,11,'Dias Feriados'!$A$1:$A$15)","v":-39255},"En Ruta",22,"NO",null,0.9375,0.94722222222222219,1,"ROMERO ACE","2025-05-28",null,null,45804,"",{"$f":"IF(AS304=\"Devuelto\",\"\",IF(X304=\"24hrs\",\"Entregado\",CONSOLIDADO!S304))","v":"En Ruta"},"",{"$f":"IF(AK304=\"Entregado\",\"\",IF(X304=\"24hrs\",\"\",IF(X304=\"48hrs\",\"Entregado\",CONSOLIDADO!S304)))","v":"En Ruta"},"",{"$f":"IF(AK304=\"Entregado\",\"\",IF(OR(X304=\"24hrs\",X304=\"48hrs\"),\"\",IF(X304=\"72hrs\",\"Entregado\",CONSOLIDADO!S304)))","v":"En Ruta"},"",{"$f":"IF(AK304=\"Entregado\",\"\",IF(OR(X304=\"24hrs\",X304=\"48hrs\",X304=\"72hrs\"),\"\",IF(X304=\"+72hrs\",\"Entregado\",CONSOLIDADO!S304)))","v":"En Ruta"},"","En Ruta",1,0,0,0,0,1,0,"No Entregado",0,0,1,0,{"$f":"IF(V304=\"Lima\",NETWORKDAYS.INTL(D304,M304,11,'Dias Feriados'!$A$1:$A$15),IF(AND(V304=\"provincia\",X304=\"24hrs\"),1,IF(AND(V304=\"provincia\",X304=\"48hrs\"),2,NETWORKDAYS.INTL(D304,M304,11,'Dias Feriados'!$A$1:$A$15))))","v":-39255}]
["B001667341","May","2025-05-27","2025-05-28","G/I. 030-10132",304,"FLAVIA FERNANDA TIJERO HERRERA","URB BEATITA DE HUMAY 656 A 1 CDRA DE GRUTA VIRGEN DE CHAPI","Provincia","PISCO","PISCO","B001667341",null,"En Ruta",9730017590,"F",202508,203201,"En Ruta","Dia 1","CARMEL","PROVINCIA",{"$f":"NETWORKDAYS.INTL(D305,M305,11,'Dias Feriados'!$A$1:$A$15)","v":-39255},"En Ruta",22,"NO",null,0.9375,0.94722222222222219,1,"ROMERO ACE","2025-05-28",null,null,45804,"",{"$f":"IF(AS305=\"Devuelto\",\"\",IF(X305=\"24hrs\",\"Entregado\",CONSOLIDADO!S305))","v":"En Ruta"},"",{"$f":"IF(AK305=\"Entregado\",\"\",IF(X305=\"24hrs\",\"\",IF(X305=\"48hrs\",\"Entregado\",CONSOLIDADO!S305)))","v":"En Ruta"},"",{"$f":"IF(AK305=\"Entregado\",\"\",IF(OR(X305=\"24hrs\",X305=\"48hrs\"),\"\",IF(X305=\"72hrs\",\"Entregado\",CONSOLIDADO!S305)))","v":"En Ruta"},"",{"$f":"IF(AK305=\"Entregado\",\"\",IF(OR(X305=\"24hrs\",X305=\"48hrs\",X305=\"72hrs\"),\"\",IF(X305=\"+72hrs\",\"Entregado\",CONSOLIDADO!S305)))","v":"En Ruta"},"","En Ruta",1,0,0,0,0,1,0,"No Entregado",0,0,1,0,{"$f":"IF(V305=\"Lima\",NETWORKDAYS.INTL(D305,M305,11,'Dias Feriados'!$A$1:$A$15),IF(AND(V305=\"provincia\",X305=\"24hrs\"),1,IF(AND(V305=\"provincia\",X305=\"48hrs\"),2,NETWORKDAYS.INTL(D305,M305,11,'Dias Feriados'!$A$1:$A$15))))","v":-39255}]
["B001667739","May","2025-05-27","2025-05-28","G/I. 030-10132",305,"KARINA GISELLA GUERRERO ESCATE","ASOC SAN PEDRO MZ O LT 6 FRENTE ALA LOZA DEPORTIVA","Provincia","PISCO","PISCO","B001667739",null,"En Ruta",9730017594,"F",202508,203201,"En Ruta","Dia 1","CARMEL","PROVINCIA",{"$f":"NETWORKDAYS.INTL(D306,M306,11,'Dias Feriados'!$A$1:$A$15)","v":-39255},"En Ruta",22,"NO",null,0.9375,0.94722222222222219,1,"ROMERO ACE","2025-05-28",null,null,45804,"",{"$f":"IF(AS306=\"Devuelto\",\"\",IF(X306=\"24hrs\",\"Entregado\",CONSOLIDADO!S306))","v":"En Ruta"},"",{"$f":"IF(AK306=\"Entregado\",\"\",IF(X306=\"24hrs\",\"\",IF(X306=\"48hrs\",\"Entregado\",CONSOLIDADO!S306)))","v":"En Ruta"},"",{"$f":"IF(AK306=\"Entregado\",\"\",IF(OR(X306=\"24hrs\",X306=\"48hrs\"),\"\",IF(X306=\"72hrs\",\"Entregado\",CONSOLIDADO!S306)))","v":"En Ruta"},"",{"$f":"IF(AK306=\"Entregado\",\"\",IF(OR(X306=\"24hrs\",X306=\"48hrs\",X306=\"72hrs\"),\"\",IF(X306=\"+72hrs\",\"Entregado\",CONSOLIDADO!S306)))","v":"En Ruta"},"","En Ruta",1,0,0,0,0,1,0,"No Entregado",0,0,1,0,{"$f":"IF(V306=\"Lima\",NETWORKDAYS.INTL(D306,M306,11,'Dias Feriados'!$A$1:$A$15),IF(AND(V306=\"provincia\",X306=\"24hrs\"),1,IF(AND(V306=\"provincia\",X306=\"48hrs\"),2,NETWORKDAYS.INTL(D306,M306,11,'Dias Feriados'!$A$1:$A$15))))","v":-39255}]
["B001667552","May","2025-05-27","2025-05-28","G/I. 030-10132",306,"IVANA MARILYN PENA CAVERO","MZ CC LT 02JARDINES DE SAN ANDRS DE LA ENTRADA PRINCIPAL","Provincia","PISCO","SAN ANDRES","B001667552",null,"En Ruta",9730017178,"F",202508,203201,"En Ruta","Dia 1","CARMEL","PROVINCIA",{"$f":"NETWORKDAYS.INTL(D307,M307,11,'Dias Feriados'!$A$1:$A$15)","v":-39255},"En Ruta",22,"NO",null,0.9375,0.94722222222222219,1,"ROMERO ACE","2025-05-28",null,null,45804,"",{"$f":"IF(AS307=\"Devuelto\",\"\",IF(X307=\"24hrs\",\"Entregado\",CONSOLIDADO!S307))","v":"En Ruta"},"",{"$f":"IF(AK307=\"Entregado\",\"\",IF(X307=\"24hrs\",\"\",IF(X307=\"48hrs\",\"Entregado\",CONSOLIDADO!S307)))","v":"En Ruta"},"",{"$f":"IF(AK307=\"Entregado\",\"\",IF(OR(X307=\"24hrs\",X307=\"48hrs\"),\"\",IF(X307=\"72hrs\",\"Entregado\",CONSOLIDADO!S307)))","v":"En Ruta"},"",{"$f":"IF(AK307=\"Entregado\",\"\",IF(OR(X307=\"24hrs\",X307=\"48hrs\",X307=\"72hrs\"),\"\",IF(X307=\"+72hrs\",\"Entregado\",CONSOLIDADO!S307)))","v":"En Ruta"},"","En Ruta",1,0,0,0,0,1,0,"No Entregado",0,0,1,0,{"$f":"IF(V307=\"Lima\",NETWORKDAYS.INTL(D307,M307,11,'Dias Feriados'!$A$1:$A$15),IF(AND(V307=\"provincia\",X307=\"24hrs\"),1,IF(AND(V307=\"provincia\",X307=\"48hrs\"),2,NETWORKDAYS.INTL(D307,M307,11,'Dias Feriados'!$A$1:$A$15))))","v":-39255}]
["B001668331","May","2025-05-27","2025-05-28","G/I. 030-10132",307,"LUISA YOLANDA CAJO FELIPA","MARQUEZ DE MANSERA 399 COL SIMON BOLIVAR","Provincia","PISCO","SAN ANDRES","B001668331",null,"En Ruta",9730017327,"F",202508,203201,"En Ruta","Dia 1","CARMEL","PROVINCIA",{"$f":"NETWORKDAYS.INTL(D308,M308,11,'Dias Feriados'!$A$1:$A$15)","v":-39255},"En Ruta",22,"NO",null,0.9375,0.94722222222222219,1,"ROMERO ACE","2025-05-28",null,null,45804,"",{"$f":"IF(AS308=\"Devuelto\",\"\",IF(X308=\"24hrs\",\"Entregado\",CONSOLIDADO!S308))","v":"En Ruta"},"",{"$f":"IF(AK308=\"Entregado\",\"\",IF(X308=\"24hrs\",\"\",IF(X308=\"48hrs\",\"Entregado\",CONSOLIDADO!S308)))","v":"En Ruta"},"",{"$f":"IF(AK308=\"Entregado\",\"\",IF(OR(X308=\"24hrs\",X308=\"48hrs\"),\"\",IF(X308=\"72hrs\",\"Entregado\",CONSOLIDADO!S308)))","v":"En Ruta"},"",{"$f":"IF(AK308=\"Entregado\",\"\",IF(OR(X308=\"24hrs\",X308=\"48hrs\",X308=\"72hrs\"),\"\",IF(X308=\"+72hrs\",\"Entregado\",CONSOLIDADO!S308)))","v":"En Ruta"},"","En Ruta",1,0,0,0,0,1,0,"No Entregado",0,0,1,0,{"$f":"IF(V308=\"Lima\",NETWORKDAYS.INTL(D308,M308,11,'Dias Feriados'!$A$1:$A$15),IF(AND(V308=\"provincia\",X308=\"24hrs\"),1,IF(AND(V308=\"provincia\",X308=\"48hrs\"),2,NETWORKDAYS.INTL(D308,M308,11,'Dias Feriados'!$A$1:$A$15))))","v":-39255}]
["B001667445","May","2025-05-27","2025-05-28","G/I. 030-10132",308,"ANGELICA RICARDINA CARDENAS VI","GENARO MEDRANO SN 10 MZ B FRENTE AL ARCO DE INGRESO DE SAN ANDRES VILLA FAP SAN ANDRES","Provincia","PISCO","SAN ANDRES","B001667445",null,"En Ruta",9730017393,"F",202508,203201,"En Ruta","Dia 1","CARMEL","PROVINCIA",{"$f":"NETWORKDAYS.INTL(D309,M309,11,'Dias Feriados'!$A$1:$A$15)","v":-39255},"En Ruta",22,"NO",null,0.9375,0.94722222222222219,1,"ROMERO ACE","2025-05-28",null,null,45804,"",{"$f":"IF(AS309=\"Devuelto\",\"\",IF(X309=\"24hrs\",\"Entregado\",CONSOLIDADO!S309))","v":"En Ruta"},"",{"$f":"IF(AK309=\"Entregado\",\"\",IF(X309=\"24hrs\",\"\",IF(X309=\"48hrs\",\"Entregado\",CONSOLIDADO!S309)))","v":"En Ruta"},"",{"$f":"IF(AK309=\"Entregado\",\"\",IF(OR(X309=\"24hrs\",X309=\"48hrs\"),\"\",IF(X309=\"72hrs\",\"Entregado\",CONSOLIDADO!S309)))","v":"En Ruta"},"",{"$f":"IF(AK309=\"Entregado\",\"\",IF(OR(X309=\"24hrs\",X309=\"48hrs\",X309=\"72hrs\"),\"\",IF(X309=\"+72hrs\",\"Entregado\",CONSOLIDADO!S309)))","v":"En Ruta"},"","En Ruta",1,0,0,0,0,1,0,"No Entregado",0,0,1,0,{"$f":"IF(V309=\"Lima\",NETWORKDAYS.INTL(D309,M309,11,'Dias Feriados'!$A$1:$A$15),IF(AND(V309=\"provincia\",X309=\"24hrs\"),1,IF(AND(V309=\"provincia\",X309=\"48hrs\"),2,NETWORKDAYS.INTL(D309,M309,11,'Dias Feriados'!$A$1:$A$15))))","v":-39255}]
["B001667570","May","2025-05-27","2025-05-28","G/I. 030-10132",309,"CAROL MELISSA ZARATE ENCISO","CL SAN CLEMENTE 114 LOZA LOS BAMBINOS","Provincia","PISCO","SAN CLEMENTE","B001667570",null,"En Ruta",9730017247,"F",202508,203201,"En Ruta","Dia 1","CARMEL","PROVINCIA",{"$f":"NETWORKDAYS.INTL(D310,M310,11,'Dias Feriados'!$A$1:$A$15)","v":-39255},"En Ruta",22,"NO",null,0.9375,0.94722222222222219,1,"ROMERO ACE","2025-05-28",null,null,45804,"",{"$f":"IF(AS310=\"Devuelto\",\"\",IF(X310=\"24hrs\",\"Entregado\",CONSOLIDADO!S310))","v":"En Ruta"},"",{"$f":"IF(AK310=\"Entregado\",\"\",IF(X310=\"24hrs\",\"\",IF(X310=\"48hrs\",\"Entregado\",CONSOLIDADO!S310)))","v":"En Ruta"},"",{"$f":"IF(AK310=\"Entregado\",\"\",IF(OR(X310=\"24hrs\",X310=\"48hrs\"),\"\",IF(X310=\"72hrs\",\"Entregado\",CONSOLIDADO!S310)))","v":"En Ruta"},"",{"$f":"IF(AK310=\"Entregado\",\"\",IF(OR(X310=\"24hrs\",X310=\"48hrs\",X310=\"72hrs\"),\"\",IF(X310=\"+72hrs\",\"Entregado\",CONSOLIDADO!S310)))","v":"En Ruta"},"","En Ruta",1,0,0,0,0,1,0,"No Entregado",0,0,1,0,{"$f":"IF(V310=\"Lima\",NETWORKDAYS.INTL(D310,M310,11,'Dias Feriados'!$A$1:$A$15),IF(AND(V310=\"provincia\",X310=\"24hrs\"),1,IF(AND(V310=\"provincia\",X310=\"48hrs\"),2,NETWORKDAYS.INTL(D310,M310,11,'Dias Feriados'!$A$1:$A$15))))","v":-39255}]
["B001667592","May","2025-05-27","2025-05-28","G/I. 030-10132",310,"ELIZABETH ALEJANDRA ALVINO FER","AV LOS LIBERTADORES 449 CL LIMA","Provincia","PISCO","SAN CLEMENTE","B001667592",null,"En Ruta",9730017357,"F",202508,203201,"En Ruta","Dia 1","CARMEL","PROVINCIA",{"$f":"NETWORKDAYS.INTL(D311,M311,11,'Dias Feriados'!$A$1:$A$15)","v":-39255},"En Ruta",22,"NO",null,0.9375,0.94722222222222219,1,"ROMERO ACE","2025-05-28",null,null,45804,"",{"$f":"IF(AS311=\"Devuelto\",\"\",IF(X311=\"24hrs\",\"Entregado\",CONSOLIDADO!S311))","v":"En Ruta"},"",{"$f":"IF(AK311=\"Entregado\",\"\",IF(X311=\"24hrs\",\"\",IF(X311=\"48hrs\",\"Entregado\",CONSOLIDADO!S311)))","v":"En Ruta"},"",{"$f":"IF(AK311=\"Entregado\",\"\",IF(OR(X311=\"24hrs\",X311=\"48hrs\"),\"\",IF(X311=\"72hrs\",\"Entregado\",CONSOLIDADO!S311)))","v":"En Ruta"},"",{"$f":"IF(AK311=\"Entregado\",\"\",IF(OR(X311=\"24hrs\",X311=\"48hrs\",X311=\"72hrs\"),\"\",IF(X311=\"+72hrs\",\"Entregado\",CONSOLIDADO!S311)))","v":"En Ruta"},"","En Ruta",1,0,0,0,0,1,0,"No Entregado",0,0,1,0,{"$f":"IF(V311=\"Lima\",NETWORKDAYS.INTL(D311,M311,11,'Dias Feriados'!$A$1:$A$15),IF(AND(V311=\"provincia\",X311=\"24hrs\"),1,IF(AND(V311=\"provincia\",X311=\"48hrs\"),2,NETWORKDAYS.INTL(D311,M311,11,'Dias Feriados'!$A$1:$A$15))))","v":-39255}]
["B001667526","May","2025-05-27","2025-05-28","G/I. 030-10132",311,"VANESSA ELENA MATTA ESPINO","LU JIRETH # A1 08 A LA ESPALDA DE LA FACULTAD DE PESQUERIA O FRENTE DEL PARQUE DEL NINO","Provincia","PISCO","TUPAC AMARU INCA","B001667526",null,"En Ruta",9730017049,"F",202508,203201,"En Ruta","Dia 1","CARMEL","PROVINCIA",{"$f":"NETWORKDAYS.INTL(D312,M312,11,'Dias Feriados'!$A$1:$A$15)","v":-39255},"En Ruta",22,"NO",null,0.9375,0.94722222222222219,1,"ROMERO ACE","2025-05-28",null,null,45804,"",{"$f":"IF(AS312=\"Devuelto\",\"\",IF(X312=\"24hrs\",\"Entregado\",CONSOLIDADO!S312))","v":"En Ruta"},"",{"$f":"IF(AK312=\"Entregado\",\"\",IF(X312=\"24hrs\",\"\",IF(X312=\"48hrs\",\"Entregado\",CONSOLIDADO!S312)))","v":"En Ruta"},"",{"$f":"IF(AK312=\"Entregado\",\"\",IF(OR(X312=\"24hrs\",X312=\"48hrs\"),\"\",IF(X312=\"72hrs\",\"Entregado\",CONSOLIDADO!S312)))","v":"En Ruta"},"",{"$f":"IF(AK312=\"Entregado\",\"\",IF(OR(X312=\"24hrs\",X312=\"48hrs\",X312=\"72hrs\"),\"\",IF(X312=\"+72hrs\",\"Entregado\",CONSOLIDADO!S312)))","v":"En Ruta"},"","En Ruta",1,0,0,0,0,1,0,"No Entregado",0,0,1,0,{"$f":"IF(V312=\"Lima\",NETWORKDAYS.INTL(D312,M312,11,'Dias Feriados'!$A$1:$A$15),IF(AND(V312=\"provincia\",X312=\"24hrs\"),1,IF(AND(V312=\"provincia\",X312=\"48hrs\"),2,NETWORKDAYS.INTL(D312,M312,11,'Dias Feriados'!$A$1:$A$15))))","v":-39255}]
["B001667568","May","2025-05-27","2025-05-28","G/I. 030-10132",312,"PATRICIA PILAR GUEVARA HUARIPU","JIRETH MZ G LT 2 POR DONDE ESTAN LOS CAMIONES JIRETH LA VILLA TUPAC AMARU","Provincia","PISCO","TUPAC AMARU INCA","B001667568",null,"En Ruta",9730017172,"F",202508,203201,"En Ruta","Dia 1","CARMEL","PROVINCIA",{"$f":"NETWORKDAYS.INTL(D313,M313,11,'Dias Feriados'!$A$1:$A$15)","v":-39255},"En Ruta",22,"NO",null,0.9375,0.94722222222222219,1,"HUAMAN QUI","2025-05-28",null,null,45804,"",{"$f":"IF(AS313=\"Devuelto\",\"\",IF(X313=\"24hrs\",\"Entregado\",CONSOLIDADO!S313))","v":"En Ruta"},"",{"$f":"IF(AK313=\"Entregado\",\"\",IF(X313=\"24hrs\",\"\",IF(X313=\"48hrs\",\"Entregado\",CONSOLIDADO!S313)))","v":"En Ruta"},"",{"$f":"IF(AK313=\"Entregado\",\"\",IF(OR(X313=\"24hrs\",X313=\"48hrs\"),\"\",IF(X313=\"72hrs\",\"Entregado\",CONSOLIDADO!S313)))","v":"En Ruta"},"",{"$f":"IF(AK313=\"Entregado\",\"\",IF(OR(X313=\"24hrs\",X313=\"48hrs\",X313=\"72hrs\"),\"\",IF(X313=\"+72hrs\",\"Entregado\",CONSOLIDADO!S313)))","v":"En Ruta"},"","En Ruta",1,0,0,0,0,1,0,"No Entregado",0,0,1,0,{"$f":"IF(V313=\"Lima\",NETWORKDAYS.INTL(D313,M313,11,'Dias Feriados'!$A$1:$A$15),IF(AND(V313=\"provincia\",X313=\"24hrs\"),1,IF(AND(V313=\"provincia\",X313=\"48hrs\"),2,NETWORKDAYS.INTL(D313,M313,11,'Dias Feriados'!$A$1:$A$15))))","v":-39255}]
["B001667469","May","2025-05-27","2025-05-28","G/I. 030-10132",313,"MARIA ANGELICA ORTIZ VICENTE","JOSE OLAYA MZ Q1 LT 7 MEDIA CDRA ANTES DE COLEGIO VIRGEN AV JOSE OLAYA","Provincia","CAÑETE","ASIA","B001667469",null,"En Ruta",9730017290,"F",202508,203201,"En Ruta","Dia 1","CARMEL","PROVINCIA",{"$f":"NETWORKDAYS.INTL(D314,M314,11,'Dias Feriados'!$A$1:$A$15)","v":-39255},"En Ruta",22,"NO",null,0.9375,0.94722222222222219,1,"HUAMAN QUI","2025-05-28",null,null,45804,"",{"$f":"IF(AS314=\"Devuelto\",\"\",IF(X314=\"24hrs\",\"Entregado\",CONSOLIDADO!S314))","v":"En Ruta"},"",{"$f":"IF(AK314=\"Entregado\",\"\",IF(X314=\"24hrs\",\"\",IF(X314=\"48hrs\",\"Entregado\",CONSOLIDADO!S314)))","v":"En Ruta"},"",{"$f":"IF(AK314=\"Entregado\",\"\",IF(OR(X314=\"24hrs\",X314=\"48hrs\"),\"\",IF(X314=\"72hrs\",\"Entregado\",CONSOLIDADO!S314)))","v":"En Ruta"},"",{"$f":"IF(AK314=\"Entregado\",\"\",IF(OR(X314=\"24hrs\",X314=\"48hrs\",X314=\"72hrs\"),\"\",IF(X314=\"+72hrs\",\"Entregado\",CONSOLIDADO!S314)))","v":"En Ruta"},"","En Ruta",1,0,0,0,0,1,0,"No Entregado",0,0,1,0,{"$f":"IF(V314=\"Lima\",NETWORKDAYS.INTL(D314,M314,11,'Dias Feriados'!$A$1:$A$15),IF(AND(V314=\"provincia\",X314=\"24hrs\"),1,IF(AND(V314=\"provincia\",X314=\"48hrs\"),2,NETWORKDAYS.INTL(D314,M314,11,'Dias Feriados'!$A$1:$A$15))))","v":-39255}]
["B001667641","May","2025-05-27","2025-05-28","G/I. 030-10132",314,"KATHERINE ORTIZ VICENTE","AV 28 DE JULIO MZ N LT 4 COMEDOR DE CAPILLA DE ASIA","Provincia","CAÑETE","ASIA","B001667641",null,"En Ruta",9730017297,"F",202508,203201,"En Ruta","Dia 1","CARMEL","PROVINCIA",{"$f":"NETWORKDAYS.INTL(D315,M315,11,'Dias Feriados'!$A$1:$A$15)","v":-39255},"En Ruta",22,"NO",null,0.9375,0.94722222222222219,1,"HUAMAN QUI","2025-05-28",null,null,45804,"",{"$f":"IF(AS315=\"Devuelto\",\"\",IF(X315=\"24hrs\",\"Entregado\",CONSOLIDADO!S315))","v":"En Ruta"},"",{"$f":"IF(AK315=\"Entregado\",\"\",IF(X315=\"24hrs\",\"\",IF(X315=\"48hrs\",\"Entregado\",CONSOLIDADO!S315)))","v":"En Ruta"},"",{"$f":"IF(AK315=\"Entregado\",\"\",IF(OR(X315=\"24hrs\",X315=\"48hrs\"),\"\",IF(X315=\"72hrs\",\"Entregado\",CONSOLIDADO!S315)))","v":"En Ruta"},"",{"$f":"IF(AK315=\"Entregado\",\"\",IF(OR(X315=\"24hrs\",X315=\"48hrs\",X315=\"72hrs\"),\"\",IF(X315=\"+72hrs\",\"Entregado\",CONSOLIDADO!S315)))","v":"En Ruta"},"","En Ruta",1,0,0,0,0,1,0,"No Entregado",0,0,1,0,{"$f":"IF(V315=\"Lima\",NETWORKDAYS.INTL(D315,M315,11,'Dias Feriados'!$A$1:$A$15),IF(AND(V315=\"provincia\",X315=\"24hrs\"),1,IF(AND(V315=\"provincia\",X315=\"48hrs\"),2,NETWORKDAYS.INTL(D315,M315,11,'Dias Feriados'!$A$1:$A$15))))","v":-39255}]
["B001668157","May","2025-05-27","2025-05-28","G/I. 030-10132",315,"LUCY MARISOL BAYLON SILVA","9 OCT PUEBLO MZ O LT 59 CARPINTERIA PONCE COSTADO UNA MECANICA","Provincia","CAÑETE","ASIA","B001668157",null,"En Ruta",9730017369,"F",202508,203201,"En Ruta","Dia 1","CARMEL","PROVINCIA",{"$f":"NETWORKDAYS.INTL(D316,M316,11,'Dias Feriados'!$A$1:$A$15)","v":-39255},"En Ruta",22,"NO",null,0.9375,0.94722222222222219,1,"HUAMAN QUI","2025-05-28",null,null,45804,"",{"$f":"IF(AS316=\"Devuelto\",\"\",IF(X316=\"24hrs\",\"Entregado\",CONSOLIDADO!S316))","v":"En Ruta"},"",{"$f":"IF(AK316=\"Entregado\",\"\",IF(X316=\"24hrs\",\"\",IF(X316=\"48hrs\",\"Entregado\",CONSOLIDADO!S316)))","v":"En Ruta"},"",{"$f":"IF(AK316=\"Entregado\",\"\",IF(OR(X316=\"24hrs\",X316=\"48hrs\"),\"\",IF(X316=\"72hrs\",\"Entregado\",CONSOLIDADO!S316)))","v":"En Ruta"},"",{"$f":"IF(AK316=\"Entregado\",\"\",IF(OR(X316=\"24hrs\",X316=\"48hrs\",X316=\"72hrs\"),\"\",IF(X316=\"+72hrs\",\"Entregado\",CONSOLIDADO!S316)))","v":"En Ruta"},"","En Ruta",1,0,0,0,0,1,0,"No Entregado",0,0,1,0,{"$f":"IF(V316=\"Lima\",NETWORKDAYS.INTL(D316,M316,11,'Dias Feriados'!$A$1:$A$15),IF(AND(V316=\"provincia\",X316=\"24hrs\"),1,IF(AND(V316=\"provincia\",X316=\"48hrs\"),2,NETWORKDAYS.INTL(D316,M316,11,'Dias Feriados'!$A$1:$A$15))))","v":-39255}]
["B001667733","May","2025-05-27","2025-05-28","G/I. 030-10132",316,"RUT LLERENA TIBURCIO DE ABURTO","ANEXO LAS PALMAS BAJAS MZ F LT 7 1 CDRA DE LA ACADEMIA JHONY BELLO","Provincia","CAÑETE","ASIA","B001667733",null,"En Ruta",9730017454,"F",202508,203201,"En Ruta","Dia 1","CARMEL","PROVINCIA",{"$f":"NETWORKDAYS.INTL(D317,M317,11,'Dias Feriados'!$A$1:$A$15)","v":-39255},"En Ruta",22,"NO",null,0.9375,0.94722222222222219,1,"HUAMAN QUI","2025-05-28",null,null,45804,"",{"$f":"IF(AS317=\"Devuelto\",\"\",IF(X317=\"24hrs\",\"Entregado\",CONSOLIDADO!S317))","v":"En Ruta"},"",{"$f":"IF(AK317=\"Entregado\",\"\",IF(X317=\"24hrs\",\"\",IF(X317=\"48hrs\",\"Entregado\",CONSOLIDADO!S317)))","v":"En Ruta"},"",{"$f":"IF(AK317=\"Entregado\",\"\",IF(OR(X317=\"24hrs\",X317=\"48hrs\"),\"\",IF(X317=\"72hrs\",\"Entregado\",CONSOLIDADO!S317)))","v":"En Ruta"},"",{"$f":"IF(AK317=\"Entregado\",\"\",IF(OR(X317=\"24hrs\",X317=\"48hrs\",X317=\"72hrs\"),\"\",IF(X317=\"+72hrs\",\"Entregado\",CONSOLIDADO!S317)))","v":"En Ruta"},"","En Ruta",1,0,0,0,0,1,0,"No Entregado",0,0,1,0,{"$f":"IF(V317=\"Lima\",NETWORKDAYS.INTL(D317,M317,11,'Dias Feriados'!$A$1:$A$15),IF(AND(V317=\"provincia\",X317=\"24hrs\"),1,IF(AND(V317=\"provincia\",X317=\"48hrs\"),2,NETWORKDAYS.INTL(D317,M317,11,'Dias Feriados'!$A$1:$A$15))))","v":-39255}]
["B001668173","May","2025-05-27","2025-05-28","G/I. 030-10132",317,"ESTHER LUZ ARIAS MUNOZ","MZL LT 7 AAHH ROSARIO DE ASIA CLUB ALMIRADOR ANT PANM SUR","Provincia","CAÑETE","ASIA","B001668173",null,"En Ruta",9730018321,"F",202508,203201,"En Ruta","Dia 1","CARMEL","PROVINCIA",{"$f":"NETWORKDAYS.INTL(D318,M318,11,'Dias Feriados'!$A$1:$A$15)","v":-39255},"En Ruta",22,"NO",null,0.9375,0.94722222222222219,1,"HUAMAN QUI","2025-05-28",null,null,45804,"",{"$f":"IF(AS318=\"Devuelto\",\"\",IF(X318=\"24hrs\",\"Entregado\",CONSOLIDADO!S318))","v":"En Ruta"},"",{"$f":"IF(AK318=\"Entregado\",\"\",IF(X318=\"24hrs\",\"\",IF(X318=\"48hrs\",\"Entregado\",CONSOLIDADO!S318)))","v":"En Ruta"},"",{"$f":"IF(AK318=\"Entregado\",\"\",IF(OR(X318=\"24hrs\",X318=\"48hrs\"),\"\",IF(X318=\"72hrs\",\"Entregado\",CONSOLIDADO!S318)))","v":"En Ruta"},"",{"$f":"IF(AK318=\"Entregado\",\"\",IF(OR(X318=\"24hrs\",X318=\"48hrs\",X318=\"72hrs\"),\"\",IF(X318=\"+72hrs\",\"Entregado\",CONSOLIDADO!S318)))","v":"En Ruta"},"","En Ruta",1,0,0,0,0,1,0,"No Entregado",0,0,1,0,{"$f":"IF(V318=\"Lima\",NETWORKDAYS.INTL(D318,M318,11,'Dias Feriados'!$A$1:$A$15),IF(AND(V318=\"provincia\",X318=\"24hrs\"),1,IF(AND(V318=\"provincia\",X318=\"48hrs\"),2,NETWORKDAYS.INTL(D318,M318,11,'Dias Feriados'!$A$1:$A$15))))","v":-39255}]
["B001667653","May","2025-05-27","2025-05-28","G/I. 030-10132",318,"THRIANA AYLEE CORDOVA VIDAL","CL SAENZ PENA SN 28 DE JULIO COSTADO BODEGA PEPO","Provincia","CAÑETE","CERRO AZUL","B001667653",null,"En Ruta",9730017135,"F",202508,203201,"En Ruta","Dia 1","CARMEL","PROVINCIA",{"$f":"NETWORKDAYS.INTL(D319,M319,11,'Dias Feriados'!$A$1:$A$15)","v":-39255},"En Ruta",22,"NO",null,0.9375,0.94722222222222219,1,"HUAMAN QUI","2025-05-28",null,null,45804,"",{"$f":"IF(AS319=\"Devuelto\",\"\",IF(X319=\"24hrs\",\"Entregado\",CONSOLIDADO!S319))","v":"En Ruta"},"",{"$f":"IF(AK319=\"Entregado\",\"\",IF(X319=\"24hrs\",\"\",IF(X319=\"48hrs\",\"Entregado\",CONSOLIDADO!S319)))","v":"En Ruta"},"",{"$f":"IF(AK319=\"Entregado\",\"\",IF(OR(X319=\"24hrs\",X319=\"48hrs\"),\"\",IF(X319=\"72hrs\",\"Entregado\",CONSOLIDADO!S319)))","v":"En Ruta"},"",{"$f":"IF(AK319=\"Entregado\",\"\",IF(OR(X319=\"24hrs\",X319=\"48hrs\",X319=\"72hrs\"),\"\",IF(X319=\"+72hrs\",\"Entregado\",CONSOLIDADO!S319)))","v":"En Ruta"},"","En Ruta",1,0,0,0,0,1,0,"No Entregado",0,0,1,0,{"$f":"IF(V319=\"Lima\",NETWORKDAYS.INTL(D319,M319,11,'Dias Feriados'!$A$1:$A$15),IF(AND(V319=\"provincia\",X319=\"24hrs\"),1,IF(AND(V319=\"provincia\",X319=\"48hrs\"),2,NETWORKDAYS.INTL(D319,M319,11,'Dias Feriados'!$A$1:$A$15))))","v":-39255}]
["B001667346","May","2025-05-27","2025-05-28","G/I. 030-10132",319,"SONIA MARIBEL ZAVALA MEDINA","MALECON JOSE OLAYA MZ SN RESTAURANTE MAR AZUL MALECON JOSE OLAYA","Provincia","CAÑETE","CERRO AZUL","B001667346",null,"En Ruta",9730017306,"F",202508,203201,"En Ruta","Dia 1","CARMEL","PROVINCIA",{"$f":"NETWORKDAYS.INTL(D320,M320,11,'Dias Feriados'!$A$1:$A$15)","v":-39255},"En Ruta",22,"NO",null,0.9375,0.94722222222222219,1,"HUAMAN QUI","2025-05-28",null,null,45804,"",{"$f":"IF(AS320=\"Devuelto\",\"\",IF(X320=\"24hrs\",\"Entregado\",CONSOLIDADO!S320))","v":"En Ruta"},"",{"$f":"IF(AK320=\"Entregado\",\"\",IF(X320=\"24hrs\",\"\",IF(X320=\"48hrs\",\"Entregado\",CONSOLIDADO!S320)))","v":"En Ruta"},"",{"$f":"IF(AK320=\"Entregado\",\"\",IF(OR(X320=\"24hrs\",X320=\"48hrs\"),\"\",IF(X320=\"72hrs\",\"Entregado\",CONSOLIDADO!S320)))","v":"En Ruta"},"",{"$f":"IF(AK320=\"Entregado\",\"\",IF(OR(X320=\"24hrs\",X320=\"48hrs\",X320=\"72hrs\"),\"\",IF(X320=\"+72hrs\",\"Entregado\",CONSOLIDADO!S320)))","v":"En Ruta"},"","En Ruta",1,0,0,0,0,1,0,"No Entregado",0,0,1,0,{"$f":"IF(V320=\"Lima\",NETWORKDAYS.INTL(D320,M320,11,'Dias Feriados'!$A$1:$A$15),IF(AND(V320=\"provincia\",X320=\"24hrs\"),1,IF(AND(V320=\"provincia\",X320=\"48hrs\"),2,NETWORKDAYS.INTL(D320,M320,11,'Dias Feriados'!$A$1:$A$15))))","v":-39255}]
["B001667455",{"$f":"TEXT(C321,\"mmm\")","v":"May"},"2025-05-27","2025-05-28","G/I. 030-10132",320,"JESSICA MARGARITA HUAPAYA CHAV","JR SALAVERRY MZ 111 LT 13 CERCA AL COLEGIO PRIMARIA 20135","Provincia","CAÑETE","CHILCA","B001667455",null,"En Ruta",9730017124,"F",202508,203201,"En Ruta","Dia 1","CARMEL","PROVINCIA",{"$f":"NETWORKDAYS.INTL(D321,M321,11,'Dias Feriados'!$A$1:$A$15)","v":-39255},"En Ruta",22,"NO",null,0.9375,0.94722222222222219,1,"HUAMAN QUI",{"$f":"DATEVALUE(D321)","v":"2025-05-28"},null,null,{"$f":"C321","v":45804},{"$f":"IF(AK321=\"Entregado\",M321,\"\")","v":""},{"$f":"IF(AS321=\"Devuelto\",\"\",IF(X321=\"24hrs\",\"Entregado\",CONSOLIDADO!S321))","v":"En Ruta"},{"$f":"IF(AM321=\"Entregado\",M321,\"\")","v":""},{"$f":"IF(AK321=\"Entregado\",\"\",IF(X321=\"24hrs\",\"\",IF(X321=\"48hrs\",\"Entregado\",CONSOLIDADO!S321)))","v":"En Ruta"},{"$f":"IF(AO321=\"Entregado\",M321,\"\")","v":""},{"$f":"IF(AK321=\"Entregado\",\"\",IF(OR(X321=\"24hrs\",X321=\"48hrs\"),\"\",IF(X321=\"72hrs\",\"Entregado\",CONSOLIDADO!S321)))","v":"En Ruta"},{"$f":"IF(AQ321=\"Entregado\",M321,\"\")","v":""},{"$f":"IF(AK321=\"Entregado\",\"\",IF(OR(X321=\"24hrs\",X321=\"48hrs\",X321=\"72hrs\"),\"\",IF(X321=\"+72hrs\",\"Entregado\",CONSOLIDADO!S321)))","v":"En Ruta"},{"$f":"IF(M321=\"\",\"\",M321)","v":""},{"$f":"IF(AG321=\"Devuelto\",AG321,N321)","v":"En Ruta"},{"$f":"1+0","v":1},0,0,0,0,1,0,"No Entregado",0,0,1,0,{"$f":"IF(V321=\"Lima\",NETWORKDAYS.INTL(D321,M321,11,'Dias Feriados'!$A$1:$A$15),IF(AND(V321=\"provincia\",X321=\"24hrs\"),1,IF(AND(V321=\"provincia\",X321=\"48hrs\"),2,NETWORKDAYS.INTL(D321,M321,11,'Dias Feriados'!$A$1:$A$15))))","v":-39255}]
["B001667775","May","2025-05-27","2025-05-28","G/I. 030-10132",321,"PATRICIA CARMEN LOPEZ PAZOS","VILLA JARDIN MZ V LT 6 COST PANADERIA NAVARRETE","Provincia","CHINCHA","GROCIO PRADO","B001667775",null,"En Ruta",9730017376,"F",202508,203201,"En Ruta","Dia 1",{"$f":"IF(MID(R322,1,2)=\"10\",\"PACIFIKA\",IF(MID(R322,1,2)=\"20\",\"CARMEL\",\"EMPLEADOS\"))","v":"CARMEL"},{"$f":"IF(I322=\"LIMA\",\"LIMA\",\"PROVINCIA\")","v":"PROVINCIA"},{"$f":"NETWORKDAYS.INTL(D322,M322,11,'Dias Feriados'!$A$1:$A$15)","v":-39255},{"$f":"IF(OR(M322=\"\",M322=\"En Ruta\"),\"En Ruta\",IF(M322=\"Motivado\",\"Motivado\",IF(W322<=1,\"24hrs\",IF(W322=2,\"48hrs\",IF(W322=3,\"72hrs\",\"+72hrs\")))))","v":"En Ruta"},{"$f":"WEEKNUM(C322)","v":22},"NO",null,0.9375,0.94722222222222219,1,"HUAMAN QUI","2025-05-28",null,null,45804,"",{"$f":"IF(AS322=\"Devuelto\",\"\",IF(X322=\"24hrs\",\"Entregado\",CONSOLIDADO!S322))","v":"En Ruta"},"",{"$f":"IF(AK322=\"Entregado\",\"\",IF(X322=\"24hrs\",\"\",IF(X322=\"48hrs\",\"Entregado\",CONSOLIDADO!S322)))","v":"En Ruta"},"",{"$f":"IF(AK322=\"Entregado\",\"\",IF(OR(X322=\"24hrs\",X322=\"48hrs\"),\"\",IF(X322=\"72hrs\",\"Entregado\",CONSOLIDADO!S322)))","v":"En Ruta"},"",{"$f":"IF(AK322=\"Entregado\",\"\",IF(OR(X322=\"24hrs\",X322=\"48hrs\",X322=\"72hrs\"),\"\",IF(X322=\"+72hrs\",\"Entregado\",CONSOLIDADO!S322)))","v":"En Ruta"},"","En Ruta",1,{"$f":"IF(X322=\"24hrs\",1,0)","v":0},{"$f":"IF(X322=\"48hrs\",1,0)","v":0},{"$f":"IF(X322=\"72hrs\",1,0)","v":0},{"$f":"IF(X322=\"+72hrs\",1,0)","v":0},{"$f":"IF(X322=\"En Ruta\",1,0)","v":1},{"$f":"IF(X322=\"Motivado\",1,0)","v":0},{"$f":"IF(OR(N322=\"devuelto\",N322=\"siniestro\"),\"Nulo\",IF(OR(X322=\"24hrs\",X322=\"48hrs\"),\"A Tiempo\",IF(OR(X322=\"en ruta\",X322=\"motivado\"),\"No Entregado\",\"Fuera de Tiempo\")))","v":"No Entregado"},{"$f":"IF(BA322=\"a tiempo\",1,0)","v":0},{"$f":"IF(BA322=\"fuera de tiempo\",1,0)","v":0},{"$f":"IF(BA322=\"no entregado\",1,0)","v":1},{"$f":"IF(BA322=\"nulo\",1,0)","v":0},{"$f":"IF(V322=\"Lima\",NETWORKDAYS.INTL(D322,M322,11,'Dias Feriados'!$A$1:$A$15),IF(AND(V322=\"provincia\",X322=\"24hrs\"),1,IF(AND(V322=\"provincia\",X322=\"48hrs\"),2,NETWORKDAYS.INTL(D322,M322,11,'Dias Feriados'!$A$1:$A$15))))","v":-39255}]
["B001667442","May","2025-05-27","2025-05-28","G/I. 030-10132",322,"ELENA ESTHER GARCIA QUISPE","MZ A LT 10 AAHH VALLE HERMOSO SAN VICENTE","Provincia","CAÑETE","IMPERIAL","B001667442",null,"En Ruta",9730017057,"F",202508,203201,"En Ruta","Dia 1","CARMEL","PROVINCIA",{"$f":"NETWORKDAYS.INTL(D323,M323,11,'Dias Feriados'!$A$1:$A$15)","v":-39255},"En Ruta",22,"NO",null,0.9375,0.94722222222222219,1,"HUAMAN QUI","2025-05-28",null,null,45804,"",{"$f":"IF(AS323=\"Devuelto\",\"\",IF(X323=\"24hrs\",\"Entregado\",CONSOLIDADO!S323))","v":"En Ruta"},"",{"$f":"IF(AK323=\"Entregado\",\"\",IF(X323=\"24hrs\",\"\",IF(X323=\"48hrs\",\"Entregado\",CONSOLIDADO!S323)))","v":"En Ruta"},"",{"$f":"IF(AK323=\"Entregado\",\"\",IF(OR(X323=\"24hrs\",X323=\"48hrs\"),\"\",IF(X323=\"72hrs\",\"Entregado\",CONSOLIDADO!S323)))","v":"En Ruta"},"",{"$f":"IF(AK323=\"Entregado\",\"\",IF(OR(X323=\"24hrs\",X323=\"48hrs\",X323=\"72hrs\"),\"\",IF(X323=\"+72hrs\",\"Entregado\",CONSOLIDADO!S323)))","v":"En Ruta"},"","En Ruta",1,0,0,0,0,1,0,"No Entregado",0,0,1,0,{"$f":"IF(V323=\"Lima\",NETWORKDAYS.INTL(D323,M323,11,'Dias Feriados'!$A$1:$A$15),IF(AND(V323=\"provincia\",X323=\"24hrs\"),1,IF(AND(V323=\"provincia\",X323=\"48hrs\"),2,NETWORKDAYS.INTL(D323,M323,11,'Dias Feriados'!$A$1:$A$15))))","v":-39255}]
["B001667505","May","2025-05-27","2025-05-28","G/I. 030-10132",323,"BRITGHET DAYANARA ACOSTA CHANC","AAHH ASUNCION 8 LT 13 PQ ASUNCION","Provincia","CAÑETE","IMPERIAL","B001667505",null,"En Ruta",9730017075,"F",202508,203201,"En Ruta","Dia 1","CARMEL","PROVINCIA",{"$f":"NETWORKDAYS.INTL(D324,M324,11,'Dias Feriados'!$A$1:$A$15)","v":-39255},"En Ruta",22,"NO",null,0.9375,0.94722222222222219,1,"HUAMAN QUI","2025-05-28",null,null,45804,"",{"$f":"IF(AS324=\"Devuelto\",\"\",IF(X324=\"24hrs\",\"Entregado\",CONSOLIDADO!S324))","v":"En Ruta"},"",{"$f":"IF(AK324=\"Entregado\",\"\",IF(X324=\"24hrs\",\"\",IF(X324=\"48hrs\",\"Entregado\",CONSOLIDADO!S324)))","v":"En Ruta"},"",{"$f":"IF(AK324=\"Entregado\",\"\",IF(OR(X324=\"24hrs\",X324=\"48hrs\"),\"\",IF(X324=\"72hrs\",\"Entregado\",CONSOLIDADO!S324)))","v":"En Ruta"},"",{"$f":"IF(AK324=\"Entregado\",\"\",IF(OR(X324=\"24hrs\",X324=\"48hrs\",X324=\"72hrs\"),\"\",IF(X324=\"+72hrs\",\"Entregado\",CONSOLIDADO!S324)))","v":"En Ruta"},"","En Ruta",1,0,0,0,0,1,0,"No Entregado",0,0,1,0,{"$f":"IF(V324=\"Lima\",NETWORKDAYS.INTL(D324,M324,11,'Dias Feriados'!$A$1:$A$15),IF(AND(V324=\"provincia\",X324=\"24hrs\"),1,IF(AND(V324=\"provincia\",X324=\"48hrs\"),2,NETWORKDAYS.INTL(D324,M324,11,'Dias Feriados'!$A$1:$A$15))))","v":-39255}]
["B001667582","May","2025-05-27","2025-05-28","G/I. 030-10132",324,"ANTONIA CANDELA ALCALA","AAHH JOSEFINA RAMOS MZD1 LT 7 A 3 CDRAS PASANDO LA POSTA","Provincia","CAÑETE","IMPERIAL","B001667582",null,"En Ruta",9730017109,"F",202508,203201,"En Ruta","Dia 1","CARMEL","PROVINCIA",{"$f":"NETWORKDAYS.INTL(D325,M325,11,'Dias Feriados'!$A$1:$A$15)","v":-39255},"En Ruta",22,"NO",null,0.9375,0.94722222222222219,1,"HUAMAN QUI","2025-05-28",null,null,45804,"",{"$f":"IF(AS325=\"Devuelto\",\"\",IF(X325=\"24hrs\",\"Entregado\",CONSOLIDADO!S325))","v":"En Ruta"},"",{"$f":"IF(AK325=\"Entregado\",\"\",IF(X325=\"24hrs\",\"\",IF(X325=\"48hrs\",\"Entregado\",CONSOLIDADO!S325)))","v":"En Ruta"},"",{"$f":"IF(AK325=\"Entregado\",\"\",IF(OR(X325=\"24hrs\",X325=\"48hrs\"),\"\",IF(X325=\"72hrs\",\"Entregado\",CONSOLIDADO!S325)))","v":"En Ruta"},"",{"$f":"IF(AK325=\"Entregado\",\"\",IF(OR(X325=\"24hrs\",X325=\"48hrs\",X325=\"72hrs\"),\"\",IF(X325=\"+72hrs\",\"Entregado\",CONSOLIDADO!S325)))","v":"En Ruta"},"","En Ruta",1,0,0,0,0,1,0,"No Entregado",0,0,1,0,{"$f":"IF(V325=\"Lima\",NETWORKDAYS.INTL(D325,M325,11,'Dias Feriados'!$A$1:$A$15),IF(AND(V325=\"provincia\",X325=\"24hrs\"),1,IF(AND(V325=\"provincia\",X325=\"48hrs\"),2,NETWORKDAYS.INTL(D325,M325,11,'Dias Feriados'!$A$1:$A$15))))","v":-39255}]
["B001667731","May","2025-05-27","2025-05-28","G/I. 030-10132",325,"YAZMIN LISSETH AQUINO SANCHEZ","CL 28 DE JULIO 549 SUPERMERCADOS MAS CENTRO POBLADO IMPERIAL","Provincia","CAÑETE","IMPERIAL","B001667731",null,"En Ruta",9730017152,"F",202508,203201,"En Ruta","Dia 1","CARMEL","PROVINCIA",{"$f":"NETWORKDAYS.INTL(D326,M326,11,'Dias Feriados'!$A$1:$A$15)","v":-39255},"En Ruta",22,"NO",null,0.9375,0.94722222222222219,1,"HUAMAN QUI","2025-05-28",null,null,45804,"",{"$f":"IF(AS326=\"Devuelto\",\"\",IF(X326=\"24hrs\",\"Entregado\",CONSOLIDADO!S326))","v":"En Ruta"},"",{"$f":"IF(AK326=\"Entregado\",\"\",IF(X326=\"24hrs\",\"\",IF(X326=\"48hrs\",\"Entregado\",CONSOLIDADO!S326)))","v":"En Ruta"},"",{"$f":"IF(AK326=\"Entregado\",\"\",IF(OR(X326=\"24hrs\",X326=\"48hrs\"),\"\",IF(X326=\"72hrs\",\"Entregado\",CONSOLIDADO!S326)))","v":"En Ruta"},"",{"$f":"IF(AK326=\"Entregado\",\"\",IF(OR(X326=\"24hrs\",X326=\"48hrs\",X326=\"72hrs\"),\"\",IF(X326=\"+72hrs\",\"Entregado\",CONSOLIDADO!S326)))","v":"En Ruta"},"","En Ruta",1,0,0,0,0,1,0,"No Entregado",0,0,1,0,{"$f":"IF(V326=\"Lima\",NETWORKDAYS.INTL(D326,M326,11,'Dias Feriados'!$A$1:$A$15),IF(AND(V326=\"provincia\",X326=\"24hrs\"),1,IF(AND(V326=\"provincia\",X326=\"48hrs\"),2,NETWORKDAYS.INTL(D326,M326,11,'Dias Feriados'!$A$1:$A$15))))","v":-39255}]
["B001667702","May","2025-05-27","2025-05-28","G/I. 030-10132",326,"ERIKA LIZETH HERRERAS POLO","JRMANCO CAPAC 750 CAMAL DE LAS AVES","Provincia","CAÑETE","IMPERIAL","B001667702",null,"En Ruta",9730017163,"F",202508,203201,"En Ruta","Dia 1","CARMEL","PROVINCIA",{"$f":"NETWORKDAYS.INTL(D327,M327,11,'Dias Feriados'!$A$1:$A$15)","v":-39255},"En Ruta",22,"NO",null,0.9375,0.94722222222222219,1,"HUAMAN QUI","2025-05-28",null,null,45804,"",{"$f":"IF(AS327=\"Devuelto\",\"\",IF(X327=\"24hrs\",\"Entregado\",CONSOLIDADO!S327))","v":"En Ruta"},"",{"$f":"IF(AK327=\"Entregado\",\"\",IF(X327=\"24hrs\",\"\",IF(X327=\"48hrs\",\"Entregado\",CONSOLIDADO!S327)))","v":"En Ruta"},"",{"$f":"IF(AK327=\"Entregado\",\"\",IF(OR(X327=\"24hrs\",X327=\"48hrs\"),\"\",IF(X327=\"72hrs\",\"Entregado\",CONSOLIDADO!S327)))","v":"En Ruta"},"",{"$f":"IF(AK327=\"Entregado\",\"\",IF(OR(X327=\"24hrs\",X327=\"48hrs\",X327=\"72hrs\"),\"\",IF(X327=\"+72hrs\",\"Entregado\",CONSOLIDADO!S327)))","v":"En Ruta"},"","En Ruta",1,0,0,0,0,1,0,"No Entregado",0,0,1,0,{"$f":"IF(V327=\"Lima\",NETWORKDAYS.INTL(D327,M327,11,'Dias Feriados'!$A$1:$A$15),IF(AND(V327=\"provincia\",X327=\"24hrs\"),1,IF(AND(V327=\"provincia\",X327=\"48hrs\"),2,NETWORKDAYS.INTL(D327,M327,11,'Dias Feriados'!$A$1:$A$15))))","v":-39255}]
["B001667441","May","2025-05-27","2025-05-28","G/I. 030-10132",327,"MAYRA VANESSA CHAVEZ PARDO","URB LOS CIPRESES MZ D LT 11 URB LOS CIPRESES","Provincia","CAÑETE","IMPERIAL","B001667441",null,"En Ruta",9730017175,"F",202508,203201,"En Ruta","Dia 1","CARMEL","PROVINCIA",{"$f":"NETWORKDAYS.INTL(D328,M328,11,'Dias Feriados'!$A$1:$A$15)","v":-39255},"En Ruta",22,"NO",null,0.9375,0.94722222222222219,1,"HUAMAN QUI","2025-05-28",null,null,45804,"",{"$f":"IF(AS328=\"Devuelto\",\"\",IF(X328=\"24hrs\",\"Entregado\",CONSOLIDADO!S328))","v":"En Ruta"},"",{"$f":"IF(AK328=\"Entregado\",\"\",IF(X328=\"24hrs\",\"\",IF(X328=\"48hrs\",\"Entregado\",CONSOLIDADO!S328)))","v":"En Ruta"},"",{"$f":"IF(AK328=\"Entregado\",\"\",IF(OR(X328=\"24hrs\",X328=\"48hrs\"),\"\",IF(X328=\"72hrs\",\"Entregado\",CONSOLIDADO!S328)))","v":"En Ruta"},"",{"$f":"IF(AK328=\"Entregado\",\"\",IF(OR(X328=\"24hrs\",X328=\"48hrs\",X328=\"72hrs\"),\"\",IF(X328=\"+72hrs\",\"Entregado\",CONSOLIDADO!S328)))","v":"En Ruta"},"","En Ruta",1,0,0,0,0,1,0,"No Entregado",0,0,1,0,{"$f":"IF(V328=\"Lima\",NETWORKDAYS.INTL(D328,M328,11,'Dias Feriados'!$A$1:$A$15),IF(AND(V328=\"provincia\",X328=\"24hrs\"),1,IF(AND(V328=\"provincia\",X328=\"48hrs\"),2,NETWORKDAYS.INTL(D328,M328,11,'Dias Feriados'!$A$1:$A$15))))","v":-39255}]
["B001667430","May","2025-05-27","2025-05-28","G/I. 030-10132",328,"KARINA NAVARRO ZAMORA","LOS HRTOS DE CANETE MZ J LT 14 3 ET COLG CNI ENTRADA","Provincia","CAÑETE","IMPERIAL","B001667430",null,"En Ruta",9730017201,"F",202508,203201,"En Ruta","Dia 1","CARMEL","PROVINCIA",{"$f":"NETWORKDAYS.INTL(D329,M329,11,'Dias Feriados'!$A$1:$A$15)","v":-39255},"En Ruta",22,"NO",null,0.9375,0.94722222222222219,1,"HUAMAN QUI","2025-05-28",null,null,45804,"",{"$f":"IF(AS329=\"Devuelto\",\"\",IF(X329=\"24hrs\",\"Entregado\",CONSOLIDADO!S329))","v":"En Ruta"},"",{"$f":"IF(AK329=\"Entregado\",\"\",IF(X329=\"24hrs\",\"\",IF(X329=\"48hrs\",\"Entregado\",CONSOLIDADO!S329)))","v":"En Ruta"},"",{"$f":"IF(AK329=\"Entregado\",\"\",IF(OR(X329=\"24hrs\",X329=\"48hrs\"),\"\",IF(X329=\"72hrs\",\"Entregado\",CONSOLIDADO!S329)))","v":"En Ruta"},"",{"$f":"IF(AK329=\"Entregado\",\"\",IF(OR(X329=\"24hrs\",X329=\"48hrs\",X329=\"72hrs\"),\"\",IF(X329=\"+72hrs\",\"Entregado\",CONSOLIDADO!S329)))","v":"En Ruta"},"","En Ruta",1,0,0,0,0,1,0,"No Entregado",0,0,1,0,{"$f":"IF(V329=\"Lima\",NETWORKDAYS.INTL(D329,M329,11,'Dias Feriados'!$A$1:$A$15),IF(AND(V329=\"provincia\",X329=\"24hrs\"),1,IF(AND(V329=\"provincia\",X329=\"48hrs\"),2,NETWORKDAYS.INTL(D329,M329,11,'Dias Feriados'!$A$1:$A$15))))","v":-39255}]
["B001667704","May","2025-05-27","2025-05-28","G/I. 030-10132",329,"ROSARIO RAVELLO APARICIO","JR HUANCAYO 369 MZ P1 LT 26 CRUCE 28 JULIO CENTRO POBLADO IMPERIAL","Provincia","CAÑETE","IMPERIAL","B001667704",null,"En Ruta",9730017284,"F",202508,203201,"En Ruta","Dia 1","CARMEL","PROVINCIA",{"$f":"NETWORKDAYS.INTL(D330,M330,11,'Dias Feriados'!$A$1:$A$15)","v":-39255},"En Ruta",22,"NO",null,0.9375,0.94722222222222219,1,"HUAMAN QUI","2025-05-28",null,null,45804,"",{"$f":"IF(AS330=\"Devuelto\",\"\",IF(X330=\"24hrs\",\"Entregado\",CONSOLIDADO!S330))","v":"En Ruta"},"",{"$f":"IF(AK330=\"Entregado\",\"\",IF(X330=\"24hrs\",\"\",IF(X330=\"48hrs\",\"Entregado\",CONSOLIDADO!S330)))","v":"En Ruta"},"",{"$f":"IF(AK330=\"Entregado\",\"\",IF(OR(X330=\"24hrs\",X330=\"48hrs\"),\"\",IF(X330=\"72hrs\",\"Entregado\",CONSOLIDADO!S330)))","v":"En Ruta"},"",{"$f":"IF(AK330=\"Entregado\",\"\",IF(OR(X330=\"24hrs\",X330=\"48hrs\",X330=\"72hrs\"),\"\",IF(X330=\"+72hrs\",\"Entregado\",CONSOLIDADO!S330)))","v":"En Ruta"},"","En Ruta",1,0,0,0,0,1,0,"No Entregado",0,0,1,0,{"$f":"IF(V330=\"Lima\",NETWORKDAYS.INTL(D330,M330,11,'Dias Feriados'!$A$1:$A$15),IF(AND(V330=\"provincia\",X330=\"24hrs\"),1,IF(AND(V330=\"provincia\",X330=\"48hrs\"),2,NETWORKDAYS.INTL(D330,M330,11,'Dias Feriados'!$A$1:$A$15))))","v":-39255}]
["B001667616","May","2025-05-27","2025-05-28","G/I. 030-10132",330,"DORA LEONOR LUQUE FAJARDO","ANX CANTAGALLO 6 NOSIGLIA TANQ ELEVAD AGU IZQ CASA VERDE","Provincia","CAÑETE","IMPERIAL","B001667616",null,"En Ruta",9730017435,"F",202508,203201,"En Ruta","Dia 1","CARMEL","PROVINCIA",{"$f":"NETWORKDAYS.INTL(D331,M331,11,'Dias Feriados'!$A$1:$A$15)","v":-39255},"En Ruta",22,"NO",null,0.9375,0.94722222222222219,1,"HUAMAN QUI","2025-05-28",null,null,45804,"",{"$f":"IF(AS331=\"Devuelto\",\"\",IF(X331=\"24hrs\",\"Entregado\",CONSOLIDADO!S331))","v":"En Ruta"},"",{"$f":"IF(AK331=\"Entregado\",\"\",IF(X331=\"24hrs\",\"\",IF(X331=\"48hrs\",\"Entregado\",CONSOLIDADO!S331)))","v":"En Ruta"},"",{"$f":"IF(AK331=\"Entregado\",\"\",IF(OR(X331=\"24hrs\",X331=\"48hrs\"),\"\",IF(X331=\"72hrs\",\"Entregado\",CONSOLIDADO!S331)))","v":"En Ruta"},"",{"$f":"IF(AK331=\"Entregado\",\"\",IF(OR(X331=\"24hrs\",X331=\"48hrs\",X331=\"72hrs\"),\"\",IF(X331=\"+72hrs\",\"Entregado\",CONSOLIDADO!S331)))","v":"En Ruta"},"","En Ruta",1,0,0,0,0,1,0,"No Entregado",0,0,1,0,{"$f":"IF(V331=\"Lima\",NETWORKDAYS.INTL(D331,M331,11,'Dias Feriados'!$A$1:$A$15),IF(AND(V331=\"provincia\",X331=\"24hrs\"),1,IF(AND(V331=\"provincia\",X331=\"48hrs\"),2,NETWORKDAYS.INTL(D331,M331,11,'Dias Feriados'!$A$1:$A$15))))","v":-39255}]
["B001667741","May","2025-05-27","2025-05-28","G/I. 030-10132",331,"ROSA EMILIA SANCHEZ LUYO","JR SEVERO HUAPAYA MZ L LT 10 ALTURA COLEGIO DE LA GUARDIA CIVIL RAMOS LARREA","Provincia","CAÑETE","IMPERIAL","B001667741",null,"En Ruta",9730017514,"F",202508,203201,"En Ruta","Dia 1","CARMEL","PROVINCIA",{"$f":"NETWORKDAYS.INTL(D332,M332,11,'Dias Feriados'!$A$1:$A$15)","v":-39255},"En Ruta",22,"NO",null,0.9375,0.94722222222222219,1,"HUAMAN QUI","2025-05-28",null,null,45804,"",{"$f":"IF(AS332=\"Devuelto\",\"\",IF(X332=\"24hrs\",\"Entregado\",CONSOLIDADO!S332))","v":"En Ruta"},"",{"$f":"IF(AK332=\"Entregado\",\"\",IF(X332=\"24hrs\",\"\",IF(X332=\"48hrs\",\"Entregado\",CONSOLIDADO!S332)))","v":"En Ruta"},"",{"$f":"IF(AK332=\"Entregado\",\"\",IF(OR(X332=\"24hrs\",X332=\"48hrs\"),\"\",IF(X332=\"72hrs\",\"Entregado\",CONSOLIDADO!S332)))","v":"En Ruta"},"",{"$f":"IF(AK332=\"Entregado\",\"\",IF(OR(X332=\"24hrs\",X332=\"48hrs\",X332=\"72hrs\"),\"\",IF(X332=\"+72hrs\",\"Entregado\",CONSOLIDADO!S332)))","v":"En Ruta"},"","En Ruta",1,0,0,0,0,1,0,"No Entregado",0,0,1,0,{"$f":"IF(V332=\"Lima\",NETWORKDAYS.INTL(D332,M332,11,'Dias Feriados'!$A$1:$A$15),IF(AND(V332=\"provincia\",X332=\"24hrs\"),1,IF(AND(V332=\"provincia\",X332=\"48hrs\"),2,NETWORKDAYS.INTL(D332,M332,11,'Dias Feriados'!$A$1:$A$15))))","v":-39255}]
["B001667723","May","2025-05-27","2025-05-28","G/I. 030-10132",332,"BRENDA JERALDINE ANDIA COSME","AAHH ASUNCIN 8 MZ F LT 9 A ESPLDAS DEL PAR","Provincia","CAÑETE","IMPERIAL","B001667723",null,"En Ruta",9730017524,"F",202508,203201,"En Ruta","Dia 1","CARMEL","PROVINCIA",{"$f":"NETWORKDAYS.INTL(D333,M333,11,'Dias Feriados'!$A$1:$A$15)","v":-39255},"En Ruta",22,"NO",null,0.9375,0.94722222222222219,1,"HUAMAN QUI","2025-05-28",null,null,45804,"",{"$f":"IF(AS333=\"Devuelto\",\"\",IF(X333=\"24hrs\",\"Entregado\",CONSOLIDADO!S333))","v":"En Ruta"},"",{"$f":"IF(AK333=\"Entregado\",\"\",IF(X333=\"24hrs\",\"\",IF(X333=\"48hrs\",\"Entregado\",CONSOLIDADO!S333)))","v":"En Ruta"},"",{"$f":"IF(AK333=\"Entregado\",\"\",IF(OR(X333=\"24hrs\",X333=\"48hrs\"),\"\",IF(X333=\"72hrs\",\"Entregado\",CONSOLIDADO!S333)))","v":"En Ruta"},"",{"$f":"IF(AK333=\"Entregado\",\"\",IF(OR(X333=\"24hrs\",X333=\"48hrs\",X333=\"72hrs\"),\"\",IF(X333=\"+72hrs\",\"Entregado\",CONSOLIDADO!S333)))","v":"En Ruta"},"","En Ruta",1,0,0,0,0,1,0,"No Entregado",0,0,1,0,{"$f":"IF(V333=\"Lima\",NETWORKDAYS.INTL(D333,M333,11,'Dias Feriados'!$A$1:$A$15),IF(AND(V333=\"provincia\",X333=\"24hrs\"),1,IF(AND(V333=\"provincia\",X333=\"48hrs\"),2,NETWORKDAYS.INTL(D333,M333,11,'Dias Feriados'!$A$1:$A$15))))","v":-39255}]
["B001667747","May","2025-05-27","2025-05-28","G/I. 030-10132",333,"RUTH SAVEL GUERRERO HUAMANI","AV JOSEFINA RAMOS MZ U LT 20 PUESTO DE SALUD MALVINAS 2 CDRAS","Provincia","CAÑETE","IMPERIAL","B001667747",null,"En Ruta",9730017540,"F",202508,203201,"En Ruta","Dia 1","CARMEL","PROVINCIA",{"$f":"NETWORKDAYS.INTL(D334,M334,11,'Dias Feriados'!$A$1:$A$15)","v":-39255},"En Ruta",22,"NO",null,0.9375,0.94722222222222219,1,"HUAMAN QUI","2025-05-28",null,null,45804,"",{"$f":"IF(AS334=\"Devuelto\",\"\",IF(X334=\"24hrs\",\"Entregado\",CONSOLIDADO!S334))","v":"En Ruta"},"",{"$f":"IF(AK334=\"Entregado\",\"\",IF(X334=\"24hrs\",\"\",IF(X334=\"48hrs\",\"Entregado\",CONSOLIDADO!S334)))","v":"En Ruta"},"",{"$f":"IF(AK334=\"Entregado\",\"\",IF(OR(X334=\"24hrs\",X334=\"48hrs\"),\"\",IF(X334=\"72hrs\",\"Entregado\",CONSOLIDADO!S334)))","v":"En Ruta"},"",{"$f":"IF(AK334=\"Entregado\",\"\",IF(OR(X334=\"24hrs\",X334=\"48hrs\",X334=\"72hrs\"),\"\",IF(X334=\"+72hrs\",\"Entregado\",CONSOLIDADO!S334)))","v":"En Ruta"},"","En Ruta",1,0,0,0,0,1,0,"No Entregado",0,0,1,0,{"$f":"IF(V334=\"Lima\",NETWORKDAYS.INTL(D334,M334,11,'Dias Feriados'!$A$1:$A$15),IF(AND(V334=\"provincia\",X334=\"24hrs\"),1,IF(AND(V334=\"provincia\",X334=\"48hrs\"),2,NETWORKDAYS.INTL(D334,M334,11,'Dias Feriados'!$A$1:$A$15))))","v":-39255}]
["B001667413","May","2025-05-27","2025-05-28","G/I. 030-10132",334,"LESLEY MARICELA AIJA CANDELA","AAHH ASUNCIN 8 MZ J1 LT 12 A 2 CDRA DEL PARQUE ASUNCION 8","Provincia","CAÑETE","IMPERIAL","B001667413",null,"En Ruta",9730017542,"F",202508,203201,"En Ruta","Dia 1","CARMEL","PROVINCIA",{"$f":"NETWORKDAYS.INTL(D335,M335,11,'Dias Feriados'!$A$1:$A$15)","v":-39255},"En Ruta",22,"NO",null,0.9375,0.94722222222222219,1,"HUAMAN QUI","2025-05-28",null,null,45804,"",{"$f":"IF(AS335=\"Devuelto\",\"\",IF(X335=\"24hrs\",\"Entregado\",CONSOLIDADO!S335))","v":"En Ruta"},"",{"$f":"IF(AK335=\"Entregado\",\"\",IF(X335=\"24hrs\",\"\",IF(X335=\"48hrs\",\"Entregado\",CONSOLIDADO!S335)))","v":"En Ruta"},"",{"$f":"IF(AK335=\"Entregado\",\"\",IF(OR(X335=\"24hrs\",X335=\"48hrs\"),\"\",IF(X335=\"72hrs\",\"Entregado\",CONSOLIDADO!S335)))","v":"En Ruta"},"",{"$f":"IF(AK335=\"Entregado\",\"\",IF(OR(X335=\"24hrs\",X335=\"48hrs\",X335=\"72hrs\"),\"\",IF(X335=\"+72hrs\",\"Entregado\",CONSOLIDADO!S335)))","v":"En Ruta"},"","En Ruta",1,0,0,0,0,1,0,"No Entregado",0,0,1,0,{"$f":"IF(V335=\"Lima\",NETWORKDAYS.INTL(D335,M335,11,'Dias Feriados'!$A$1:$A$15),IF(AND(V335=\"provincia\",X335=\"24hrs\"),1,IF(AND(V335=\"provincia\",X335=\"48hrs\"),2,NETWORKDAYS.INTL(D335,M335,11,'Dias Feriados'!$A$1:$A$15))))","v":-39255}]
["B001667465","May","2025-05-27","2025-05-28","G/I. 030-10132",335,"PABLO CESAR NAVARRO GUTIERREZ","CALAS PALMAS 1 MZ T LT 21 CASA ROJA CON TIENDA AFUERA DIGNIDAD NACIONAL","Provincia","CAÑETE","MALA","B001667465",null,"En Ruta",9730017020,"F",202508,203201,"En Ruta","Dia 1","CARMEL","PROVINCIA",{"$f":"NETWORKDAYS.INTL(D336,M336,11,'Dias Feriados'!$A$1:$A$15)","v":-39255},"En Ruta",22,"NO",null,0.9375,0.94722222222222219,1,"HUAMAN QUI","2025-05-28",null,null,45804,"",{"$f":"IF(AS336=\"Devuelto\",\"\",IF(X336=\"24hrs\",\"Entregado\",CONSOLIDADO!S336))","v":"En Ruta"},"",{"$f":"IF(AK336=\"Entregado\",\"\",IF(X336=\"24hrs\",\"\",IF(X336=\"48hrs\",\"Entregado\",CONSOLIDADO!S336)))","v":"En Ruta"},"",{"$f":"IF(AK336=\"Entregado\",\"\",IF(OR(X336=\"24hrs\",X336=\"48hrs\"),\"\",IF(X336=\"72hrs\",\"Entregado\",CONSOLIDADO!S336)))","v":"En Ruta"},"",{"$f":"IF(AK336=\"Entregado\",\"\",IF(OR(X336=\"24hrs\",X336=\"48hrs\",X336=\"72hrs\"),\"\",IF(X336=\"+72hrs\",\"Entregado\",CONSOLIDADO!S336)))","v":"En Ruta"},"","En Ruta",1,0,0,0,0,1,0,"No Entregado",0,0,1,0,{"$f":"IF(V336=\"Lima\",NETWORKDAYS.INTL(D336,M336,11,'Dias Feriados'!$A$1:$A$15),IF(AND(V336=\"provincia\",X336=\"24hrs\"),1,IF(AND(V336=\"provincia\",X336=\"48hrs\"),2,NETWORKDAYS.INTL(D336,M336,11,'Dias Feriados'!$A$1:$A$15))))","v":-39255}]
["B001667587","May","2025-05-27","2025-05-28","G/I. 030-10132",336,"MARITZA RENGIFO MANIHUARI","MZ I LT 5 AAHH SANTA ROSA DE LA LOZA DE SANTA ROSA","Provincia","CAÑETE","MALA","B001667587",null,"En Ruta",9730017126,"F",202508,203201,"En Ruta","Dia 1","CARMEL","PROVINCIA",{"$f":"NETWORKDAYS.INTL(D337,M337,11,'Dias Feriados'!$A$1:$A$15)","v":-39255},"En Ruta",22,"NO",null,0.9375,0.94722222222222219,1,"HUAMAN QUI","2025-05-28",null,null,45804,"",{"$f":"IF(AS337=\"Devuelto\",\"\",IF(X337=\"24hrs\",\"Entregado\",CONSOLIDADO!S337))","v":"En Ruta"},"",{"$f":"IF(AK337=\"Entregado\",\"\",IF(X337=\"24hrs\",\"\",IF(X337=\"48hrs\",\"Entregado\",CONSOLIDADO!S337)))","v":"En Ruta"},"",{"$f":"IF(AK337=\"Entregado\",\"\",IF(OR(X337=\"24hrs\",X337=\"48hrs\"),\"\",IF(X337=\"72hrs\",\"Entregado\",CONSOLIDADO!S337)))","v":"En Ruta"},"",{"$f":"IF(AK337=\"Entregado\",\"\",IF(OR(X337=\"24hrs\",X337=\"48hrs\",X337=\"72hrs\"),\"\",IF(X337=\"+72hrs\",\"Entregado\",CONSOLIDADO!S337)))","v":"En Ruta"},"","En Ruta",1,0,0,0,0,1,0,"No Entregado",0,0,1,0,{"$f":"IF(V337=\"Lima\",NETWORKDAYS.INTL(D337,M337,11,'Dias Feriados'!$A$1:$A$15),IF(AND(V337=\"provincia\",X337=\"24hrs\"),1,IF(AND(V337=\"provincia\",X337=\"48hrs\"),2,NETWORKDAYS.INTL(D337,M337,11,'Dias Feriados'!$A$1:$A$15))))","v":-39255}]
["B001667498","May","2025-05-27","2025-05-28","G/I. 030-10132",337,"JHANET ANGELA HOYOS JHANET ANG","CL PROGRESO SUR MZ N LT 14 SANTA RO FRT A LA CAPILLA PARTE ALTA","Provincia","CAÑETE","MALA","B001667498",null,"En Ruta",9730017501,"F",202508,203201,"En Ruta","Dia 1","CARMEL","PROVINCIA",{"$f":"NETWORKDAYS.INTL(D338,M338,11,'Dias Feriados'!$A$1:$A$15)","v":-39255},"En Ruta",22,"NO",null,0.9375,0.94722222222222219,1,"HUAMAN QUI","2025-05-28",null,null,45804,"",{"$f":"IF(AS338=\"Devuelto\",\"\",IF(X338=\"24hrs\",\"Entregado\",CONSOLIDADO!S338))","v":"En Ruta"},"",{"$f":"IF(AK338=\"Entregado\",\"\",IF(X338=\"24hrs\",\"\",IF(X338=\"48hrs\",\"Entregado\",CONSOLIDADO!S338)))","v":"En Ruta"},"",{"$f":"IF(AK338=\"Entregado\",\"\",IF(OR(X338=\"24hrs\",X338=\"48hrs\"),\"\",IF(X338=\"72hrs\",\"Entregado\",CONSOLIDADO!S338)))","v":"En Ruta"},"",{"$f":"IF(AK338=\"Entregado\",\"\",IF(OR(X338=\"24hrs\",X338=\"48hrs\",X338=\"72hrs\"),\"\",IF(X338=\"+72hrs\",\"Entregado\",CONSOLIDADO!S338)))","v":"En Ruta"},"","En Ruta",1,0,0,0,0,1,0,"No Entregado",0,0,1,0,{"$f":"IF(V338=\"Lima\",NETWORKDAYS.INTL(D338,M338,11,'Dias Feriados'!$A$1:$A$15),IF(AND(V338=\"provincia\",X338=\"24hrs\"),1,IF(AND(V338=\"provincia\",X338=\"48hrs\"),2,NETWORKDAYS.INTL(D338,M338,11,'Dias Feriados'!$A$1:$A$15))))","v":-39255}]
["B001668348","May","2025-05-27","2025-05-28","G/I. 030-10132",338,"JANETT YAZMIM PUCHO RAMOS","C P CARMEN ALTO MZ51 LT 19 DEL PARADERO DE AUTOS","Provincia","CAÑETE","NUEVO IMPERIAL","B001668348",null,"En Ruta",9730017166,"F",202508,203201,"En Ruta","Dia 1","CARMEL","PROVINCIA",{"$f":"NETWORKDAYS.INTL(D339,M339,11,'Dias Feriados'!$A$1:$A$15)","v":-39255},"En Ruta",22,"NO",null,0.9375,0.94722222222222219,1,"HUAMAN QUI","2025-05-28",null,null,45804,"",{"$f":"IF(AS339=\"Devuelto\",\"\",IF(X339=\"24hrs\",\"Entregado\",CONSOLIDADO!S339))","v":"En Ruta"},"",{"$f":"IF(AK339=\"Entregado\",\"\",IF(X339=\"24hrs\",\"\",IF(X339=\"48hrs\",\"Entregado\",CONSOLIDADO!S339)))","v":"En Ruta"},"",{"$f":"IF(AK339=\"Entregado\",\"\",IF(OR(X339=\"24hrs\",X339=\"48hrs\"),\"\",IF(X339=\"72hrs\",\"Entregado\",CONSOLIDADO!S339)))","v":"En Ruta"},"",{"$f":"IF(AK339=\"Entregado\",\"\",IF(OR(X339=\"24hrs\",X339=\"48hrs\",X339=\"72hrs\"),\"\",IF(X339=\"+72hrs\",\"Entregado\",CONSOLIDADO!S339)))","v":"En Ruta"},"","En Ruta",1,0,0,0,0,1,0,"No Entregado",0,0,1,0,{"$f":"IF(V339=\"Lima\",NETWORKDAYS.INTL(D339,M339,11,'Dias Feriados'!$A$1:$A$15),IF(AND(V339=\"provincia\",X339=\"24hrs\"),1,IF(AND(V339=\"provincia\",X339=\"48hrs\"),2,NETWORKDAYS.INTL(D339,M339,11,'Dias Feriados'!$A$1:$A$15))))","v":-39255}]
["B001667744","May","2025-05-27","2025-05-28","G/I. 030-10132",339,"YACQUELINE ROXANA NANEZ RODRIG","SANTA JUANA MAZA MZ A LT 15 ENTRADA DE ALMENARES FRENTE A MECANICO CALLE SANTA JUANA MAZA","Provincia","CAÑETE","NUEVO IMPERIAL","B001667744",null,"En Ruta",9730017319,"F",202508,203201,"En Ruta","Dia 1","CARMEL","PROVINCIA",{"$f":"NETWORKDAYS.INTL(D340,M340,11,'Dias Feriados'!$A$1:$A$15)","v":-39255},"En Ruta",22,"NO",null,0.9375,0.94722222222222219,1,"HUAMAN QUI","2025-05-28",null,null,45804,"",{"$f":"IF(AS340=\"Devuelto\",\"\",IF(X340=\"24hrs\",\"Entregado\",CONSOLIDADO!S340))","v":"En Ruta"},"",{"$f":"IF(AK340=\"Entregado\",\"\",IF(X340=\"24hrs\",\"\",IF(X340=\"48hrs\",\"Entregado\",CONSOLIDADO!S340)))","v":"En Ruta"},"",{"$f":"IF(AK340=\"Entregado\",\"\",IF(OR(X340=\"24hrs\",X340=\"48hrs\"),\"\",IF(X340=\"72hrs\",\"Entregado\",CONSOLIDADO!S340)))","v":"En Ruta"},"",{"$f":"IF(AK340=\"Entregado\",\"\",IF(OR(X340=\"24hrs\",X340=\"48hrs\",X340=\"72hrs\"),\"\",IF(X340=\"+72hrs\",\"Entregado\",CONSOLIDADO!S340)))","v":"En Ruta"},"","En Ruta",1,0,0,0,0,1,0,"No Entregado",0,0,1,0,{"$f":"IF(V340=\"Lima\",NETWORKDAYS.INTL(D340,M340,11,'Dias Feriados'!$A$1:$A$15),IF(AND(V340=\"provincia\",X340=\"24hrs\"),1,IF(AND(V340=\"provincia\",X340=\"48hrs\"),2,NETWORKDAYS.INTL(D340,M340,11,'Dias Feriados'!$A$1:$A$15))))","v":-39255}]
["B001667632","May","2025-05-27","2025-05-28","G/I. 030-10132",340,"GLADYS MARGOT ACUNA CAMPOS","PUEBLO NUEVO DE CONTA AV DOS DE MAYO MZ N1 LT 6 FRENTE AL ESTADIO","Provincia","CAÑETE","NUEVO IMPERIAL","B001667632",null,"En Ruta",9730017371,"F",202508,203201,"En Ruta","Dia 1","CARMEL","PROVINCIA",{"$f":"NETWORKDAYS.INTL(D341,M341,11,'Dias Feriados'!$A$1:$A$15)","v":-39255},"En Ruta",22,"NO",null,0.9375,0.94722222222222219,1,"HUAMAN QUI","2025-05-28",null,null,45804,"",{"$f":"IF(AS341=\"Devuelto\",\"\",IF(X341=\"24hrs\",\"Entregado\",CONSOLIDADO!S341))","v":"En Ruta"},"",{"$f":"IF(AK341=\"Entregado\",\"\",IF(X341=\"24hrs\",\"\",IF(X341=\"48hrs\",\"Entregado\",CONSOLIDADO!S341)))","v":"En Ruta"},"",{"$f":"IF(AK341=\"Entregado\",\"\",IF(OR(X341=\"24hrs\",X341=\"48hrs\"),\"\",IF(X341=\"72hrs\",\"Entregado\",CONSOLIDADO!S341)))","v":"En Ruta"},"",{"$f":"IF(AK341=\"Entregado\",\"\",IF(OR(X341=\"24hrs\",X341=\"48hrs\",X341=\"72hrs\"),\"\",IF(X341=\"+72hrs\",\"Entregado\",CONSOLIDADO!S341)))","v":"En Ruta"},"","En Ruta",1,0,0,0,0,1,0,"No Entregado",0,0,1,0,{"$f":"IF(V341=\"Lima\",NETWORKDAYS.INTL(D341,M341,11,'Dias Feriados'!$A$1:$A$15),IF(AND(V341=\"provincia\",X341=\"24hrs\"),1,IF(AND(V341=\"provincia\",X341=\"48hrs\"),2,NETWORKDAYS.INTL(D341,M341,11,'Dias Feriados'!$A$1:$A$15))))","v":-39255}]
["B001667729","May","2025-05-27","2025-05-28","G/I. 030-10132",341,"JULIA MILAGROS CHUI MAMANI","CL CHEPEN MZ J4 LT 22 HOSPEDAJE LA POSADA DE HABRAHAM","Provincia","CAÑETE","NUEVO IMPERIAL","B001667729",null,"En Ruta",9730017521,"F",202508,203201,"En Ruta","Dia 1","CARMEL","PROVINCIA",{"$f":"NETWORKDAYS.INTL(D342,M342,11,'Dias Feriados'!$A$1:$A$15)","v":-39255},"En Ruta",22,"NO",null,0.9375,0.94722222222222219,1,"HUAMAN QUI","2025-05-28",null,null,45804,"",{"$f":"IF(AS342=\"Devuelto\",\"\",IF(X342=\"24hrs\",\"Entregado\",CONSOLIDADO!S342))","v":"En Ruta"},"",{"$f":"IF(AK342=\"Entregado\",\"\",IF(X342=\"24hrs\",\"\",IF(X342=\"48hrs\",\"Entregado\",CONSOLIDADO!S342)))","v":"En Ruta"},"",{"$f":"IF(AK342=\"Entregado\",\"\",IF(OR(X342=\"24hrs\",X342=\"48hrs\"),\"\",IF(X342=\"72hrs\",\"Entregado\",CONSOLIDADO!S342)))","v":"En Ruta"},"",{"$f":"IF(AK342=\"Entregado\",\"\",IF(OR(X342=\"24hrs\",X342=\"48hrs\",X342=\"72hrs\"),\"\",IF(X342=\"+72hrs\",\"Entregado\",CONSOLIDADO!S342)))","v":"En Ruta"},"","En Ruta",1,0,0,0,0,1,0,"No Entregado",0,0,1,0,{"$f":"IF(V342=\"Lima\",NETWORKDAYS.INTL(D342,M342,11,'Dias Feriados'!$A$1:$A$15),IF(AND(V342=\"provincia\",X342=\"24hrs\"),1,IF(AND(V342=\"provincia\",X342=\"48hrs\"),2,NETWORKDAYS.INTL(D342,M342,11,'Dias Feriados'!$A$1:$A$15))))","v":-39255}]
["B001667656","May","2025-05-27","2025-05-28","G/I. 030-10132",342,"DENYS ZORAIDA CANDELA ASIN","CL MANCHEGO MUNOZ 369 MUNICIPIPALIDAD","Provincia","CAÑETE","NUEVO IMPERIAL","B001667656",null,"En Ruta",9730017536,"F",202508,203201,"En Ruta","Dia 1","CARMEL","PROVINCIA",{"$f":"NETWORKDAYS.INTL(D343,M343,11,'Dias Feriados'!$A$1:$A$15)","v":-39255},"En Ruta",22,"NO",null,0.9375,0.94722222222222219,1,"HUAMAN QUI","2025-05-28",null,null,45804,"",{"$f":"IF(AS343=\"Devuelto\",\"\",IF(X343=\"24hrs\",\"Entregado\",CONSOLIDADO!S343))","v":"En Ruta"},"",{"$f":"IF(AK343=\"Entregado\",\"\",IF(X343=\"24hrs\",\"\",IF(X343=\"48hrs\",\"Entregado\",CONSOLIDADO!S343)))","v":"En Ruta"},"",{"$f":"IF(AK343=\"Entregado\",\"\",IF(OR(X343=\"24hrs\",X343=\"48hrs\"),\"\",IF(X343=\"72hrs\",\"Entregado\",CONSOLIDADO!S343)))","v":"En Ruta"},"",{"$f":"IF(AK343=\"Entregado\",\"\",IF(OR(X343=\"24hrs\",X343=\"48hrs\",X343=\"72hrs\"),\"\",IF(X343=\"+72hrs\",\"Entregado\",CONSOLIDADO!S343)))","v":"En Ruta"},"","En Ruta",1,0,0,0,0,1,0,"No Entregado",0,0,1,0,{"$f":"IF(V343=\"Lima\",NETWORKDAYS.INTL(D343,M343,11,'Dias Feriados'!$A$1:$A$15),IF(AND(V343=\"provincia\",X343=\"24hrs\"),1,IF(AND(V343=\"provincia\",X343=\"48hrs\"),2,NETWORKDAYS.INTL(D343,M343,11,'Dias Feriados'!$A$1:$A$15))))","v":-39255}]
["B001667671","May","2025-05-27","2025-05-28","G/I. 030-10132",343,"OLGA ALINA HUAMAN TALLA","JR PUNTO ODOMTOLO GUZMAN 550 FRENTE ODONTOLOGO DERLY JR PUNTO ODOMTOLO GUZMAN QUILMANA","Provincia","CAÑETE","QUILMANA","B001667671","2025-05-28","Entregado",9730017412,"F",202508,203201,"Entregado","Dia 1","CARMEL","PROVINCIA",{"$f":"NETWORKDAYS.INTL(D344,M344,11,'Dias Feriados'!$A$1:$A$15)","v":1},"24hrs",22,"NO",null,0.9375,0.94722222222222219,1,"HUAMAN QUI","2025-05-28",null,null,45804,45805,{"$f":"IF(AS344=\"Devuelto\",\"\",IF(X344=\"24hrs\",\"Entregado\",CONSOLIDADO!S344))","v":"Entregado"},"",{"$f":"IF(AK344=\"Entregado\",\"\",IF(X344=\"24hrs\",\"\",IF(X344=\"48hrs\",\"Entregado\",CONSOLIDADO!S344)))","v":""},"",{"$f":"IF(AK344=\"Entregado\",\"\",IF(OR(X344=\"24hrs\",X344=\"48hrs\"),\"\",IF(X344=\"72hrs\",\"Entregado\",CONSOLIDADO!S344)))","v":""},"",{"$f":"IF(AK344=\"Entregado\",\"\",IF(OR(X344=\"24hrs\",X344=\"48hrs\",X344=\"72hrs\"),\"\",IF(X344=\"+72hrs\",\"Entregado\",CONSOLIDADO!S344)))","v":""},45805,"Entregado",1,1,0,0,0,0,0,"A Tiempo",1,0,0,0,{"$f":"IF(V344=\"Lima\",NETWORKDAYS.INTL(D344,M344,11,'Dias Feriados'!$A$1:$A$15),IF(AND(V344=\"provincia\",X344=\"24hrs\"),1,IF(AND(V344=\"provincia\",X344=\"48hrs\"),2,NETWORKDAYS.INTL(D344,M344,11,'Dias Feriados'!$A$1:$A$15))))","v":1}]
["B001667672","May","2025-05-27","2025-05-28","G/I. 030-10132",344,"OLGA LIDIA TALLA LUYO","JR PUNO 550 ODOMTOLO GUZMAN","Provincia","CAÑETE","QUILMANA","B001667672","2025-05-28","Entregado",9730017427,"F",202508,203201,"Entregado","Dia 1","CARMEL","PROVINCIA",{"$f":"NETWORKDAYS.INTL(D345,M345,11,'Dias Feriados'!$A$1:$A$15)","v":1},"24hrs",22,"NO",null,0.9375,0.94722222222222219,1,"HUAMAN QUI","2025-05-28",null,null,45804,45805,{"$f":"IF(AS345=\"Devuelto\",\"\",IF(X345=\"24hrs\",\"Entregado\",CONSOLIDADO!S345))","v":"Entregado"},"",{"$f":"IF(AK345=\"Entregado\",\"\",IF(X345=\"24hrs\",\"\",IF(X345=\"48hrs\",\"Entregado\",CONSOLIDADO!S345)))","v":""},"",{"$f":"IF(AK345=\"Entregado\",\"\",IF(OR(X345=\"24hrs\",X345=\"48hrs\"),\"\",IF(X345=\"72hrs\",\"Entregado\",CONSOLIDADO!S345)))","v":""},"",{"$f":"IF(AK345=\"Entregado\",\"\",IF(OR(X345=\"24hrs\",X345=\"48hrs\",X345=\"72hrs\"),\"\",IF(X345=\"+72hrs\",\"Entregado\",CONSOLIDADO!S345)))","v":""},45805,"Entregado",1,1,0,0,0,0,0,"A Tiempo",1,0,0,0,{"$f":"IF(V345=\"Lima\",NETWORKDAYS.INTL(D345,M345,11,'Dias Feriados'!$A$1:$A$15),IF(AND(V345=\"provincia\",X345=\"24hrs\"),1,IF(AND(V345=\"provincia\",X345=\"48hrs\"),2,NETWORKDAYS.INTL(D345,M345,11,'Dias Feriados'!$A$1:$A$15))))","v":1}]
["B001667768","May","2025-05-27","2025-05-28","G/I. 030-10132",345,"LINDA KIM FLORES RIVAS","AV LIBERTAD 120 AV PRINCIPAL POSTA MEDICA","Provincia","CAÑETE","SAN ANTONIO","B001667768",null,"En Ruta",9730017267,"F",202508,203201,"En Ruta","Dia 1","CARMEL","PROVINCIA",{"$f":"NETWORKDAYS.INTL(D346,M346,11,'Dias Feriados'!$A$1:$A$15)","v":-39255},"En Ruta",22,"NO",null,0.9375,0.94722222222222219,1,"HUAMAN QUI","2025-05-28",null,null,45804,"",{"$f":"IF(AS346=\"Devuelto\",\"\",IF(X346=\"24hrs\",\"Entregado\",CONSOLIDADO!S346))","v":"En Ruta"},"",{"$f":"IF(AK346=\"Entregado\",\"\",IF(X346=\"24hrs\",\"\",IF(X346=\"48hrs\",\"Entregado\",CONSOLIDADO!S346)))","v":"En Ruta"},"",{"$f":"IF(AK346=\"Entregado\",\"\",IF(OR(X346=\"24hrs\",X346=\"48hrs\"),\"\",IF(X346=\"72hrs\",\"Entregado\",CONSOLIDADO!S346)))","v":"En Ruta"},"",{"$f":"IF(AK346=\"Entregado\",\"\",IF(OR(X346=\"24hrs\",X346=\"48hrs\",X346=\"72hrs\"),\"\",IF(X346=\"+72hrs\",\"Entregado\",CONSOLIDADO!S346)))","v":"En Ruta"},"","En Ruta",1,0,0,0,0,1,0,"No Entregado",0,0,1,0,{"$f":"IF(V346=\"Lima\",NETWORKDAYS.INTL(D346,M346,11,'Dias Feriados'!$A$1:$A$15),IF(AND(V346=\"provincia\",X346=\"24hrs\"),1,IF(AND(V346=\"provincia\",X346=\"48hrs\"),2,NETWORKDAYS.INTL(D346,M346,11,'Dias Feriados'!$A$1:$A$15))))","v":-39255}]
["B001667588","May","2025-05-27","2025-05-28","G/I. 030-10132",346,"MELISSA SOLANGE RAMOS PICHIS","PLAZA DE ARMAS 120 LA QUINTA","Provincia","CAÑETE","SAN LUIS","B001667588",null,"En Ruta",9730017295,"F",202508,203201,"En Ruta","Dia 1","CARMEL","PROVINCIA",{"$f":"NETWORKDAYS.INTL(D347,M347,11,'Dias Feriados'!$A$1:$A$15)","v":-39255},"En Ruta",22,"NO",null,0.9375,0.94722222222222219,1,"HUAMAN QUI","2025-05-28",null,null,45804,"",{"$f":"IF(AS347=\"Devuelto\",\"\",IF(X347=\"24hrs\",\"Entregado\",CONSOLIDADO!S347))","v":"En Ruta"},"",{"$f":"IF(AK347=\"Entregado\",\"\",IF(X347=\"24hrs\",\"\",IF(X347=\"48hrs\",\"Entregado\",CONSOLIDADO!S347)))","v":"En Ruta"},"",{"$f":"IF(AK347=\"Entregado\",\"\",IF(OR(X347=\"24hrs\",X347=\"48hrs\"),\"\",IF(X347=\"72hrs\",\"Entregado\",CONSOLIDADO!S347)))","v":"En Ruta"},"",{"$f":"IF(AK347=\"Entregado\",\"\",IF(OR(X347=\"24hrs\",X347=\"48hrs\",X347=\"72hrs\"),\"\",IF(X347=\"+72hrs\",\"Entregado\",CONSOLIDADO!S347)))","v":"En Ruta"},"","En Ruta",1,0,0,0,0,1,0,"No Entregado",0,0,1,0,{"$f":"IF(V347=\"Lima\",NETWORKDAYS.INTL(D347,M347,11,'Dias Feriados'!$A$1:$A$15),IF(AND(V347=\"provincia\",X347=\"24hrs\"),1,IF(AND(V347=\"provincia\",X347=\"48hrs\"),2,NETWORKDAYS.INTL(D347,M347,11,'Dias Feriados'!$A$1:$A$15))))","v":-39255}]
["B001667444","May","2025-05-27","2025-05-28","G/I. 030-10132",347,"NAGELY JANETH HUAMANI CHUMPITA","SANTA ROSA MZ A LT 10 LOCAL UPIS SAN CRISTOBAL","Provincia","CAÑETE","SAN LUIS","B001667444",null,"En Ruta",9730017309,"F",202508,203201,"En Ruta","Dia 1","CARMEL","PROVINCIA",{"$f":"NETWORKDAYS.INTL(D348,M348,11,'Dias Feriados'!$A$1:$A$15)","v":-39255},"En Ruta",22,"NO",null,0.9375,0.94722222222222219,1,"HUAMAN QUI","2025-05-28",null,null,45804,"",{"$f":"IF(AS348=\"Devuelto\",\"\",IF(X348=\"24hrs\",\"Entregado\",CONSOLIDADO!S348))","v":"En Ruta"},"",{"$f":"IF(AK348=\"Entregado\",\"\",IF(X348=\"24hrs\",\"\",IF(X348=\"48hrs\",\"Entregado\",CONSOLIDADO!S348)))","v":"En Ruta"},"",{"$f":"IF(AK348=\"Entregado\",\"\",IF(OR(X348=\"24hrs\",X348=\"48hrs\"),\"\",IF(X348=\"72hrs\",\"Entregado\",CONSOLIDADO!S348)))","v":"En Ruta"},"",{"$f":"IF(AK348=\"Entregado\",\"\",IF(OR(X348=\"24hrs\",X348=\"48hrs\",X348=\"72hrs\"),\"\",IF(X348=\"+72hrs\",\"Entregado\",CONSOLIDADO!S348)))","v":"En Ruta"},"","En Ruta",1,0,0,0,0,1,0,"No Entregado",0,0,1,0,{"$f":"IF(V348=\"Lima\",NETWORKDAYS.INTL(D348,M348,11,'Dias Feriados'!$A$1:$A$15),IF(AND(V348=\"provincia\",X348=\"24hrs\"),1,IF(AND(V348=\"provincia\",X348=\"48hrs\"),2,NETWORKDAYS.INTL(D348,M348,11,'Dias Feriados'!$A$1:$A$15))))","v":-39255}]
["B001667705","May","2025-05-27","2025-05-28","G/I. 030-10132",348,"MARIA MERCEDES MANCO ORELLANA","CL COMERCIO 109 DE LA COLONIA CHINA A LA MANO DEREC","Provincia","CAÑETE","SAN LUIS","B001667705",null,"En Ruta",9730017445,"F",202508,203201,"En Ruta","Dia 1","CARMEL","PROVINCIA",{"$f":"NETWORKDAYS.INTL(D349,M349,11,'Dias Feriados'!$A$1:$A$15)","v":-39255},"En Ruta",22,"NO",null,0.9375,0.94722222222222219,1,"HUAMAN QUI","2025-05-28",null,null,45804,"",{"$f":"IF(AS349=\"Devuelto\",\"\",IF(X349=\"24hrs\",\"Entregado\",CONSOLIDADO!S349))","v":"En Ruta"},"",{"$f":"IF(AK349=\"Entregado\",\"\",IF(X349=\"24hrs\",\"\",IF(X349=\"48hrs\",\"Entregado\",CONSOLIDADO!S349)))","v":"En Ruta"},"",{"$f":"IF(AK349=\"Entregado\",\"\",IF(OR(X349=\"24hrs\",X349=\"48hrs\"),\"\",IF(X349=\"72hrs\",\"Entregado\",CONSOLIDADO!S349)))","v":"En Ruta"},"",{"$f":"IF(AK349=\"Entregado\",\"\",IF(OR(X349=\"24hrs\",X349=\"48hrs\",X349=\"72hrs\"),\"\",IF(X349=\"+72hrs\",\"Entregado\",CONSOLIDADO!S349)))","v":"En Ruta"},"","En Ruta",1,0,0,0,0,1,0,"No Entregado",0,0,1,0,{"$f":"IF(V349=\"Lima\",NETWORKDAYS.INTL(D349,M349,11,'Dias Feriados'!$A$1:$A$15),IF(AND(V349=\"provincia\",X349=\"24hrs\"),1,IF(AND(V349=\"provincia\",X349=\"48hrs\"),2,NETWORKDAYS.INTL(D349,M349,11,'Dias Feriados'!$A$1:$A$15))))","v":-39255}]
["B001667640","May","2025-05-27","2025-05-28","G/I. 030-10132",349,"RAYDA LOPE ROBLES","MZ O LT 3 CP LA QUEBRADA EL RESERVORIO BARRIOS LOS ANGELES","Provincia","CAÑETE","SAN LUIS","B001667640",null,"En Ruta",9730017446,"F",202508,203201,"En Ruta","Dia 1","CARMEL","PROVINCIA",{"$f":"NETWORKDAYS.INTL(D350,M350,11,'Dias Feriados'!$A$1:$A$15)","v":-39255},"En Ruta",22,"NO",null,0.9375,0.94722222222222219,1,"HUAMAN QUI","2025-05-28",null,null,45804,"",{"$f":"IF(AS350=\"Devuelto\",\"\",IF(X350=\"24hrs\",\"Entregado\",CONSOLIDADO!S350))","v":"En Ruta"},"",{"$f":"IF(AK350=\"Entregado\",\"\",IF(X350=\"24hrs\",\"\",IF(X350=\"48hrs\",\"Entregado\",CONSOLIDADO!S350)))","v":"En Ruta"},"",{"$f":"IF(AK350=\"Entregado\",\"\",IF(OR(X350=\"24hrs\",X350=\"48hrs\"),\"\",IF(X350=\"72hrs\",\"Entregado\",CONSOLIDADO!S350)))","v":"En Ruta"},"",{"$f":"IF(AK350=\"Entregado\",\"\",IF(OR(X350=\"24hrs\",X350=\"48hrs\",X350=\"72hrs\"),\"\",IF(X350=\"+72hrs\",\"Entregado\",CONSOLIDADO!S350)))","v":"En Ruta"},"","En Ruta",1,0,0,0,0,1,0,"No Entregado",0,0,1,0,{"$f":"IF(V350=\"Lima\",NETWORKDAYS.INTL(D350,M350,11,'Dias Feriados'!$A$1:$A$15),IF(AND(V350=\"provincia\",X350=\"24hrs\"),1,IF(AND(V350=\"provincia\",X350=\"48hrs\"),2,NETWORKDAYS.INTL(D350,M350,11,'Dias Feriados'!$A$1:$A$15))))","v":-39255}]
["B001667727","May","2025-05-27","2025-05-28","G/I. 030-10132",350,"CINTHIA MARIELA ESCALANTE PERE","CLL SANTOS MZ I LT 74B CASA 2 PISOS CENT POBLADO LAURA CALLER","Provincia","CAÑETE","SAN LUIS","B001667727",null,"En Ruta",9730017477,"F",202508,203201,"En Ruta","Dia 1","CARMEL","PROVINCIA",{"$f":"NETWORKDAYS.INTL(D351,M351,11,'Dias Feriados'!$A$1:$A$15)","v":-39255},"En Ruta",22,"NO",null,0.9375,0.94722222222222219,1,"HUAMAN QUI","2025-05-28",null,null,45804,"",{"$f":"IF(AS351=\"Devuelto\",\"\",IF(X351=\"24hrs\",\"Entregado\",CONSOLIDADO!S351))","v":"En Ruta"},"",{"$f":"IF(AK351=\"Entregado\",\"\",IF(X351=\"24hrs\",\"\",IF(X351=\"48hrs\",\"Entregado\",CONSOLIDADO!S351)))","v":"En Ruta"},"",{"$f":"IF(AK351=\"Entregado\",\"\",IF(OR(X351=\"24hrs\",X351=\"48hrs\"),\"\",IF(X351=\"72hrs\",\"Entregado\",CONSOLIDADO!S351)))","v":"En Ruta"},"",{"$f":"IF(AK351=\"Entregado\",\"\",IF(OR(X351=\"24hrs\",X351=\"48hrs\",X351=\"72hrs\"),\"\",IF(X351=\"+72hrs\",\"Entregado\",CONSOLIDADO!S351)))","v":"En Ruta"},"","En Ruta",1,0,0,0,0,1,0,"No Entregado",0,0,1,0,{"$f":"IF(V351=\"Lima\",NETWORKDAYS.INTL(D351,M351,11,'Dias Feriados'!$A$1:$A$15),IF(AND(V351=\"provincia\",X351=\"24hrs\"),1,IF(AND(V351=\"provincia\",X351=\"48hrs\"),2,NETWORKDAYS.INTL(D351,M351,11,'Dias Feriados'!$A$1:$A$15))))","v":-39255}]
["B001668232","May","2025-05-27","2025-05-28","G/I. 030-10132",351,"ROSARIO MILAGROS SUENG CHAVEZ","FRENTE PIZZERIA 507 MEDIA CDRA DE PLAZA DE ARMAS CALLE COMERCIO","Provincia","CAÑETE","SAN LUIS","B001668232",null,"En Ruta",9730017581,"F",202508,203201,"En Ruta","Dia 1","CARMEL","PROVINCIA",{"$f":"NETWORKDAYS.INTL(D352,M352,11,'Dias Feriados'!$A$1:$A$15)","v":-39255},"En Ruta",22,"NO",null,0.9375,0.94722222222222219,1,"HUAMAN QUI","2025-05-28",null,null,45804,"",{"$f":"IF(AS352=\"Devuelto\",\"\",IF(X352=\"24hrs\",\"Entregado\",CONSOLIDADO!S352))","v":"En Ruta"},"",{"$f":"IF(AK352=\"Entregado\",\"\",IF(X352=\"24hrs\",\"\",IF(X352=\"48hrs\",\"Entregado\",CONSOLIDADO!S352)))","v":"En Ruta"},"",{"$f":"IF(AK352=\"Entregado\",\"\",IF(OR(X352=\"24hrs\",X352=\"48hrs\"),\"\",IF(X352=\"72hrs\",\"Entregado\",CONSOLIDADO!S352)))","v":"En Ruta"},"",{"$f":"IF(AK352=\"Entregado\",\"\",IF(OR(X352=\"24hrs\",X352=\"48hrs\",X352=\"72hrs\"),\"\",IF(X352=\"+72hrs\",\"Entregado\",CONSOLIDADO!S352)))","v":"En Ruta"},"","En Ruta",1,0,0,0,0,1,0,"No Entregado",0,0,1,0,{"$f":"IF(V352=\"Lima\",NETWORKDAYS.INTL(D352,M352,11,'Dias Feriados'!$A$1:$A$15),IF(AND(V352=\"provincia\",X352=\"24hrs\"),1,IF(AND(V352=\"provincia\",X352=\"48hrs\"),2,NETWORKDAYS.INTL(D352,M352,11,'Dias Feriados'!$A$1:$A$15))))","v":-39255}]
["B001667732","May","2025-05-27","2025-05-28","G/I. 030-10132",352,"RUTH ELIZABETH OJEDA OCHOA","AV MARISCAL BENAVIDES MZ P LT 41 GRIFO PRIMAX SINDICATO DE CHOFERES","Provincia","CAÑETE","SAN VICENTE DE CAÑETE","B001667732",null,"En Ruta",9730017096,"F",202508,203201,"En Ruta","Dia 1","CARMEL","PROVINCIA",{"$f":"NETWORKDAYS.INTL(D353,M353,11,'Dias Feriados'!$A$1:$A$15)","v":-39255},"En Ruta",22,"NO",null,0.9375,0.94722222222222219,1,"HUAMAN QUI","2025-05-28",null,null,45804,"",{"$f":"IF(AS353=\"Devuelto\",\"\",IF(X353=\"24hrs\",\"Entregado\",CONSOLIDADO!S353))","v":"En Ruta"},"",{"$f":"IF(AK353=\"Entregado\",\"\",IF(X353=\"24hrs\",\"\",IF(X353=\"48hrs\",\"Entregado\",CONSOLIDADO!S353)))","v":"En Ruta"},"",{"$f":"IF(AK353=\"Entregado\",\"\",IF(OR(X353=\"24hrs\",X353=\"48hrs\"),\"\",IF(X353=\"72hrs\",\"Entregado\",CONSOLIDADO!S353)))","v":"En Ruta"},"",{"$f":"IF(AK353=\"Entregado\",\"\",IF(OR(X353=\"24hrs\",X353=\"48hrs\",X353=\"72hrs\"),\"\",IF(X353=\"+72hrs\",\"Entregado\",CONSOLIDADO!S353)))","v":"En Ruta"},"","En Ruta",1,0,0,0,0,1,0,"No Entregado",0,0,1,0,{"$f":"IF(V353=\"Lima\",NETWORKDAYS.INTL(D353,M353,11,'Dias Feriados'!$A$1:$A$15),IF(AND(V353=\"provincia\",X353=\"24hrs\"),1,IF(AND(V353=\"provincia\",X353=\"48hrs\"),2,NETWORKDAYS.INTL(D353,M353,11,'Dias Feriados'!$A$1:$A$15))))","v":-39255}]
["B001667572","May","2025-05-27","2025-05-28","G/I. 030-10132",353,"ARIANA YAMILLE HUAMANNAHUI SAN","PASAJE TREBOL 7MA CASA LT 7 POR LA IGLESIA CARMELITA PSJE TREBOL VIALES SN KM144","Provincia","CAÑETE","SAN VICENTE DE CAÑETE","B001667572",null,"En Ruta",9730017104,"F",202508,203201,"En Ruta","Dia 1","CARMEL","PROVINCIA",{"$f":"NETWORKDAYS.INTL(D354,M354,11,'Dias Feriados'!$A$1:$A$15)","v":-39255},"En Ruta",22,"NO",null,0.9375,0.94722222222222219,1,"HUAMAN QUI","2025-05-28",null,null,45804,"",{"$f":"IF(AS354=\"Devuelto\",\"\",IF(X354=\"24hrs\",\"Entregado\",CONSOLIDADO!S354))","v":"En Ruta"},"",{"$f":"IF(AK354=\"Entregado\",\"\",IF(X354=\"24hrs\",\"\",IF(X354=\"48hrs\",\"Entregado\",CONSOLIDADO!S354)))","v":"En Ruta"},"",{"$f":"IF(AK354=\"Entregado\",\"\",IF(OR(X354=\"24hrs\",X354=\"48hrs\"),\"\",IF(X354=\"72hrs\",\"Entregado\",CONSOLIDADO!S354)))","v":"En Ruta"},"",{"$f":"IF(AK354=\"Entregado\",\"\",IF(OR(X354=\"24hrs\",X354=\"48hrs\",X354=\"72hrs\"),\"\",IF(X354=\"+72hrs\",\"Entregado\",CONSOLIDADO!S354)))","v":"En Ruta"},"","En Ruta",1,0,0,0,0,1,0,"No Entregado",0,0,1,0,{"$f":"IF(V354=\"Lima\",NETWORKDAYS.INTL(D354,M354,11,'Dias Feriados'!$A$1:$A$15),IF(AND(V354=\"provincia\",X354=\"24hrs\"),1,IF(AND(V354=\"provincia\",X354=\"48hrs\"),2,NETWORKDAYS.INTL(D354,M354,11,'Dias Feriados'!$A$1:$A$15))))","v":-39255}]
["B001667734","May","2025-05-27","2025-05-28","G/I. 030-10132",354,"CECILIA ISABEL GARCIA MENESES","URB SANTA ROSA MZ J LT 11 ESQUINA DE LOZA DEPORTIVA URB SANTA ROSA SAN VICENTE CANETE","Provincia","CAÑETE","SAN VICENTE DE CAÑETE","B001667734",null,"En Ruta",9730017137,"F",202508,203201,"En Ruta","Dia 1","CARMEL","PROVINCIA",{"$f":"NETWORKDAYS.INTL(D355,M355,11,'Dias Feriados'!$A$1:$A$15)","v":-39255},"En Ruta",22,"NO",null,0.9375,0.94722222222222219,1,"HUAMAN QUI","2025-05-28",null,null,45804,"",{"$f":"IF(AS355=\"Devuelto\",\"\",IF(X355=\"24hrs\",\"Entregado\",CONSOLIDADO!S355))","v":"En Ruta"},"",{"$f":"IF(AK355=\"Entregado\",\"\",IF(X355=\"24hrs\",\"\",IF(X355=\"48hrs\",\"Entregado\",CONSOLIDADO!S355)))","v":"En Ruta"},"",{"$f":"IF(AK355=\"Entregado\",\"\",IF(OR(X355=\"24hrs\",X355=\"48hrs\"),\"\",IF(X355=\"72hrs\",\"Entregado\",CONSOLIDADO!S355)))","v":"En Ruta"},"",{"$f":"IF(AK355=\"Entregado\",\"\",IF(OR(X355=\"24hrs\",X355=\"48hrs\",X355=\"72hrs\"),\"\",IF(X355=\"+72hrs\",\"Entregado\",CONSOLIDADO!S355)))","v":"En Ruta"},"","En Ruta",1,0,0,0,0,1,0,"No Entregado",0,0,1,0,{"$f":"IF(V355=\"Lima\",NETWORKDAYS.INTL(D355,M355,11,'Dias Feriados'!$A$1:$A$15),IF(AND(V355=\"provincia\",X355=\"24hrs\"),1,IF(AND(V355=\"provincia\",X355=\"48hrs\"),2,NETWORKDAYS.INTL(D355,M355,11,'Dias Feriados'!$A$1:$A$15))))","v":-39255}]
["B001667473","May","2025-05-27","2025-05-28","G/I. 030-10132",355,"MARITZA ELIZABETH SANCHEZ SALA","AV PANAMERICANA SUR 144 ALTURA MONASTERIO LAS CARMELITAS","Provincia","CAÑETE","SAN VICENTE DE CAÑETE","B001667473",null,"En Ruta",9730017153,"F",202508,203201,"En Ruta","Dia 1","CARMEL","PROVINCIA",{"$f":"NETWORKDAYS.INTL(D356,M356,11,'Dias Feriados'!$A$1:$A$15)","v":-39255},"En Ruta",22,"NO",null,0.9375,0.94722222222222219,1,"HUAMAN QUI","2025-05-28",null,null,45804,"",{"$f":"IF(AS356=\"Devuelto\",\"\",IF(X356=\"24hrs\",\"Entregado\",CONSOLIDADO!S356))","v":"En Ruta"},"",{"$f":"IF(AK356=\"Entregado\",\"\",IF(X356=\"24hrs\",\"\",IF(X356=\"48hrs\",\"Entregado\",CONSOLIDADO!S356)))","v":"En Ruta"},"",{"$f":"IF(AK356=\"Entregado\",\"\",IF(OR(X356=\"24hrs\",X356=\"48hrs\"),\"\",IF(X356=\"72hrs\",\"Entregado\",CONSOLIDADO!S356)))","v":"En Ruta"},"",{"$f":"IF(AK356=\"Entregado\",\"\",IF(OR(X356=\"24hrs\",X356=\"48hrs\",X356=\"72hrs\"),\"\",IF(X356=\"+72hrs\",\"Entregado\",CONSOLIDADO!S356)))","v":"En Ruta"},"","En Ruta",1,0,0,0,0,1,0,"No Entregado",0,0,1,0,{"$f":"IF(V356=\"Lima\",NETWORKDAYS.INTL(D356,M356,11,'Dias Feriados'!$A$1:$A$15),IF(AND(V356=\"provincia\",X356=\"24hrs\"),1,IF(AND(V356=\"provincia\",X356=\"48hrs\"),2,NETWORKDAYS.INTL(D356,M356,11,'Dias Feriados'!$A$1:$A$15))))","v":-39255}]
["B001667581","May","2025-05-27","2025-05-28","G/I. 030-10132",356,"CECILIA VERONICA SILVERA DIAZ","MZ A 17 NVO IMPERIAL AV CARRIZALES AV FRENTE HOSPEDAJE LOS FICUS","Provincia","CAÑETE","SAN VICENTE DE CAÑETE","B001667581",null,"En Ruta",9730017245,"F",202508,203201,"En Ruta","Dia 1","CARMEL","PROVINCIA",{"$f":"NETWORKDAYS.INTL(D357,M357,11,'Dias Feriados'!$A$1:$A$15)","v":-39255},"En Ruta",22,"NO",null,0.9375,0.94722222222222219,1,"HUAMAN QUI","2025-05-28",null,null,45804,"",{"$f":"IF(AS357=\"Devuelto\",\"\",IF(X357=\"24hrs\",\"Entregado\",CONSOLIDADO!S357))","v":"En Ruta"},"",{"$f":"IF(AK357=\"Entregado\",\"\",IF(X357=\"24hrs\",\"\",IF(X357=\"48hrs\",\"Entregado\",CONSOLIDADO!S357)))","v":"En Ruta"},"",{"$f":"IF(AK357=\"Entregado\",\"\",IF(OR(X357=\"24hrs\",X357=\"48hrs\"),\"\",IF(X357=\"72hrs\",\"Entregado\",CONSOLIDADO!S357)))","v":"En Ruta"},"",{"$f":"IF(AK357=\"Entregado\",\"\",IF(OR(X357=\"24hrs\",X357=\"48hrs\",X357=\"72hrs\"),\"\",IF(X357=\"+72hrs\",\"Entregado\",CONSOLIDADO!S357)))","v":"En Ruta"},"","En Ruta",1,0,0,0,0,1,0,"No Entregado",0,0,1,0,{"$f":"IF(V357=\"Lima\",NETWORKDAYS.INTL(D357,M357,11,'Dias Feriados'!$A$1:$A$15),IF(AND(V357=\"provincia\",X357=\"24hrs\"),1,IF(AND(V357=\"provincia\",X357=\"48hrs\"),2,NETWORKDAYS.INTL(D357,M357,11,'Dias Feriados'!$A$1:$A$15))))","v":-39255}]
["B001667492","May","2025-05-27","2025-05-28","G/I. 030-10132",357,"MARIA ESTHER LEGUIA CCONAS","MZC LT 7 CENTRO POBLADO EL ESTADIO DE LA ESMERALDA","Provincia","CAÑETE","SAN VICENTE DE CAÑETE","B001667492",null,"En Ruta",9730017313,"F",202508,203201,"En Ruta","Dia 1","CARMEL","PROVINCIA",{"$f":"NETWORKDAYS.INTL(D358,M358,11,'Dias Feriados'!$A$1:$A$15)","v":-39255},"En Ruta",22,"NO",null,0.9375,0.94722222222222219,1,"HUAMAN QUI","2025-05-28",null,null,45804,"",{"$f":"IF(AS358=\"Devuelto\",\"\",IF(X358=\"24hrs\",\"Entregado\",CONSOLIDADO!S358))","v":"En Ruta"},"",{"$f":"IF(AK358=\"Entregado\",\"\",IF(X358=\"24hrs\",\"\",IF(X358=\"48hrs\",\"Entregado\",CONSOLIDADO!S358)))","v":"En Ruta"},"",{"$f":"IF(AK358=\"Entregado\",\"\",IF(OR(X358=\"24hrs\",X358=\"48hrs\"),\"\",IF(X358=\"72hrs\",\"Entregado\",CONSOLIDADO!S358)))","v":"En Ruta"},"",{"$f":"IF(AK358=\"Entregado\",\"\",IF(OR(X358=\"24hrs\",X358=\"48hrs\",X358=\"72hrs\"),\"\",IF(X358=\"+72hrs\",\"Entregado\",CONSOLIDADO!S358)))","v":"En Ruta"},"","En Ruta",1,0,0,0,0,1,0,"No Entregado",0,0,1,0,{"$f":"IF(V358=\"Lima\",NETWORKDAYS.INTL(D358,M358,11,'Dias Feriados'!$A$1:$A$15),IF(AND(V358=\"provincia\",X358=\"24hrs\"),1,IF(AND(V358=\"provincia\",X358=\"48hrs\"),2,NETWORKDAYS.INTL(D358,M358,11,'Dias Feriados'!$A$1:$A$15))))","v":-39255}]
["B001667614","May","2025-05-27","2025-05-28","G/I. 030-10132",358,"BLANCA IRIS CUCHO HUAPAYA","VILLA EL CARMEN STR 1 IGLESIA SAN JOSE","Provincia","CAÑETE","SAN VICENTE DE CAÑETE","B001667614",null,"En Ruta",9730017368,"F",202508,203201,"En Ruta","Dia 1","CARMEL","PROVINCIA",{"$f":"NETWORKDAYS.INTL(D359,M359,11,'Dias Feriados'!$A$1:$A$15)","v":-39255},"En Ruta",22,"NO",null,0.9375,0.94722222222222219,1,"HUAMAN QUI","2025-05-28",null,null,45804,"",{"$f":"IF(AS359=\"Devuelto\",\"\",IF(X359=\"24hrs\",\"Entregado\",CONSOLIDADO!S359))","v":"En Ruta"},"",{"$f":"IF(AK359=\"Entregado\",\"\",IF(X359=\"24hrs\",\"\",IF(X359=\"48hrs\",\"Entregado\",CONSOLIDADO!S359)))","v":"En Ruta"},"",{"$f":"IF(AK359=\"Entregado\",\"\",IF(OR(X359=\"24hrs\",X359=\"48hrs\"),\"\",IF(X359=\"72hrs\",\"Entregado\",CONSOLIDADO!S359)))","v":"En Ruta"},"",{"$f":"IF(AK359=\"Entregado\",\"\",IF(OR(X359=\"24hrs\",X359=\"48hrs\",X359=\"72hrs\"),\"\",IF(X359=\"+72hrs\",\"Entregado\",CONSOLIDADO!S359)))","v":"En Ruta"},"","En Ruta",1,0,0,0,0,1,0,"No Entregado",0,0,1,0,{"$f":"IF(V359=\"Lima\",NETWORKDAYS.INTL(D359,M359,11,'Dias Feriados'!$A$1:$A$15),IF(AND(V359=\"provincia\",X359=\"24hrs\"),1,IF(AND(V359=\"provincia\",X359=\"48hrs\"),2,NETWORKDAYS.INTL(D359,M359,11,'Dias Feriados'!$A$1:$A$15))))","v":-39255}]
["B001667490","May","2025-05-27","2025-05-28","G/I. 030-10132",359,"PAMELA GOMEZ SANCHEZ","URB CAMACHO MZA LT 8 FRENTE AL MACRO","Provincia","CAÑETE","SAN VICENTE DE CAÑETE","B001667490",null,"En Ruta",9730017474,"F",202508,203201,"En Ruta","Dia 1","CARMEL","PROVINCIA",{"$f":"NETWORKDAYS.INTL(D360,M360,11,'Dias Feriados'!$A$1:$A$15)","v":-39255},"En Ruta",22,"NO",null,0.9375,0.94722222222222219,1,"HUAMAN QUI","2025-05-28",null,null,45804,"",{"$f":"IF(AS360=\"Devuelto\",\"\",IF(X360=\"24hrs\",\"Entregado\",CONSOLIDADO!S360))","v":"En Ruta"},"",{"$f":"IF(AK360=\"Entregado\",\"\",IF(X360=\"24hrs\",\"\",IF(X360=\"48hrs\",\"Entregado\",CONSOLIDADO!S360)))","v":"En Ruta"},"",{"$f":"IF(AK360=\"Entregado\",\"\",IF(OR(X360=\"24hrs\",X360=\"48hrs\"),\"\",IF(X360=\"72hrs\",\"Entregado\",CONSOLIDADO!S360)))","v":"En Ruta"},"",{"$f":"IF(AK360=\"Entregado\",\"\",IF(OR(X360=\"24hrs\",X360=\"48hrs\",X360=\"72hrs\"),\"\",IF(X360=\"+72hrs\",\"Entregado\",CONSOLIDADO!S360)))","v":"En Ruta"},"","En Ruta",1,0,0,0,0,1,0,"No Entregado",0,0,1,0,{"$f":"IF(V360=\"Lima\",NETWORKDAYS.INTL(D360,M360,11,'Dias Feriados'!$A$1:$A$15),IF(AND(V360=\"provincia\",X360=\"24hrs\"),1,IF(AND(V360=\"provincia\",X360=\"48hrs\"),2,NETWORKDAYS.INTL(D360,M360,11,'Dias Feriados'!$A$1:$A$15))))","v":-39255}]
["B001667340","May","2025-05-27","2025-05-28","G/I. 030-10132",360,"MILAGROS VANESSA CHAMBERGO SAN","AAHH LA HUACA DE LOS CHINOS MZB LT 1 COL MATER CRISTI","Provincia","CAÑETE","SAN VICENTE DE CAÑETE","B001667340",null,"En Ruta",9730017496,"F",202508,203201,"En Ruta","Dia 1","CARMEL","PROVINCIA",{"$f":"NETWORKDAYS.INTL(D361,M361,11,'Dias Feriados'!$A$1:$A$15)","v":-39255},"En Ruta",22,"NO",null,0.9375,0.94722222222222219,1,null,"2025-05-28",null,null,45804,"",{"$f":"IF(AS361=\"Devuelto\",\"\",IF(X361=\"24hrs\",\"Entregado\",CONSOLIDADO!S361))","v":"En Ruta"},"",{"$f":"IF(AK361=\"Entregado\",\"\",IF(X361=\"24hrs\",\"\",IF(X361=\"48hrs\",\"Entregado\",CONSOLIDADO!S361)))","v":"En Ruta"},"",{"$f":"IF(AK361=\"Entregado\",\"\",IF(OR(X361=\"24hrs\",X361=\"48hrs\"),\"\",IF(X361=\"72hrs\",\"Entregado\",CONSOLIDADO!S361)))","v":"En Ruta"},"",{"$f":"IF(AK361=\"Entregado\",\"\",IF(OR(X361=\"24hrs\",X361=\"48hrs\",X361=\"72hrs\"),\"\",IF(X361=\"+72hrs\",\"Entregado\",CONSOLIDADO!S361)))","v":"En Ruta"},"","En Ruta",1,0,0,0,0,1,0,"No Entregado",0,0,1,0,{"$f":"IF(V361=\"Lima\",NETWORKDAYS.INTL(D361,M361,11,'Dias Feriados'!$A$1:$A$15),IF(AND(V361=\"provincia\",X361=\"24hrs\"),1,IF(AND(V361=\"provincia\",X361=\"48hrs\"),2,NETWORKDAYS.INTL(D361,M361,11,'Dias Feriados'!$A$1:$A$15))))","v":-39255}]
["B001669162","May","2025-05-28","2025-05-29","G/I. 030-10134",1,"FANNY MYRELLA NINAQUISPE SOTEL","PROLONGACION CHAVIN 600 INT 4 ALT COLEGIO 22 236","Provincia","CHINCHA","CHINCHA ALTA","B001669162",null,"En Ruta",9730017337,"F",202508,203201,"En Ruta","Dia 1",{"$f":"IF(MID(R362,1,2)=\"10\",\"PACIFIKA\",IF(MID(R362,1,2)=\"20\",\"CARMEL\",\"EMPLEADOS\"))","v":"CARMEL"},{"$f":"IF(I362=\"LIMA\",\"LIMA\",\"PROVINCIA\")","v":"PROVINCIA"},{"$f":"NETWORKDAYS.INTL(D362,M362,11,'Dias Feriados'!$A$1:$A$15)","v":-39256},{"$f":"IF(OR(M362=\"\",M362=\"En Ruta\"),\"En Ruta\",IF(M362=\"Motivado\",\"Motivado\",IF(W362<=1,\"24hrs\",IF(W362=2,\"48hrs\",IF(W362=3,\"72hrs\",\"+72hrs\")))))","v":"En Ruta"},{"$f":"WEEKNUM(C362)","v":22},"NO",null,0.9375,0.94722222222222219,1,"MAGALLANES","2025-05-29",null,null,45805,{"$f":"IF(AK362=\"Entregado\",M362,\"\")","v":""},{"$f":"IF(AS362=\"Devuelto\",\"\",IF(X362=\"24hrs\",\"Entregado\",CONSOLIDADO!S362))","v":"En Ruta"},{"$f":"IF(AM362=\"Entregado\",M362,\"\")","v":""},{"$f":"IF(AK362=\"Entregado\",\"\",IF(X362=\"24hrs\",\"\",IF(X362=\"48hrs\",\"Entregado\",CONSOLIDADO!S362)))","v":"En Ruta"},{"$f":"IF(AO362=\"Entregado\",M362,\"\")","v":""},{"$f":"IF(AK362=\"Entregado\",\"\",IF(OR(X362=\"24hrs\",X362=\"48hrs\"),\"\",IF(X362=\"72hrs\",\"Entregado\",CONSOLIDADO!S362)))","v":"En Ruta"},{"$f":"IF(AQ362=\"Entregado\",M362,\"\")","v":""},{"$f":"IF(AK362=\"Entregado\",\"\",IF(OR(X362=\"24hrs\",X362=\"48hrs\",X362=\"72hrs\"),\"\",IF(X362=\"+72hrs\",\"Entregado\",CONSOLIDADO!S362)))","v":"En Ruta"},{"$f":"IF(M362=\"\",\"\",M362)","v":""},{"$f":"IF(AG362=\"Devuelto\",AG362,N362)","v":"En Ruta"},1,{"$f":"IF(X362=\"24hrs\",1,0)","v":0},{"$f":"IF(X362=\"48hrs\",1,0)","v":0},{"$f":"IF(X362=\"72hrs\",1,0)","v":0},{"$f":"IF(X362=\"+72hrs\",1,0)","v":0},{"$f":"IF(X362=\"En Ruta\",1,0)","v":1},{"$f":"IF(X362=\"Motivado\",1,0)","v":0},{"$f":"IF(OR(N362=\"devuelto\",N362=\"siniestro\"),\"Nulo\",IF(OR(X362=\"24hrs\",X362=\"48hrs\"),\"A Tiempo\",IF(OR(X362=\"en ruta\",X362=\"motivado\"),\"No Entregado\",\"Fuera de Tiempo\")))","v":"No Entregado"},{"$f":"IF(BA362=\"a tiempo\",1,0)","v":0},{"$f":"IF(BA362=\"fuera de tiempo\",1,0)","v":0},{"$f":"IF(BA362=\"no entregado\",1,0)","v":1},{"$f":"IF(BA362=\"nulo\",1,0)","v":0},{"$f":"IF(V362=\"Lima\",NETWORKDAYS.INTL(D362,M362,11,'Dias Feriados'!$A$1:$A$15),IF(AND(V362=\"provincia\",X362=\"24hrs\"),1,IF(AND(V362=\"provincia\",X362=\"48hrs\"),2,NETWORKDAYS.INTL(D362,M362,11,'Dias Feriados'!$A$1:$A$15))))","v":-39256}]
["B001669154","May","2025-05-28","2025-05-29","G/I. 030-10134",2,"LETICIA ALEXANDRA FLORES SANCH","AV PRINCIPAL PUERTA 62 62 FRENTE MINIMARKET ADRIAN CENTRO POBLADO SAN JOSE","Provincia","CHINCHA","EL CARMEN","B001669154",null,"En Ruta",9730017054,"F",202508,203201,"En Ruta","Dia 1","CARMEL","PROVINCIA",{"$f":"NETWORKDAYS.INTL(D363,M363,11,'Dias Feriados'!$A$1:$A$15)","v":-39256},"En Ruta",22,"NO",null,0.9375,0.94722222222222219,1,"MAGALLANES","2025-05-29",null,null,45805,"",{"$f":"IF(AS363=\"Devuelto\",\"\",IF(X363=\"24hrs\",\"Entregado\",CONSOLIDADO!S363))","v":"En Ruta"},"",{"$f":"IF(AK363=\"Entregado\",\"\",IF(X363=\"24hrs\",\"\",IF(X363=\"48hrs\",\"Entregado\",CONSOLIDADO!S363)))","v":"En Ruta"},"",{"$f":"IF(AK363=\"Entregado\",\"\",IF(OR(X363=\"24hrs\",X363=\"48hrs\"),\"\",IF(X363=\"72hrs\",\"Entregado\",CONSOLIDADO!S363)))","v":"En Ruta"},"",{"$f":"IF(AK363=\"Entregado\",\"\",IF(OR(X363=\"24hrs\",X363=\"48hrs\",X363=\"72hrs\"),\"\",IF(X363=\"+72hrs\",\"Entregado\",CONSOLIDADO!S363)))","v":"En Ruta"},"","En Ruta",1,0,0,0,0,1,0,"No Entregado",0,0,1,0,{"$f":"IF(V363=\"Lima\",NETWORKDAYS.INTL(D363,M363,11,'Dias Feriados'!$A$1:$A$15),IF(AND(V363=\"provincia\",X363=\"24hrs\"),1,IF(AND(V363=\"provincia\",X363=\"48hrs\"),2,NETWORKDAYS.INTL(D363,M363,11,'Dias Feriados'!$A$1:$A$15))))","v":-39256}]
["B001669170","May","2025-05-28","2025-05-29","G/I. 030-10134",3,"TOMASA REYNA LLAMCCAYA ALVITES","AV ARENALES SANTA ROSA DE LIMA MZNA B LT 8 COLEGIO REPUBLICA FRENTE AL CEMENTERIO","Provincia","ICA","ICA","B001669170",null,"En Ruta",9730017567,"F",202508,203201,"En Ruta","Dia 1","CARMEL","PROVINCIA",{"$f":"NETWORKDAYS.INTL(D364,M364,11,'Dias Feriados'!$A$1:$A$15)","v":-39256},"En Ruta",22,"NO",null,0.9375,0.94722222222222219,1,"CRUCES CHO","2025-05-29",null,null,45805,"",{"$f":"IF(AS364=\"Devuelto\",\"\",IF(X364=\"24hrs\",\"Entregado\",CONSOLIDADO!S364))","v":"En Ruta"},"",{"$f":"IF(AK364=\"Entregado\",\"\",IF(X364=\"24hrs\",\"\",IF(X364=\"48hrs\",\"Entregado\",CONSOLIDADO!S364)))","v":"En Ruta"},"",{"$f":"IF(AK364=\"Entregado\",\"\",IF(OR(X364=\"24hrs\",X364=\"48hrs\"),\"\",IF(X364=\"72hrs\",\"Entregado\",CONSOLIDADO!S364)))","v":"En Ruta"},"",{"$f":"IF(AK364=\"Entregado\",\"\",IF(OR(X364=\"24hrs\",X364=\"48hrs\",X364=\"72hrs\"),\"\",IF(X364=\"+72hrs\",\"Entregado\",CONSOLIDADO!S364)))","v":"En Ruta"},"","En Ruta",1,0,0,0,0,1,0,"No Entregado",0,0,1,0,{"$f":"IF(V364=\"Lima\",NETWORKDAYS.INTL(D364,M364,11,'Dias Feriados'!$A$1:$A$15),IF(AND(V364=\"provincia\",X364=\"24hrs\"),1,IF(AND(V364=\"provincia\",X364=\"48hrs\"),2,NETWORKDAYS.INTL(D364,M364,11,'Dias Feriados'!$A$1:$A$15))))","v":-39256}]
["B001669201","May","2025-05-28","2025-05-29","G/I. 030-10134",4,"CAROLIN MERCEDES SEANCAS VILCA","CALLE SAN MARTIN CUADRA 15 MZ H LT 6 ENTRE SAN MARTIN Y RAUL BOZA CALLE SAN MARTIN","Provincia","ICA","ICA","B001669201",null,"En Ruta",9730017603,"F",202508,203201,"En Ruta","Dia 1","CARMEL","PROVINCIA",{"$f":"NETWORKDAYS.INTL(D365,M365,11,'Dias Feriados'!$A$1:$A$15)","v":-39256},"En Ruta",22,"NO",null,0.9375,0.94722222222222219,1,"CRUCES CHO","2025-05-29",null,null,45805,"",{"$f":"IF(AS365=\"Devuelto\",\"\",IF(X365=\"24hrs\",\"Entregado\",CONSOLIDADO!S365))","v":"En Ruta"},"",{"$f":"IF(AK365=\"Entregado\",\"\",IF(X365=\"24hrs\",\"\",IF(X365=\"48hrs\",\"Entregado\",CONSOLIDADO!S365)))","v":"En Ruta"},"",{"$f":"IF(AK365=\"Entregado\",\"\",IF(OR(X365=\"24hrs\",X365=\"48hrs\"),\"\",IF(X365=\"72hrs\",\"Entregado\",CONSOLIDADO!S365)))","v":"En Ruta"},"",{"$f":"IF(AK365=\"Entregado\",\"\",IF(OR(X365=\"24hrs\",X365=\"48hrs\",X365=\"72hrs\"),\"\",IF(X365=\"+72hrs\",\"Entregado\",CONSOLIDADO!S365)))","v":"En Ruta"},"","En Ruta",1,0,0,0,0,1,0,"No Entregado",0,0,1,0,{"$f":"IF(V365=\"Lima\",NETWORKDAYS.INTL(D365,M365,11,'Dias Feriados'!$A$1:$A$15),IF(AND(V365=\"provincia\",X365=\"24hrs\"),1,IF(AND(V365=\"provincia\",X365=\"48hrs\"),2,NETWORKDAYS.INTL(D365,M365,11,'Dias Feriados'!$A$1:$A$15))))","v":-39256}]
["B001669149","May","2025-05-28","2025-05-29","G/I. 030-10134",5,"JACKELYNE AUNQUE ZARATE","LA TINGUIA AV PERU MZB2 PASANDO LA PLAZUELA PUENTE CHOCORRO","Provincia","ICA","PARCONA","B001669149",null,"En Ruta",9730017515,"F",202508,203201,"En Ruta","Dia 1","CARMEL","PROVINCIA",{"$f":"NETWORKDAYS.INTL(D366,M366,11,'Dias Feriados'!$A$1:$A$15)","v":-39256},"En Ruta",22,"NO",null,0.9375,0.94722222222222219,1,"CRUCES CHO","2025-05-29",null,null,45805,"",{"$f":"IF(AS366=\"Devuelto\",\"\",IF(X366=\"24hrs\",\"Entregado\",CONSOLIDADO!S366))","v":"En Ruta"},"",{"$f":"IF(AK366=\"Entregado\",\"\",IF(X366=\"24hrs\",\"\",IF(X366=\"48hrs\",\"Entregado\",CONSOLIDADO!S366)))","v":"En Ruta"},"",{"$f":"IF(AK366=\"Entregado\",\"\",IF(OR(X366=\"24hrs\",X366=\"48hrs\"),\"\",IF(X366=\"72hrs\",\"Entregado\",CONSOLIDADO!S366)))","v":"En Ruta"},"",{"$f":"IF(AK366=\"Entregado\",\"\",IF(OR(X366=\"24hrs\",X366=\"48hrs\",X366=\"72hrs\"),\"\",IF(X366=\"+72hrs\",\"Entregado\",CONSOLIDADO!S366)))","v":"En Ruta"},"","En Ruta",1,0,0,0,0,1,0,"No Entregado",0,0,1,0,{"$f":"IF(V366=\"Lima\",NETWORKDAYS.INTL(D366,M366,11,'Dias Feriados'!$A$1:$A$15),IF(AND(V366=\"provincia\",X366=\"24hrs\"),1,IF(AND(V366=\"provincia\",X366=\"48hrs\"),2,NETWORKDAYS.INTL(D366,M366,11,'Dias Feriados'!$A$1:$A$15))))","v":-39256}]
["B001669157","May","2025-05-28","2025-05-29","G/I. 030-10134",6,"KAREN NAILEA CAVERO PENA","PANAMERICANA SUR KM 318 SANTIAGO CENTRO POBLADO CASABLANCA MZ U LTE 8","Provincia","ICA","SANTIAGO","B001669157",null,"En Ruta",9730017174,"F",202508,203201,"En Ruta","Dia 1","CARMEL","PROVINCIA",{"$f":"NETWORKDAYS.INTL(D367,M367,11,'Dias Feriados'!$A$1:$A$15)","v":-39256},"En Ruta",22,"NO",null,0.9375,0.94722222222222219,1,"CRUCES CHO","2025-05-29",null,null,45805,"",{"$f":"IF(AS367=\"Devuelto\",\"\",IF(X367=\"24hrs\",\"Entregado\",CONSOLIDADO!S367))","v":"En Ruta"},"",{"$f":"IF(AK367=\"Entregado\",\"\",IF(X367=\"24hrs\",\"\",IF(X367=\"48hrs\",\"Entregado\",CONSOLIDADO!S367)))","v":"En Ruta"},"",{"$f":"IF(AK367=\"Entregado\",\"\",IF(OR(X367=\"24hrs\",X367=\"48hrs\"),\"\",IF(X367=\"72hrs\",\"Entregado\",CONSOLIDADO!S367)))","v":"En Ruta"},"",{"$f":"IF(AK367=\"Entregado\",\"\",IF(OR(X367=\"24hrs\",X367=\"48hrs\",X367=\"72hrs\"),\"\",IF(X367=\"+72hrs\",\"Entregado\",CONSOLIDADO!S367)))","v":"En Ruta"},"","En Ruta",1,0,0,0,0,1,0,"No Entregado",0,0,1,0,{"$f":"IF(V367=\"Lima\",NETWORKDAYS.INTL(D367,M367,11,'Dias Feriados'!$A$1:$A$15),IF(AND(V367=\"provincia\",X367=\"24hrs\"),1,IF(AND(V367=\"provincia\",X367=\"48hrs\"),2,NETWORKDAYS.INTL(D367,M367,11,'Dias Feriados'!$A$1:$A$15))))","v":-39256}]
["B001670751","May","2025-05-29","2025-05-30","G/I. 030-10136",1,"ROSA DELOSMILAGROS MACEDO RODR","SAN CARLOS ET III MZ T LT 12 FRENTE AL PAR","Provincia","ICA","ICA","B001670751",null,"En Ruta",9730017447,"F",203201,202508,"En Ruta","Dia 1",{"$f":"IF(MID(R368,1,2)=\"10\",\"PACIFIKA\",IF(MID(R368,1,2)=\"20\",\"CARMEL\",\"EMPLEADOS\"))","v":"CARMEL"},{"$f":"IF(I368=\"LIMA\",\"LIMA\",\"PROVINCIA\")","v":"PROVINCIA"},{"$f":"NETWORKDAYS.INTL(D368,M368,11,'Dias Feriados'!$A$1:$A$15)","v":-39257},{"$f":"IF(OR(M368=\"\",M368=\"En Ruta\"),\"En Ruta\",IF(M368=\"Motivado\",\"Motivado\",IF(W368<=1,\"24hrs\",IF(W368=2,\"48hrs\",IF(W368=3,\"72hrs\",\"+72hrs\")))))","v":"En Ruta"},{"$f":"WEEKNUM(C368)","v":22},"NO",null,0.9375,0.94722222222222219,1,null,"2025-05-30",null,null,45806,"",{"$f":"IF(AS368=\"Devuelto\",\"\",IF(X368=\"24hrs\",\"Entregado\",CONSOLIDADO!S368))","v":"En Ruta"},"",{"$f":"IF(AK368=\"Entregado\",\"\",IF(X368=\"24hrs\",\"\",IF(X368=\"48hrs\",\"Entregado\",CONSOLIDADO!S368)))","v":"En Ruta"},"",{"$f":"IF(AK368=\"Entregado\",\"\",IF(OR(X368=\"24hrs\",X368=\"48hrs\"),\"\",IF(X368=\"72hrs\",\"Entregado\",CONSOLIDADO!S368)))","v":"En Ruta"},"",{"$f":"IF(AK368=\"Entregado\",\"\",IF(OR(X368=\"24hrs\",X368=\"48hrs\",X368=\"72hrs\"),\"\",IF(X368=\"+72hrs\",\"Entregado\",CONSOLIDADO!S368)))","v":"En Ruta"},"","En Ruta",1,{"$f":"IF(X368=\"24hrs\",1,0)","v":0},{"$f":"IF(X368=\"48hrs\",1,0)","v":0},{"$f":"IF(X368=\"72hrs\",1,0)","v":0},{"$f":"IF(X368=\"+72hrs\",1,0)","v":0},{"$f":"IF(X368=\"En Ruta\",1,0)","v":1},{"$f":"IF(X368=\"Motivado\",1,0)","v":0},{"$f":"IF(OR(N368=\"devuelto\",N368=\"siniestro\"),\"Nulo\",IF(OR(X368=\"24hrs\",X368=\"48hrs\"),\"A Tiempo\",IF(OR(X368=\"en ruta\",X368=\"motivado\"),\"No Entregado\",\"Fuera de Tiempo\")))","v":"No Entregado"},{"$f":"IF(BA368=\"a tiempo\",1,0)","v":0},{"$f":"IF(BA368=\"fuera de tiempo\",1,0)","v":0},{"$f":"IF(BA368=\"no entregado\",1,0)","v":1},{"$f":"IF(BA368=\"nulo\",1,0)","v":0},{"$f":"IF(V368=\"Lima\",NETWORKDAYS.INTL(D368,M368,11,'Dias Feriados'!$A$1:$A$15),IF(AND(V368=\"provincia\",X368=\"24hrs\"),1,IF(AND(V368=\"provincia\",X368=\"48hrs\"),2,NETWORKDAYS.INTL(D368,M368,11,'Dias Feriados'!$A$1:$A$15))))","v":-39257}]
["B001670754","May","2025-05-29","2025-05-30","G/I. 030-10136",2,"MARITZA ELIZABETH HUAMANI GUIL","PPJJ LA ESPREANZA MZ G LT 27 ULTIMA CUADRA PIMENTEL","Provincia","ICA","ICA","B001670754",null,"En Ruta",9730017456,"F",203201,202508,"En Ruta","Dia 1","CARMEL","PROVINCIA",{"$f":"NETWORKDAYS.INTL(D369,M369,11,'Dias Feriados'!$A$1:$A$15)","v":-39257},"En Ruta",22,"NO",null,0.9375,0.94722222222222219,1,null,"2025-05-30",null,null,45806,"",{"$f":"IF(AS369=\"Devuelto\",\"\",IF(X369=\"24hrs\",\"Entregado\",CONSOLIDADO!S369))","v":"En Ruta"},"",{"$f":"IF(AK369=\"Entregado\",\"\",IF(X369=\"24hrs\",\"\",IF(X369=\"48hrs\",\"Entregado\",CONSOLIDADO!S369)))","v":"En Ruta"},"",{"$f":"IF(AK369=\"Entregado\",\"\",IF(OR(X369=\"24hrs\",X369=\"48hrs\"),\"\",IF(X369=\"72hrs\",\"Entregado\",CONSOLIDADO!S369)))","v":"En Ruta"},"",{"$f":"IF(AK369=\"Entregado\",\"\",IF(OR(X369=\"24hrs\",X369=\"48hrs\",X369=\"72hrs\"),\"\",IF(X369=\"+72hrs\",\"Entregado\",CONSOLIDADO!S369)))","v":"En Ruta"},"","En Ruta",1,0,0,0,0,1,0,"No Entregado",0,0,1,0,{"$f":"IF(V369=\"Lima\",NETWORKDAYS.INTL(D369,M369,11,'Dias Feriados'!$A$1:$A$15),IF(AND(V369=\"provincia\",X369=\"24hrs\"),1,IF(AND(V369=\"provincia\",X369=\"48hrs\"),2,NETWORKDAYS.INTL(D369,M369,11,'Dias Feriados'!$A$1:$A$15))))","v":-39257}]
["B001670728","May","2025-05-29","2025-05-30","G/I. 030-10136",3,"VERONICA ALEJANDRINA GALLARDO","SAN MARTIN 1272 A UNA CUADRA DE LA UGEL PISCO AV SAN MARTIN","Provincia","PISCO","PISCO","B001670728",null,"En Ruta",9730017207,"F",203201,202508,"En Ruta","Dia 1","CARMEL","PROVINCIA",{"$f":"NETWORKDAYS.INTL(D370,M370,11,'Dias Feriados'!$A$1:$A$15)","v":-39257},"En Ruta",22,"NO",null,0.9375,0.94722222222222219,1,null,"2025-05-30",null,null,45806,"",{"$f":"IF(AS370=\"Devuelto\",\"\",IF(X370=\"24hrs\",\"Entregado\",CONSOLIDADO!S370))","v":"En Ruta"},"",{"$f":"IF(AK370=\"Entregado\",\"\",IF(X370=\"24hrs\",\"\",IF(X370=\"48hrs\",\"Entregado\",CONSOLIDADO!S370)))","v":"En Ruta"},"",{"$f":"IF(AK370=\"Entregado\",\"\",IF(OR(X370=\"24hrs\",X370=\"48hrs\"),\"\",IF(X370=\"72hrs\",\"Entregado\",CONSOLIDADO!S370)))","v":"En Ruta"},"",{"$f":"IF(AK370=\"Entregado\",\"\",IF(OR(X370=\"24hrs\",X370=\"48hrs\",X370=\"72hrs\"),\"\",IF(X370=\"+72hrs\",\"Entregado\",CONSOLIDADO!S370)))","v":"En Ruta"},"","En Ruta",1,0,0,0,0,1,0,"No Entregado",0,0,1,0,{"$f":"IF(V370=\"Lima\",NETWORKDAYS.INTL(D370,M370,11,'Dias Feriados'!$A$1:$A$15),IF(AND(V370=\"provincia\",X370=\"24hrs\"),1,IF(AND(V370=\"provincia\",X370=\"48hrs\"),2,NETWORKDAYS.INTL(D370,M370,11,'Dias Feriados'!$A$1:$A$15))))","v":-39257}]

{"sheet":"Tablas","index":1,"n_rows":48,"n_cols":72,"rows_kept":48,"cut":false,"hidden":true,"merged":[[0,61,0,64],[3,38,3,39],[5,18,5,19],[5,21,5,22],[0,1,0,12],[5,24,5,25],[5,27,5,28],[5,30,5,31],[0,18,0,31]]}
[null,"Acumulados",null,null,null,null,null,null,null,null,null,null,null,null,null,null,null,null,"Diarios",null,null,null,null,null,null,null,null,null,null,null,null,null,null,null,null,null,null,null,null,null,null,null,null,null,null,null,null,null,null,null,null,null,null,null,null,null,null,null,null,null,null,"Acumulados Mensuales"]
[null,null,null,null,null,null,null,{"$f":"CONCATENATE(\"Estado Actual del Reparto - \",C5)","v":"Estado Actual del Reparto - May"},null,null,null,null,null,null,null,null,null,null,"On time sin Devueltos",null,null,"% Ede",null,null,"% Liquidados",null,null,"Liquidados",null,null,null,null,null,null,null,null,null,null,null,null,null,null,null,null,null,null,null,null,null,null,null,null,null,null,null,null,null,null,null,null,null,"Año","Mes","On Time","Reparto",null,"Suma de On Time","Etiquetas de columna"]
[null,null,null,null,null,null,null,{"$f":"CONCATENATE(\"On Time - Evolutivo - \",C5)","v":"On Time - Evolutivo - May"},null,null,null,null,null,null,null,null,null,null,{"$f":"V6/(SUM(V6+Y6+AB6))","v":0.11666666666666667},{"$f":"1-S3","v":0.8833333333333333},null,{"$f":"V6/(V6+Y6)","v":1},{"$f":"1-V3","v":0},null,{"$f":"SUM(V6+Y6)/S6","v":0.11666666666666667},{"$f":"1-Y3","v":0.8833333333333333},null,"Devueltos",null,null,null,null,null,null,null,null,null,null,{"$f":"CONCATENATE(\"Total Motivos\",\" - \",AM4)","v":"Total Motivos - 318"},null,null,null,null,null,null,null,null,null,null,null,null,null,null,null,null,null,null,null,null,null,null,2025,"May",0.11475409836065574,366,null,"Etiquetas de fila",2025,null,null,"Suma de Reparto","Etiquetas de columna"]
[null,null,null,null,null,null,null,{"$f":"CONCATENATE(\"Lead Time de Entrega - \",C5)","v":"Lead Time de Entrega - May"},null,null,null,null,null,null,null,null,null,null,null,null,null,null,null,null,{"$f":"S6-AE6","v":360},null,null,null,null,null,null,null,null,null,null,null,null,null,{"$f":"VLOOKUP(\"Total general\",$AM$8:$AN$31,2,FALSE)","v":318},null,null,null,null,null,null,null,null,null,null,null,null,null,null,null,null,null,null,null,null,null,null,null,null,null,null,null,"May",0.11475409836065574,null,null,"Etiquetas de fila",2025]
[null,"MES","May",null,null,null,null,{"$f":"CONCATENATE(\"Motivos - \",C5)","v":"Motivos - May"},null,null,null,null,null,null,null,null,null,null,"Total Repartido",null,null,"On Time",null,null,"Out of Time",null,null,"En Gestión",null,null,"Nulos",null,null,null,null,null,null,null,null,null,null,null,null,null,null,null,null,null,null,null,null,null,null,null,null,null,null,null,null,null,null,null,null,null,null,null,null,null,null,null,"May",366]
[null,null,null,null,null,null,null,{"$f":"CONCATENATE(\"On Time Acumulado Semanal - \",C5)","v":"On Time Acumulado Semanal - May"},null,null,null,null,null,null,null,null,null,null,{"$f":"VLOOKUP(\"Total general\",$S$8:$T$31,2,FALSE)","v":360},null,null,{"$f":"VLOOKUP(\"Total general\",$V$8:$W$31,2,FALSE)","v":42},null,null,{"$f":"VLOOKUP(\"Total general\",$Y$8:$Z$31,2,FALSE)","v":0},null,null,{"$f":"VLOOKUP(\"Total general\",$AB$9:$AC$32,2,FALSE)","v":318},null,null,{"$f":"VLOOKUP(\"Total general\",$AE$9:$AF$32,2,FALSE)","v":0},null,null,null,null,null,null,null,"Evalucion","(Varios elementos)",null,null,null,null,null,null,null,null,null,"Dias","Reparto",null,"Dias","A Tiepo",null,"Dias","Fuert","Dias","Devuel."]
[null,"Marca","Otd",null,null,null,null,{"$f":"CONCATENATE(\"On Time Acumulado por MP - \",C5)","v":"On Time Acumulado por MP - May"},null,null,null,null,null,null,null,null,null,null,null,null,null,{"$f":"V6/$S$6","v":0.11666666666666667},null,null,{"$f":"Y6/$S$6","v":0},null,null,{"$f":"AB6/$S$6","v":0.8833333333333333},null,null,{"$f":"AE6/$S$6","v":0},null,null,null,null,null,null,null,null,null,null,null,"Evalucion","(Varios elementos)",null,"Evalucion","(Varios elementos)",null,null,45474,173,null,45474,169,null,45474,4,45474,0]
[null,"CARMEL",0.11666666666666667,null,"CARMEL",{"$f":"IFERROR(VLOOKUP(E8,$B$8:$C$10,2,FALSE),0)","v":0.11666666666666667},null,"Etiquetas de fila","On time","Repartido",null,"Etiquetas de fila","On time","Repartido",null,null,null,null,"Dias","Reparto",null,"Dias","A Tiepo",null,"Dias","Fuert",null,"Dias","Suma de Ne",null,"Dias","Devuel.",null,null,"eva","cant","%%",null,"Etiquetas de fila","cant",null,null,null,null,null,null,null,null,null,45475,265,null,45475,257,null,45475,8,45475,0]
[null,null,null,null,"EMPLEADOS",{"$f":"IFERROR(VLOOKUP(E9,$B$8:$C$10,2,FALSE),0)","v":0},null,45804,0.11666666666666667,360,null,"May",0.11382113821138211,369,null,null,null,null,45804,360,null,45804,42,null,45804,0,null,45804,318,null,45804,0,null,null,"24hrs",42,0.11666666666666667,null,"En Ruta",318,{"$f":"AN9/$S$6","v":0.8833333333333333},null,"Etiquetas de fila","Suma de Suma",null,"Etiquetas de fila","Suma de Suma",null,null,45476,226,null,45476,214,null,45476,12,45476,0]
[null,null,null,null,"PACIFIKA",{"$f":"IFERROR(VLOOKUP(E10,$B$8:$C$10,2,FALSE),0)","v":0},null,45805,0,6,null,"Total general",0.11382113821138211,369,null,null,null,null,"Total general",360,null,"Total general",42,null,"Total general",0,null,"Total general",318,null,"Total general",0,null,null,"En Ruta",318,0.8833333333333333,null,"Total general",318,{"$f":"AN10/$S$6","v":0.8833333333333333},null,"En Ruta",318,null,"F",318,null,null,45481,143,null,45481,135,null,45481,8,45481,0]
[null,null,null,null,null,null,null,45806,0,3,null,null,null,null,null,null,null,null,null,null,null,null,null,null,null,null,null,null,null,null,null,null,null,null,"Total general",360,1,null,null,null,0,null,"Total general",318,null,"Total general",318,null,null,45482,218,null,45482,212,null,45482,6,45482,0]
[null,null,null,null,null,null,null,"Total general",0.11382113821138211,369,null,null,null,null,null,null,null,null,null,null,null,null,null,null,null,null,null,null,null,null,null,null,null,null,null,null,null,null,null,null,0,null,null,null,null,null,null,null,null,45483,236,null,45483,230,null,45483,6,45483,0]
[null,null,null,null,null,null,null,null,null,null,null,null,null,null,null,null,null,null,null,null,null,null,null,null,null,null,null,null,null,null,null,null,null,null,null,null,null,null,null,null,0,null,null,null,null,null,null,null,null,45484,108,null,45484,104,null,45484,4,45484,0]
[null,null,null,null,null,null,null,null,null,null,null,null,null,null,null,null,null,null,null,null,null,null,null,null,null,null,null,null,null,null,null,null,null,null,null,null,null,null,null,null,0,null,null,null,null,null,null,null,null,45488,150,null,45488,146,null,45488,3,45488,1]
[null,null,null,null,null,null,null,null,null,null,null,null,null,null,null,null,null,null,null,null,null,null,null,null,null,null,null,null,null,null,null,null,null,null,null,null,null,null,null,null,0,null,null,null,null,null,null,null,null,45489,142,null,45489,137,null,45489,5,45489,0]
[null,null,null,null,null,null,null,null,null,null,null,null,null,null,null,null,null,null,null,null,null,null,null,null,null,null,null,null,null,null,null,null,null,null,"24hrs",{"$f":"IFERROR(VLOOKUP(AI16,$AI$8:$AK$14,2,FALSE),0)","v":42},{"$f":"IFERROR(VLOOKUP(AI16,$AI$8:$AK$14,3,FALSE),0)","v":0.11666666666666667},{"$f":"CONCATENATE(AI16,\" - \",AJ16,\"  \",TEXT(AK16,\"0.00%\"))","v":"24hrs - 42  11.67%"},null,null,0,null,null,null,null,null,null,null,null,45490,66,null,45490,65,null,45490,1,45490,0]
[null,null,null,null,null,null,null,null,null,null,null,null,null,null,null,null,null,null,null,null,null,null,null,null,null,null,null,null,null,null,null,null,null,null,"48hrs",0,0,{"$f":"CONCATENATE(AI17,\" - \",AJ17,\"  \",TEXT(AK17,\"0.00%\"))","v":"48hrs - 0  0.00%"},null,null,0,null,null,null,null,null,null,null,null,45491,128,null,45491,120,null,45491,8,45491,0]
[null,null,null,null,null,null,null,null,null,null,null,null,null,null,null,null,null,null,null,null,null,null,null,null,null,null,null,null,null,null,null,null,null,null,"72hrs",0,0,{"$f":"CONCATENATE(AI18,\" - \",AJ18,\"  \",TEXT(AK18,\"0.00%\"))","v":"72hrs - 0  0.00%"},null,null,0,null,null,null,null,null,null,null,null,45497,61,null,45497,58,null,45497,3,45497,0]
[null,null,null,null,null,null,null,null,null,null,null,null,null,null,null,null,null,null,null,null,null,null,null,null,null,null,null,null,null,null,null,null,null,null,"+72hrs",0,0,{"$f":"CONCATENATE(AI19,\" - \",AJ19,\"  \",TEXT(AK19,\"0.00%\"))","v":"+72hrs - 0  0.00%"},null,null,0,null,null,null,null,null,null,null,null,45498,309,null,45498,301,null,45498,8,45498,0]
[null,null,null,null,null,null,null,null,null,null,null,null,null,null,null,null,null,null,null,null,null,null,null,null,null,null,null,null,null,null,null,null,null,null,"Motivado",0,0,{"$f":"CONCATENATE(AI20,\" \",AJ20,\" - \",TEXT(AK20,\"0.00%\"))","v":"Motivado 0 - 0.00%"},null,null,0,null,null,null,null,null,null,null,null,45499,260,null,45499,248,null,45499,11,45499,1]
[null,null,null,null,null,null,null,null,null,null,null,null,null,null,null,null,null,null,null,null,null,null,null,null,null,null,null,null,null,null,null,null,null,null,"En Ruta",318,0.8833333333333333,{"$f":"CONCATENATE(AI21,\" \",AJ21,\" - \",TEXT(AK21,\"0.00%\"))","v":"En Ruta 318 - 88.33%"},null,null,0,null,null,null,null,null,null,null,null,45503,145,null,45503,139,null,45503,5,45503,1]
[null,null,null,null,null,null,null,null,null,null,null,null,null,null,null,null,null,null,null,null,null,null,null,null,null,null,null,null,null,null,null,null,null,null,null,null,null,null,null,null,0,null,"Evalucion","A Tiempo",null,null,null,null,null,45504,327,null,45504,313,null,45504,12,45504,2]
[null,null,null,null,null,null,null,null,null,null,null,"Etiquetas de fila","On time","Repartido",null,null,null,null,null,null,null,null,null,null,null,null,null,null,null,null,null,null,null,null,null,null,null,null,null,null,0,null,null,null,null,null,null,null,null,"Total general",2957,null,"Total general",2848,null,"Total general",104,"Total general",5]
[null,null,null,null,null,null,null,null,null,null,null,22,0.11382113821138211,369,null,null,null,null,null,null,null,null,null,null,null,null,null,null,null,null,null,null,null,null,null,null,null,null,null,null,0,null,"Etiquetas de fila","Suma de Suma","Suma de Suma2"]
[null,null,null,null,null,null,null,null,null,null,null,"Total general",0.11382113821138211,369,null,null,null,null,null,null,null,null,null,null,null,null,null,null,null,null,null,null,null,null,null,null,null,null,null,null,0,null,1,42,1]
[null,null,null,null,null,null,null,null,null,null,null,null,null,null,null,null,null,null,null,null,null,null,null,null,null,null,null,null,null,null,null,null,null,null,"24hrs",{"$f":"IFERROR(VLOOKUP(AI26,$AI$8:$AK$14,2,FALSE),0)","v":42},{"$f":"IFERROR(VLOOKUP(AI26,$AI$8:$AK$14,3,FALSE),0)","v":0.11666666666666667},null,null,null,0,null,"Total general",42,1,null,null,null,null,"Evalucion","(Varios elementos)",null,"Evalucion","(Varios elementos)"]
[null,null,null,null,null,null,null,null,null,null,null,null,null,null,null,null,null,null,null,null,null,null,null,null,null,null,null,null,null,null,null,null,null,null,"48hrs",0,0,null,null,null,0,null,null,null,null,null,null,null,null,"LeadHoras","En Ruta",{"$f":"VLOOKUP(\"Total general\",$AX$29:$AY$51,2,FALSE)","v":318},null,null,null,{"$f":"CONCATENATE(\"Acumulado de \",AY27,\"  \",\"Por Días\")","v":"Acumulado de En Ruta  Por Días"}]
[null,null,null,null,null,null,null,null,null,null,null,null,null,null,null,null,null,null,null,null,null,null,null,null,null,null,null,null,null,null,null,null,null,null,"72hrs",0,0,null,null,null,0,null,null,null,null,null,null,null,null,null,null,{"$f":"IF(AY27=\"en ruta\",CONCATENATE(\"Motivos en  \",AY27),IF(AY27=\"motivado\",\"Motivos\",CONCATENATE(\"Motivos Entregados a las  \",AY27)))","v":"Motivos en  En Ruta"},"Suma de Suma","Etiquetas de columna"]
[null,null,null,null,null,null,null,null,null,null,null,null,null,null,null,null,null,null,null,null,null,null,null,null,null,null,null,null,null,null,null,null,null,null,"+72hrs",0,0,null,null,null,null,null,null,null,null,null,null,null,null,"Etiquetas de fila","Suma de Suma",null,"Etiquetas de fila","En Ruta","Total general"]
[null,null,null,null,null,null,null,null,null,null,null,null,null,null,null,null,null,null,null,null,null,null,null,null,null,null,null,null,null,null,null,null,null,null,"Motivado",0,0,null,null,null,null,null,null,null,null,null,null,null,null,"En Ruta",318,null,45804,318,318]
[null,null,null,null,null,null,null,null,null,null,null,null,null,null,null,null,null,null,null,null,null,null,null,null,null,null,null,null,null,null,null,null,null,null,"En Ruta",318,0.8833333333333333,null,null,null,null,null,null,null,null,null,null,null,null,"Total general",318,null,45805,6,6]
[null,null,null,null,null,null,null,null,null,null,null,null,null,null,null,null,null,null,null,null,null,null,null,null,null,null,null,null,null,null,null,null,null,null,null,null,null,null,null,null,null,null,null,null,null,null,null,null,null,null,null,null,45806,3,3]
[null,null,null,null,null,null,null,null,null,null,null,null,null,null,null,null,null,null,null,null,null,null,null,null,null,null,null,null,null,null,null,null,null,null,null,null,null,null,null,null,null,null,null,null,null,null,null,null,null,null,null,null,"Total general",327,327]
[null,"Etiquetas de fila","On time","Repartido"]
[null,202508,0.11475409836065574,366]
[null,203201,0,3]
[null,"Total general",0.11382113821138211,369]
[]
[null,null,null,null,null,null,null,null,null,null,null,null,null,null,null,null,null,null,null,null,null,null,null,null,null,null,null,null,null,null,null,null,null,null,null,null,null,null,null,null,null,null,"Etiquetas de fila","On Time","Repartido"]
[null,null,null,null,null,null,null,null,null,null,null,null,null,null,null,null,null,null,null,null,null,null,null,null,null,null,null,null,null,null,null,null,null,null,null,null,null,null,null,null,null,null,"PROVINCIA",0.11666666666666667,360]
[null,null,null,null,null,null,null,null,null,null,null,null,null,null,null,null,null,null,null,null,null,null,null,null,null,null,null,null,null,null,null,null,null,null,null,null,null,null,null,null,null,null,"Total general",0.11666666666666667,360]
[]
[]
[null,null,null,null,null,null,null,null,null,null,null,null,null,null,null,null,null,null,"Etiquetas de fila","On Time","Out of Time","En Gestion","Nulos."]
[null,null,null,null,null,null,null,null,null,null,null,null,null,null,null,null,null,null,45804,42,0,318,0]
[null,null,null,null,null,null,null,null,null,null,null,null,null,null,null,null,null,null,45805,0,0,6,0]
[null,null,null,null,null,null,null,null,null,null,null,null,null,null,null,null,null,null,45806,0,0,3,0]
[null,null,null,null,null,null,null,null,null,null,null,null,null,null,null,null,null,null,"Total general",42,0,327,0]

{"sheet":"Dashboard","index":2,"n_rows":0,"n_cols":0,"rows_kept":0,"cut":false,"hidden":false,"merged":[]}

{"sheet":"Dias Feriados","index":3,"n_rows":7,"n_cols":2,"rows_kept":7,"cut":false,"hidden":true,"merged":[]}
["2024-11-01","Dias Feriados"]
["2024-12-09"]
["2024-12-25"]
["2025-01-01"]
["2025-04-17"]
["2025-04-18"]
["2025-05-01"]

{"sheet":"Efectividad Distrital","index":4,"n_rows":47,"n_cols":14,"rows_kept":47,"cut":false,"hidden":false,"merged":[[0,2,0,13]]}
[null,null,"Efectividad Distrital"]
[]
[]
[]
[]
[]
[]
[null,null,"Distritos","24 hrs","48 hrs","72 hrs","72+ hrs","En Gestion","Devueltos/Motivos","Total","On Time","Out of Time","On Time sin Devueltos","%Ede"]
[null,null,"PROVINCIA",42,0,0,0,327,0,369,0.11382113821138211,0,0.11382113821138211,1]
[null,null,"ALTO LARAN",2,0,0,0,0,0,2,1,0,1,1]
[null,null,"QUILMANA",2,0,0,0,0,0,2,1,0,1,1]
[null,null,"CHINCHA ALTA",17,0,0,0,1,0,18,0.94444444444444442,0,0.94444444444444442,1]
[null,null,"SUNAMPE",7,0,0,0,1,0,8,0.875,0,0.875,1]
[null,null,"PUEBLO NUEVO",9,0,0,0,4,0,13,0.69230769230769229,0,0.69230769230769229,1]
[null,null,"GROCIO PRADO",1,0,0,0,1,0,2,0.5,0,0.5,1]
[null,null,"SAN JOSE DE LOS MOLINOS",1,0,0,0,1,0,2,0.5,0,0.5,1]
[null,null,"EL CARMEN",1,0,0,0,7,0,8,0.125,0,0.125,1]
[null,null,"LOS AQUIJES",1,0,0,0,7,0,8,0.125,0,0.125,1]
[null,null,"ICA",1,0,0,0,126,0,127,7.874015748031496E-3,0,7.874015748031496E-3,1]
[null,null,"ASIA",0,0,0,0,5,0,5,0,0,0,0]
[null,null,"PISCO",0,0,0,0,25,0,25,0,0,0,0]
[null,null,"MARCONA",0,0,0,0,1,0,1,0,0,0,0]
[null,null,"LA TINGUIÑA",0,0,0,0,20,0,20,0,0,0,0]
[null,null,"SAN CLEMENTE",0,0,0,0,2,0,2,0,0,0,0]
[null,null,"MALA",0,0,0,0,3,0,3,0,0,0,0]
[null,null,"CHILCA",0,0,0,0,1,0,1,0,0,0,0]
[null,null,"INDEPENDENCIA",0,0,0,0,1,0,1,0,0,0,0]
[null,null,"VISTA ALEGRE",0,0,0,0,3,0,3,0,0,0,0]
[null,null,"NAZCA",0,0,0,0,10,0,10,0,0,0,0]
[null,null,"PACHACUTEC",0,0,0,0,1,0,1,0,0,0,0]
[null,null,"RIO GRANDE",0,0,0,0,1,0,1,0,0,0,0]
[null,null,"PARCONA",0,0,0,0,32,0,32,0,0,0,0]
[null,null,"SAN ANDRES",0,0,0,0,3,0,3,0,0,0,0]
[null,null,"SALAS",0,0,0,0,2,0,2,0,0,0,0]
[null,null,"TUPAC AMARU INCA",0,0,0,0,2,0,2,0,0,0,0]
[null,null,"SAN LUIS",0,0,0,0,6,0,6,0,0,0,0]
[null,null,"CERRO AZUL",0,0,0,0,2,0,2,0,0,0,0]
[null,null,"SAN ANTONIO",0,0,0,0,1,0,1,0,0,0,0]
[null,null,"IMPERIAL",0,0,0,0,13,0,13,0,0,0,0]
[null,null,"SUBTANJALLA",0,0,0,0,11,0,11,0,0,0,0]
[null,null,"NUEVO IMPERIAL",0,0,0,0,5,0,5,0,0,0,0]
[null,null,"TATE",0,0,0,0,3,0,3,0,0,0,0]
[null,null,"EL INGENIO",0,0,0,0,1,0,1,0,0,0,0]
[null,null,"SAN VICENTE DE CAÑETE",0,0,0,0,9,0,9,0,0,0,0]
[null,null,"SAN JUAN BAUTISTA",0,0,0,0,5,0,5,0,0,0,0]
[null,null,"SANTIAGO",0,0,0,0,11,0,11,0,0,0,0]
[null,null,"Total general",42,0,0,0,327,0,369,0.11382113821138211,0,0.11382113821138211,1]

{"sheet":"Tabla de Deficientes","index":5,"n_rows":376,"n_cols":10,"rows_kept":376,"cut":false,"hidden":false,"merged":[[0,0,0,11]]}
["Deficientes de Direcciones"]
[]
[]
[]
[]
[]
[null,null,"--","Fecha Despacho","MES","Nombre","Direccion","MP","Deficientes","Observacion"]
[null,null,"B001667555",45804,"May","ROBERT NICOLAS AQUIJE ALCANTAR","AV AMERICA ENTRANDO X LA CRUZ PASANDO COLEGIO AV AMERICA BAJADA DE LA MOLINA","F","NO","(en blanco)"]
[null,null,"B001667463",45804,"May","CHRISTOPHER RYAN UGARTE MUSTO","CALLE CAMINO REAL LT 10 FRENTE A FACULTAD DE VETERINARIA CAMINO REAL","F","NO","(en blanco)"]
[null,null,"B001667703",45804,"May","SARA LUZ ALCALA VASQUEZ","CL RIVAS 161 PRIMERA CUADR AV AMERICAS","F","NO","(en blanco)"]
[null,null,"B001667630",45804,"May","DARIANNA JANE ESPERANZA TORRES","AAHH LOS FICUS MZNA B LT 16","F","NO","(en blanco)"]
[null,null,"B001667657",45804,"May","ADA ALEJANDRA ALCALA VASQUEZ","RIVAS 161 PRIMERA CUADRA AVENIDA AMERICA","F","NO","(en blanco)"]
[null,null,"B001667716",45804,"May","ROSANA AMPARO QUINTANA ARTEAG","PABLO TASAYCO 170 ENTRADA MAPFRE","F","NO","(en blanco)"]
[null,null,"B001667594",45804,"May","DENISSE CAROLINA MONASI LUJAN","AV UNION 129 ANTES A LA MEDIA ANTES DE LLEGAR A LA MEGA PLAZA","F","NO","(en blanco)"]
[null,null,"B001667338",45804,"May","CRISTHOFER PAUL AURIS GUTIERRE","LOS ANGELES 350 PASANDO LA RENIEC LOS ANGELES EDIFICIO SANTA TERESA","F","NO","(en blanco)"]
[null,null,"B001667557",45804,"May","REBECCA MARIA HERRERA MORALES","URB LAS BEGONIAS PASAJE RIVAS 10A 2DO PISO AL COSTADO DEL SEGURO","F","NO","(en blanco)"]
[null,null,"B001667637",45804,"May","BLANCA ESTELA LEVANO MATIAS","AVSAN IDELFONSO SN COSTADO PASAJE SILESA","F","NO","(en blanco)"]
[null,null,"B001667722",45804,"May","ANTONIA HERMELINDA MONSERRATE","AV AMERICA 347 CHINCHA ALTA","F","NO","(en blanco)"]
[null,null,"B001667392",45804,"May","KATIE ELENA LEVANO DETORRES","PROLO MARISCAL CASTILLA 156 OOL MARIA DE LOS ANGELES","F","NO","(en blanco)"]
[null,null,"B001668222",45804,"May","GUILLIANA TORRES DE LA CRUZ","CALLE ERNESTO VELIT RUIZ 348 B POR EL HOSPEDAJE RICARDOS","F","NO","(en blanco)"]
[null,null,"B001667528",45804,"May","EDITH ROCIO TRILLO GARCIA","ANTIGUO MERCADO 3ER PUERTA 134 MERCADILLO EN LA PUERTA 3","F","NO","(en blanco)"]
[null,null,"B001667460",45804,"May","JHENNY ROSARIO OCHOA CHACALTAN","JR JUNIN 412 A 4 CDRAS DE LA PLAZA DE ARMAS","F","NO","(en blanco)"]
[null,null,"B001667414",45804,"May","LUCY LILIANA RUIZ CARDENAS","SAN AGUSTIN MZ Z LT 4 FRT A LA IGLESIA EVANGELICA UPIS","F","NO","(en blanco)"]
[null,null,"B001667457",45804,"May","MARIA ROXANA VILLAMARES TASAYC","AMERICA 199 LT 1 POR EL PEDAGOGICO DE CHINCHA","F","NO","(en blanco)"]
[null,null,"B001667663",45804,"May","ANALI PAOLA CAMPOS RODRIGUEZ","AV ARGENTINA MZ I LOTE 7 IGLESIA MISIONERA","F","NO","(en blanco)"]
[null,null,"B001667400",45804,"May","MERLLI EDITH ROMERO VILCA","AV LUIS MASSARO INTERIOR 2 579 ENTRE JUNIN Y CALLE GRAU","F","NO","(en blanco)"]
[null,null,"B001667513",45804,"May","JOSSELIN FIORELLA SIGUAS TORRE","CENTRO POBLADO BUENAVENTURA LT 15 COST CONDOMINIO CABALLERIZAS SAN JOSE","F","NO","(en blanco)"]
[null,null,"B001667398",45804,"May","NARDA DE BELEN RONCEROS","CENTRO POBLADO SAN JOSE MZ B LT 19 CENTRO MEDICO SAN JOSE","F","NO","(en blanco)"]
[null,null,"B001667595",45804,"May","MARIA VICTORIA BOHORQUEZ DE RO","CP SAN JOSE MZB LT 19 COSTADO DE LA POSTA","F","NO","(en blanco)"]
[null,null,"B001667541",45804,"May","ANJELI DAYANA QUISPE SIGUAS","CP SAN JOSE MZ B LT 80 ESPALDA COL INICIAL","F","NO","(en blanco)"]
[null,null,"B001667510",45804,"May","LEYDI YESENIA ANAMPA HUACAHUAS","CALLE PRINCIPAL MZ B LT 80 DETRAS DEL COLEGIO INICIAL 240 EL CARMEN CP SAN JOSE","F","NO","(en blanco)"]
[null,null,"B001667489",45804,"May","NARDA JANET MEJIA CASTRILLON","CL CARRILLO 121 FRENTE COLEGIO INICIAL 256","F","NO","(en blanco)"]
[null,null,"B001667407",45804,"May","SELENE BOHORQUEZ RAMOS","PLAZA DE ARMAS 308 RESTAURANTE DE ODALI DISTRITO DE EL CARMEN","F","NO","(en blanco)"]
[null,null,"B001667501",45804,"May","MILAGROS ANGELINA VILLA CABRER","MARISCAL CASTILLA 2 MZ B LT LOTE ESPALDA DEL COLEGIO MELCHORITA","F","NO","(en blanco)"]
[null,null,"B001667477",45804,"May","MARELLA CHAVEZ FAJARDO","CL SIMON BOLIVAR MZ C LT 33 ESTADIO DE CHINCHA URB MAGISTERIAL","F","NO","(en blanco)"]
[null,null,"B001667372",45804,"May","SHIRLEY CAMILLA MANSILLA CORDO","CL SAN ISIDRO PUEBLO NUEVO 1100 FRENTE AL PARQUE DE LA REVOLUCION","F","NO","(en blanco)"]
[null,null,"B001667480",45804,"May","MARIA DEL CARMEN PEREZ LEVANO","TECHO PROPIO 1 MZ N LT 16 POR EL TECNOLOGICO LOS VINEDOS N 16","F","NO","(en blanco)"]
[null,null,"B001667760",45804,"May","MARIA ANTONIA GALVEZ ENRIQUEZ","CL CUZCO MZCH LT 10A MICAELA BASTIDA PANADERIA BOSEDAL","F","NO","(en blanco)"]
[null,null,"B001667668",45804,"May","ESTHER DANISA VELAZCO MOLINA","BUENAVENTURA MZB LT 6 POR LA PISTA CARRETERA ALTO LARAN","F","NO","(en blanco)"]
[null,null,"B001667644",45804,"May","JOVITA CLAUDETTE FRIAS ASCONA","AV VICTOR ANDRES BELAUNDE 341 A MEDIA CUADRA DE NOTARIA MORON","F","NO","(en blanco)"]
[null,null,"B001668095",45804,"May","NAYERLY DELPILAR AYONA MURICHE","LEN DE VIVERO MZ HLT 06 COL CAIROS PQ SANTA ROSA","F","NO","(en blanco)"]
[null,null,"B001668350",45804,"May","MARIA ESTHER ORE VILLA","URB MAGISTERIAL MZ D LT 17 FRENTE AL ESTADIO","F","NO","(en blanco)"]
[null,null,"B001667709",45804,"May","MILUSKA ANGELICA HUERTAS TIPIC","JR SANTA ROSA 1021 PAR DE LA REVOLUCION","F","NO","(en blanco)"]
[null,null,"B001667410",45804,"May","LUISA MARIA LHY CASTELLANO","JR ICA 840 FRENTE AL COLEGIO 2 DE MAYO","F","NO","(en blanco)"]
[null,null,"B001667753",45804,"May","MIRIAN ESTHER FLORES MANRIQUE","AV JOSE CRESPRO Y CASTILLO 601","F","NO","(en blanco)"]
[null,null,"B001667334",45804,"May","MELISSA DEL PILAR CHAVEZ TRELL","PASAJE SANTA ROSA 25 1CDRA SALON REINO TESTIGOS DE JEHOVA","F","NO","(en blanco)"]
[null,null,"B001667602",45804,"May","BETZABE SAMANTHA PAMPAS FLORES","CLLE SAN ALEJANDRO SN COSTADO DEL RESTAURANTE LA CASONA EL BOSQUE","F","NO","(en blanco)"]
[null,null,"B001667381",45804,"May","MILAGRO YOHANA SOTELO MESIAS","JR INDEPENDENCIA 266 PAR JUEGOS AGROPECUARIA CAMOTE","F","NO","(en blanco)"]
[null,null,"B001667609",45804,"May","ANA LISSETH SARAVIA MUNANTE","AV FATIMA COST DE LA VIA SAN VICENTE","F","NO","(en blanco)"]
[null,null,"B001667431",45804,"May","MARIA JULIA LEVANO DEALMEYDA","AV SAN IDELFONSO N 340 PASANDO MAESTROS CHINCHAS","F","NO","(en blanco)"]
[null,null,"B001667409",45804,"May","JESSICA MONTOYA CARDENAS","AV PRINCIPAL HUACA GRANDE 11 ANTES DE CASA CLUB","F","NO","(en blanco)"]
[null,null,"B001668149",45804,"May","CARMEN ESTEFANI ATUNCAR HUALLA","AV SAN IGNACIO INTERIOR 1 141 POR LA PLAZA DE ARMAS","F","NO","(en blanco)"]
[null,null,"B001667604",45804,"May","FREDESVINDA VICTORIA CASIANO R","JR SAN MARTIN 126 A 5 ESQUINAS","F","NO","(en blanco)"]
[null,null,"B001667613",45804,"May","YANIRA ALEXANDRA CHACALTANA PA","URB SAN JOAQUIN O2 III ETAPA ESPALDAS DEL COL OLINDA","F","NO","(en blanco)"]
[null,null,"B001667615",45804,"May","ROSA ESPERANZA MOLINA GUERRA","URB SAN JOAQUN A 7 1ERET PRIMERA LOZA","F","NO","(en blanco)"]
[null,null,"B001667483",45804,"May","MERY ESTEFANY GARAVITO YAURICA","AYACUCHO 129 POR EL BANCO INTERBANK GALERIA ICATOP PLAZA STAND 07","F","NO","(en blanco)"]
[null,null,"B001667694",45804,"May","MARIA LUISA URIBE BALBIN","URBANIZACION EL CARMEN D 3 ANTIGUA PANAMERICANA","F","NO","(en blanco)"]
[null,null,"B001667511",45804,"May","GIOVANNA JENIFFER ESPINOZA ECO","RESIDENCIAL SAN CARLOS MZ O LOTE 39 PRIMER PARQUE FRENTE TELEFONO PUBLICO","F","NO","(en blanco)"]
[null,null,"B001667676",45804,"May","ANA MARIA GUTIERREZ GUTIERREZ","URB LOS VINEDOS DE STA MARIA F17 MERCADO ARENALES","F","NO","(en blanco)"]
[null,null,"B001667941",45804,"May","MONICA BEATRIZ ARIAS QUISPE","CL JUAN JOSE SALAS 275 URB SAN MIGUEL","F","NO","(en blanco)"]
[null,null,"B001667365",45804,"May","DIANA CLEMENTINA ZEVALLOS ESPI","SANTA MARIA MZ C LT 3 FRENTE A HOTEL SANTA MARIA URB SANTA MARIA","F","NO","(en blanco)"]
[null,null,"B001667412",45804,"May","CLAUDIA RAMOS AVELLANEDA","CALLE AYACUCHO 7MA CDRA CERCA A LA IGLECIA LOUREN","F","NO","(en blanco)"]
[null,null,"B001667949",45804,"May","MILAGROS ROSARIO RAMOS RAMOS","SANTA ROSA 189 INGRESAR X HOTEL ROMA 3ER ROMPEMUELLE SAN JOAQUIN VIEJO SANTA ROSA","F","NO","(en blanco)"]
[null,null,"B001667631",45804,"May","PEGGY ORIETA OSORIO SAN","URB LAS CAFIARIMAS F 13 ETAPA 1 ET 1 FRENTE A LA LOZA DEPORTIVA ICA","F","NO","(en blanco)"]
[null,null,"B001668184",45804,"May","JADE AIRANA BARRIOS CUTIPA","AV SAN MARTIN 245 FRENTE A OESHLE","F","NO","(en blanco)"]
[null,null,"B001667785",45804,"May","ROSARIO DOMITILA KUQUIAN ANICA","LA PALMA J4 CASI AL FINAL DEL COLEGIO TORIBIO POLO URBANIZACION","F","NO","(en blanco)"]
[null,null,"B001667347",45804,"May","DENNIS ROXANA MUNARRIZ PALOMIN","RINCONADA DE HUACACHINA E 15 3 ETAPA COSTADO COLEGIO SANTISIMO JESUS","F","NO","(en blanco)"]
[null,null,"B001667539",45804,"May","JESSEN ELIZABETH ROSAS VIZARRE","URB SANTO DOMINGO DE GUZMAN K 31 CASA VERDE DE 1 PISO EN EL PARQUE","F","NO","(en blanco)"]
[null,null,"B001667769",45804,"May","MARTHA MARLENI HUANCAHUARI CAS","URB PALAZUELOS MZ N F LT 15 A UNA ESQUINA D E UNA FERRETERIA","F","NO","(en blanco)"]
[null,null,"B001667730",45804,"May","JUANA RUTH ACUNA GRADOS","MARCONA D 04 URB STO DOMINGO","F","NO","(en blanco)"]
[null,null,"B001667711",45804,"May","CARMEN ROSA CENTURION CHAVEZ","LAS DUNAS MZ E LT 05 CERCA AL GRIFO URB SAN JOAQUIN","F","NO","(en blanco)"]
[null,null,"B001667475",45804,"May","CELEDONIA QUISPE MALDONADO","LA PALMA B38 A LA ESPALDA DE LA PLAZUELA ICA","F","NO","(en blanco)"]
[null,null,"B001667767",45804,"May","NELBA MARIA GUILLEN QUIJANDRIA","SAN JOAQUIN E 31 1RA ET POR EL CRUCE DE SAN JUANQUIN","F","NO","(en blanco)"]
[null,null,"B001667721",45804,"May","AMELIA ROSA LLERENA HILARIO","CASERIO SAN MARTIN DE PORRAS V 13 CAMINO A SAN JUAN ANTES DE FONAVI","F","NO","(en blanco)"]
[null,null,"B001667697",45804,"May","MEY LEM DEL ROSARIO KOC CABRER","CALLE JOSE GALVEZ EGUSQUIZA 101 COSTADO POLLERIA MONCHI URBANIZACION SAN JOAQUIN ETAPA 1","F","NO","(en blanco)"]
[null,null,"B001667478",45804,"May","ANA FLAVIA GARAVITO COSSIO","EDIFICIO SANTA LUCIA DPTO 202 202 MZ C29 A MEDIA CUADRA DE ICATOM LOS FICUS DE LUREN","F","NO","(en blanco)"]
[null,null,"B001667585",45804,"May","ROSA TORIBIA CALCINA CARI","POR ALTA TENSION MZ D LT 17 ULTIMO PARADERO A 3 CDRAS TEPRO ECOLOGICO","F","NO","(en blanco)"]
[null,null,"B001667494",45804,"May","JHANNET MILAGROS VARGAS RAMOS","ALFONSO UGARTE MZ K LT 1A CASERIO SAN MARTIN DE PORRAS","F","NO","(en blanco)"]
[null,null,"B001667339",45804,"May","LUZ YANET DONAYRE QUIJAITE","CASUARINAS MZ B LT 26 BAJADA DE CASUARINAS A LA IZQUIERDA URB CASUARINAS","F","NO","(en blanco)"]
[null,null,"B001667766",45804,"May","ALONDRA CAROLINA PRADA YEREN","MIRADOR DESANTA ROSA A15 CEMENTERIO SARAJA MERCADO ARENALES","F","NO","(en blanco)"]
[null,null,"B001667506",45804,"May","OLGA JULIA GONZALES NIETO","COMATRANA LOS GRIMALDOS LT 5 SAN PABLO EL","F","NO","(en blanco)"]
[null,null,"B001667660",45804,"May","VALERIA CECILIA AGUILAR CARBAJ","AV LOS JUAREZ 121 Y22 ANTES DE LA ANTENA DE CELULAR COMATRANA","F","NO","(en blanco)"]
[null,null,"B001668273",45804,"May","SABINA MARILU GALVEZ DE YAMASH","LOS VINEDOS D 25 POR EL HOTEL PRINCESS POR EL HOTEL PRINCESS","F","NO","(en blanco)"]
[null,null,"B001667396",45804,"May","DEYVIS LUIS FERREL HUALPA","COMDOMIO VILLA EL GUAYABO MZ E LT 12 ENTRADA DE LA VICTORIA CONDOMINIO VILLA EL GUAYABO","F","NO","(en blanco)"]
[null,null,"B001667354",45804,"May","MELISSA MABEL TITO ORMENO","URB SAN JOAQUIN 1 ETP MZ R LT 16 PASANDO EL RESERVORIO A MEDIA CUADRA","F","NO","(en blanco)"]
[null,null,"B001667623",45804,"May","MARY LUPE CABRERA URIBE","URB SAN JOAQUIN G 11 ET 1 ANTES DEL COL JULIO C TELLO","F","NO","(en blanco)"]
[null,null,"B001667796",45804,"May","SANDY ARACELY PARIONA VASQUEZ","HUANUCO 371 RESTAURAN TONO Y VERONICA SERCADO DE ICA","F","NO","(en blanco)"]
[null,null,"B001667454",45804,"May","FABIOLA ARLET TORRES AQUIJE","SOL DE ICA LOS PORTALES 11 NG17 ENTRADA CENTRO RECREACIONAL","F","NO","(en blanco)"]
[null,null,"B001667600",45804,"May","WENDY ERIKA ANAIS ALIAGA TENOR","URB VILLA KILLARI B15 MENORCA MENORCA SANTA MARIA A ESPALDAS DEL PARQUE","F","NO","(en blanco)"]
[null,null,"B001667519",45804,"May","CAMILA FERNANDA RISCO HERNANDE","CL LA MAR MIL 28 AV CUTERVO Y CL NASCA","F","NO","(en blanco)"]
[null,null,"B001667333",45804,"May","NATHALIA PAULINA CARO RAMOS","AV CUTERVO 219 URB SAN ISIDRO RESTAURANTE MCGRILL","F","NO","(en blanco)"]
[null,null,"B001667659",45804,"May","VICTORIA GUTIERREZ RAMOS","SAN JOAQUIN MZT LT 61 A MEDIA CUADRA DEL CRUCE URB SAN JOAQUIN 2DA ETAPA","F","NO","(en blanco)"]
[null,null,"B001667633",45804,"May","MARIA DEL ROSARIO RIOS ECOS","BOTIJERIA ANGULO SUR INTERIOR B MZ L LT 23B POR LA ORILLA DEL RIO BOTIJERIA ANGULO SUR MANZANILLA","F","NO","(en blanco)"]
[null,null,"B001667658",45804,"May","JOANIE DEL CARMEN LUJAN SOSA","URB VILLAS DEL SOL E01 ETAPA 2 ETAPA 2","F","NO","(en blanco)"]
[null,null,"B001667626",45804,"May","NORIS EVARISTA ALLGAIHUAMAN HU","CL CALLAO 212 PISO 3 DPTO 5 COSTADO DE LA NOTARIA SANCHEZ","F","NO","(en blanco)"]
[null,null,"B001667416",45804,"May","MARIA DEL ROSARIO PARVINA ALVA","SANTA ROSA DEL PALMAR TURQUESAS 0 MZ F LT 31 ANTES DE LLEGAR ALA POLLERIA EL HUARANGO","F","NO","(en blanco)"]
[null,null,"B001667337",45804,"May","DAYSI YOLANDA ALMORA SANDOVAL","SAN JUAN BAUTISTA CACERIO LONGAR 1010 PASANDO EL RESERVORIO","F","NO","(en blanco)"]
[null,null,"B001667795",45804,"May","MERY TEODORA QUIJANDRIA NUNEZ","LOS VINEDOS MZ G LT 7 ESPALDA MERCADO ARENALES URB LOS VINEDOS","F","NO","(en blanco)"]
[null,null,"B001667589",45804,"May","LUPE MARIVEL CAMPOS RAMOS","PROLONGACION ABRAHAM VALDELOMAR 172 COSTADO DE COCACOLA","F","NO","(en blanco)"]
[null,null,"B001667484",45804,"May","LUISA ELIZABETH URIONDO PACHEC","EL CARMEN MZ C LT 9 X EL CRUCE DE SAN JOAQUIN URB EL CARMEN","F","NO","(en blanco)"]
[null,null,"B001667636",45804,"May","JUANA ISABEL GARIBAY GUEVARA","URB VALLE HERMOSO MZ J LOTE 02 RREF HUACACHINA","F","NO","(en blanco)"]
[null,null,"B001667608",45804,"May","LINA NEMESIA GALLEGOS CARRASCO","CLL CASTROVIRREYNA 114 INT 2 AL COSTADO DE TRAGAMONEDAS RICHARD","F","NO","(en blanco)"]
[null,null,"B001667761",45804,"May","FELICITA NELIDA SOTO CRISPIN","URB LAS PALMERAS O 16 4ET COL INCIAL UN MUNDO DE COLORES","F","NO","(en blanco)"]
[null,null,"B001667666",45804,"May","CINTHYA BEATRIZ RAMOS FLORES","LA MAR 733 MZ 0 LT A AL COSTADO DE LIBRERIA PALANTE 0","F","NO","(en blanco)"]
[null,null,"B001667499",45804,"May","JACQUELIN BLONDET VALENCIA","URB LAS DUNAS A8 SAN JOAQUIN NUEVO HOTEL CARMELO","F","NO","(en blanco)"]
[null,null,"B001667488",45804,"May","JUANA MARIA RIVAS CASTILLO","URB LOS EUCALIPTOS G16 ANTES DE RSDALL SAN CARLOS MINISTERIO","F","NO","(en blanco)"]
[null,null,"B001667434",45804,"May","SILVIA FLOR SALCEDO LAGOS","URB SAN JOAQUIN S 60 2 ETP CRUCE SAN JOAQUIN PO EL CHIFA KELIKO","F","NO","(en blanco)"]
[null,null,"B001667621",45804,"May","GLADYS ISABEL UCHUYA HERNANDEZ","ASOC LOS LIBERTADORES MZ C LT 11 UNIVERSIDAD SAN JUAN BASUTICAS","F","NO","(en blanco)"]
[null,null,"B001667417",45804,"May","FELICITA GLORIA SALCEDO LAGOS","URB SAN JOAQUIN S60 2DA ET CRUCE SAN JUAQUIN","F","NO","(en blanco)"]
[null,null,"B001667605",45804,"May","ROSARIO FELICITA GARCIA FLORES","ASOCIACION HILDA SALAS J 5 FRENTE AAHH LOS POLLITOS","F","NO","(en blanco)"]
[null,null,"B001667700",45804,"May","NORA MARIA MITMA ESPINOZA","CALLE PEDRO ORTIZ TALLA E234 FRENTE AL HOSTAL CAMPO ALEGRE","F","NO","(en blanco)"]
[null,null,"B001667670",45804,"May","ROSA MARLENI RAFAEL GAMBOA","CL PEDRO CARLOS OLAECHEA 150 A UNA CDRA DE AV SALAVD MANZANILLA","F","NO","(en blanco)"]
[null,null,"B001667517",45804,"May","FLOR DE MARIA HARVEY ORMENO","CALLE PAITA 248 CENTRO POR 2 DE MAYO","F","NO","(en blanco)"]
[null,null,"B001667436",45804,"May","JULIA YSABEL VEGA ARONES","VILLA EL PERIODISTA MZ A LT 9 POR EL COLISEO CERRADO VILLA EL PERIODISTA","F","NO","(en blanco)"]
[null,null,"B001667331",45804,"May","LUZ VIRGINIA VENTURA ASTOCAZA","SAN JUAQUIN EL HUALLABO I LT 2 COLISEO DE GALLOS","F","NO","(en blanco)"]
[null,null,"B001667559",45804,"May","PASCUALA ANITA SIGUAS HUAYTA","AAHH LAS DUNAS A 14 FRENTE AL HOTEL CARMELO","F","NO","(en blanco)"]
[null,null,"B001667350",45804,"May","DIANA VICTORIA RAMOS VALENCIA","VIEJO PSJ EL AMOR PUERTA 214 SAN JOAQUIN","F","NO","(en blanco)"]
[null,null,"B001667449",45804,"May","JENNY LILIANA AQUIJE OROSCO","PASAJE LOS JUAREZ 420 COMTRANA CLG JOSE OLAYA COMTRANA DERECHA 3 CDRAS","F","NO","(en blanco)"]
[null,null,"B001667429",45804,"May","CLEILA ISABEL GUERRA GAMBOA","URB SAN JOAQUIN P46 PRIMERA ET TERMINANDO EL COLEGIO JULIO C TELLO","F","NO","(en blanco)"]
[null,null,"B001667748",45804,"May","GIRVERT ANTHONY MIER Y TERAN","HILDA SALAS MZ J LT 5 ENTRADA CACHICHE FRENTE A LOS POLLITOS ASOC VIVIENDA HILDA SALAS","F","NO","(en blanco)"]
[null,null,"B001667355",45804,"May","ANA YSABEL CABRERA CACERES","LA MAR INTERIOR 2 442 ENTRE CALLE LA MAR Y HUANCAVELICA","F","NO","(en blanco)"]
[null,null,"B001667540",45804,"May","JACQUELINE DELCARMEN GRIMALDO","AV ACOMAYO 462 FRENTE AL BOTICA ROSA MARIA","F","NO","(en blanco)"]
[null,null,"B001667420",45804,"May","MARIA GEORGINA FLORES CORDERO","URB GUERTOS DE SAN JOSE C15 CL QUEBRANTA ENFRENTE CENTRO COMERCIAL MEGAPLAZA","F","NO","(en blanco)"]
[null,null,"B001667472",45804,"May","ELIZA GABRIELA RODRIGUEZ RIOS","URB SAN JOAQUIN 3 ETAPA O14 OLINDA MALDONADO","F","NO","(en blanco)"]
[null,null,"B001667576",45804,"May","GISELLA PILAR ORMENO MALLMA","AAHH JESUS DE NAZARETH MZ A LT 4 PLANTA DE GAS","F","NO","(en blanco)"]
[null,null,"B001667639",45804,"May","SANDY THALIA GARAVITO YAURICAS","AYACUCHO GALERIA ICA TOP PLAZA STAND 7 129 COSTADO DEL BANCO INTERBANK","F","NO","(en blanco)"]
[null,null,"B001667368",45804,"May","JOSSELYN YARITZA SEPULVEDAS VE","JR SAN MARTIN DE PORRAS 160 HOSPITAL SOCORRO","F","NO","(en blanco)"]
[null,null,"B001667466",45804,"May","LUZ MARIA MARTINEZ LACHY","AV MIGUEL GRAU124 POR EL PUENTE DEL RIO LA CHIRANA","F","NO","(en blanco)"]
[null,null,"B001667556",45804,"May","LUZ HAYDEE ARCOS DONAYRE","URB VILLAS DEL SOL 1ERA ETAPA MZ G LOTE 18","F","NO","(en blanco)"]
[null,null,"B001667770",45804,"May","MILAGROS MELCHORITA CARDENAS G","URB EL REMANSO DE LA FLORIDA A 10 SUBTANJALLA ICA POR ENTRADA DE MIAMI BEACH EL 1ER CONDOMINIO CERRADO","F","NO","(en blanco)"]
[null,null,"B001667485",45804,"May","MELANIE DANAE FLORES APARCANA","AV 410 ACOMAYO","F","NO","(en blanco)"]
[null,null,"B001667467",45804,"May","YARESSI SILVIA ROCA VILLANUEVA","URB EL HARAS 0 MZ X LT 14 PASANDO CASUARINAS EL HARAS","F","NO","(en blanco)"]
[null,null,"B001667563",45804,"May","SANDY KATHARINY ACEVEDO GUERRE","CJ HAB JOSE DE LA TORRE UGARTE A 20 AL COSTADO DE LOS FARDOS","F","NO","(en blanco)"]
[null,null,"B001667503",45804,"May","SILVANA VALERIA OLIVA QUINTANA","APV TEMISTOCLES ROCHA M8 PARROQUIA PUEBLO J SENOR DE LUREN","F","NO","(en blanco)"]
[null,null,"B001667599",45804,"May","RAQUEL SILVIA YALLICO FLORES","URB LAS CASUARINAS MZ A1 LT 07 ETAPA III","F","NO","(en blanco)"]
[null,null,"B001667655",45804,"May","ANYIE EDITH PRIETO HERRERA","STO DOMINGO DE MARCONA K36 URBANIZACION","F","NO","(en blanco)"]
[null,null,"B001667669",45804,"May","DIONISIA DINA SUMARI ALANYA","LA ALAMEDA DE HUACACHINA 7 MZ L ENTRAR POR DUNA MARKET","F","NO","(en blanco)"]
[null,null,"B001667553",45804,"May","LESLIE ROSEMARY PAREDES LAVAND","AV CUTERVO L19 SAN ISIDRO FRENTE A MAC GRILL FINANCIERA CURIA","F","NO","(en blanco)"]
[null,null,"B001667765",45804,"May","MERLY JAQUELINE PEREZ GONZALES","CL JACINTOS 149 SAN ISIDRO A ESPALDAS DE COL INGENIEROS","F","NO","(en blanco)"]
[null,null,"B001667453",45804,"May","GEANNINA KARIN HERNANDEZ BENDE","URB RAUL PORRAS BARRENECHEA MINISTERIO PUBLICO URBANO","F","NO","(en blanco)"]
[null,null,"B001667638",45804,"May","VIRGINIA ORMENO FERREYRA","URB LOS VIEDOS DE STA MARA I9 FRENTE AL CAR WASH LA CURBA","F","NO","(en blanco)"]
[null,null,"B001667750",45804,"May","MARTHA ADELMA REVATTA BAUTISTA","4TA ETAPA ANTIGUA KM 5 ICA URB LAS PALMERAS FRENTE A PARQUE","F","NO","(en blanco)"]
[null,null,"B001667446",45804,"May","CARMELA CORDOVA MENDOZA","BOTIJERIA ANGULO SUR MZ O LT 17 CASA 3 PISOS DE CERAMICA PASANDO LA CRUZ MANZANILLA","F","NO","(en blanco)"]
[null,null,"B001667950",45804,"May","LISA MARIA ADELINA MUNANTE TOR","1ERA ETAPA MZ B LT 40 DE ROJAS MARKET A LA DERECHA URB CASUARINAS","F","NO","(en blanco)"]
[null,null,"B001667635",45804,"May","LUZDELI CANTORAL MUZAURIETA","URBANIZACION VILLA SARAJA MZ C LOTE 2 REF ESPALDAS DEL PARQUE","F","NO","(en blanco)"]
[null,null,"B001667593",45804,"May","MARIA ISABEL MUNANTE TORRES","URB PUENTE BLANCO H9 PRIMERA ET PASANDO MEGAPLAZA ENTRA POR EL AUXILIAR DE PUENTE BLANCO POR EL PARQUE DOBLA","F","NO","(en blanco)"]
[null,null,"B001667384",45804,"May","ZAIDA KATERINNE GARCIA ROJAS","URB LAS CASUARINAS 6TA ETAPA MZ F LT 22 FRENTE AL PARQUE DEL CENTRO","F","NO","(en blanco)"]
[null,null,"B001667468",45804,"May","LUCERO BELEN ROMERO CORDOVA","JOSE SANTOS CHOCANO MZ W LT 10 SAN JOAQUIN","F","NO","(en blanco)"]
[null,null,"B001667358",45804,"May","ROSARIO MELCHORA MUNANTE TORRE","CASUARINAS MZ O LT 36 URB CASUARINAS 1ERA ETAPA","F","NO","(en blanco)"]
[null,null,"B001667728",45804,"May","ANA LIZ EZEQUILLA APAZA","AV AYABACA CON AV PRINCIPAL 1339 COMATRANA 15 CUADRAS PASANDO LA PLAZUELA DE COMATRANA","F","NO","(en blanco)"]
[null,null,"B001667642",45804,"May","MARILU ARCOS GUTIERREZ","BOTIJERIA ANGULO SUR H10 POR LA CRUZ PPJJ","F","NO","(en blanco)"]
[null,null,"B001667628",45804,"May","ANTONIETA INFANZON RAMIREZ","CASUARINAS 5 ETAPA E 25 PASANDO EL PRIMER PARQUE","F","NO","(en blanco)"]
[null,null,"B001667369",45804,"May","CLAUDIA VANESSA VALENCIA VILLA","URB CAUSARINAS J23 A MEDIA CDRA DEL RESERVORIO","F","NO","(en blanco)"]
[null,null,"B001667450",45804,"May","KAREN PAOLA PEREZ GUZMAN","BOTIJERIA ANGULO SUR B18 MANZANILLA","F","NO","(en blanco)"]
[null,null,"B001668100",45804,"May","MARINA FIDELIA COLINA URIBE","PASAJE LOS CALDERONES MZ 11 DETRAS DE HOTEL ROMA SANTA FE SAN JOAQUIN","F","NO","(en blanco)"]
[null,null,"B001667406",45804,"May","EDWIN JAVIER CABRERA REYNOSO","LOS POLLITOS MZ A LT 5 X ENTRADA DE CACHICHE DETRAS DE COLISEO LOS POLLITOS","F","NO","(en blanco)"]
[null,null,"B001667773",45804,"May","SHEYLLA ELIZABETH PALMA PINEDA","PALAZUELOS INT 20 200 LT 20 MEDIA CDRA PANADERIA OSIRIS PALAZUELOS","F","NO","(en blanco)"]
[null,null,"B001667558",45804,"May","FANNY DE LOURDES ROSAS","LOS PORTALES G 03 POR LA HUELGA","F","NO","(en blanco)"]
[null,null,"B001667461",45804,"May","ARLENY ESTELA MENDOZA ERAZO","SAN JOAQUN NUEVO 651 AVJOSE MARIA EGUREN 1 ERA ETAPA URBANIZACION","F","NO","(en blanco)"]
[null,null,"B001667858",45804,"May","TEODOLINDA CABRERA DE RAMIREZ","CASERIO SAN MARTIN V 17 FRENTE A COLEGIO MAXIMO DE LA CRUZ SOLORZANO","F","NO","(en blanco)"]
[null,null,"B001667569",45804,"May","BRIGGITH CHANG PENA","BOTIJERIA ANGULO SUR O 17 MANZANILLA","F","NO","(en blanco)"]
[null,null,"B001667577",45804,"May","JENNIFER ODALIS RAMIREZ ATOCZA","SAN RAFAEL LT 03 PUEBLO NUEVO","F","NO","(en blanco)"]
[null,null,"B001667345",45804,"May","LIDIA AURORA TORRES GUTIERREZ","PPJJ SENOR DE LUREN 3RA ETAPA F29 LACOMISARIA A MANO DERECHA ULTIMA CUADRA","F","NO","(en blanco)"]
[null,null,"B001667786",45804,"May","RUTH EYZAGUIRRE ALEGRIA","CALLE CLAVELES 240 URB LA MODERNA CASA ICA CALLE CLAVELES","F","NO","(en blanco)"]
[null,null,"B001667425",45804,"May","YESENIA KARINA QUINTANA CHUMBE","URB SAN MIGUEL CL PEDRO ORTIZ MZ E LT 14 POR EL LATERAL DERECHO DEL ESTADIO PICASO","F","NO","(en blanco)"]
[null,null,"B001667507",45804,"May","CINDY MAE ANDREA AJALCRINA ORM","CL LA HERRADURA 10 MZ 1 LT 10 PORUMA URB EL HARAS TERCERA ET I 10","F","NO","(en blanco)"]
[null,null,"B001667625",45804,"May","ESTEFANY CAROLINA CAMPOS MARRO","URB LA PALMA A34 COLEGIO TORIBIO POLO","F","NO","(en blanco)"]
[null,null,"B001667504",45804,"May","MAGDY ELIZABETH VASQUEZ PARDO","CALLE LA COLINA MZ AI LT 06 URB EL HARAS 3ETP INGRESAR POR PORUMA PASANDO AGRECON","F","NO","(en blanco)"]
[null,null,"B001667448",45804,"May","JULIANA NACIOCINA TORRES TAYPE","PARQUE INDUSTRIAL 264 COSTADO CORTE SUPREMA AV PARQUE INDUSTRIAL SAN JOAQUIN","F","NO","(en blanco)"]
[null,null,"B001667544",45804,"May","YALILE MARILU HERENCIA TORREAL","III ETAPA 24 MZ F CASA DE 2 PISOS PPJJ SENOR DE LUREN","F","NO","(en blanco)"]
[null,null,"B001667712",45804,"May","ANGELLA KATHERINE MASSA OROZCO","CALLE CAJAMARCA 314 COSTADO DE LIBRERIA CHICOMA CALLA CAJAMARCA","F","NO","(en blanco)"]
[null,null,"B001667759",45804,"May","ELSA FIDENCIA MENDOZA HUAMANI","URB LAS CASUARINAS III ET F43 POR EL RESERVORIO","F","NO","(en blanco)"]
[null,null,"B001667491",45804,"May","CECILIA AUGUSTA MALQUI CALVERA","CLL RAUL BOZA D5 URB SANTA ROSA DEL PALMAR","F","NO","(en blanco)"]
[null,null,"B001667787",45804,"May","SELENA DIAZ CACHIQUE","SAN MATEO MZ M LT 20 DETRAS DE MAKRO PARQUE STO DOMINGO DE GUZMAN 1ERA ETAPA","F","NO","(en blanco)"]
[null,null,"B001667495",45804,"May","EVELYN ROSMERY SALCEDO INFANCI","PPJJ SENOR DE LUREN A34 PRIMERA ETAPA FRENTE A POLLERIA","F","NO","(en blanco)"]
[null,null,"B001668164",45804,"May","TASHIRA MADELEY BENDEZU ZEA","AV LOS ANGELES 217 URB SAN JOAQUIN","F","NO","(en blanco)"]
[null,null,"B001667427",45804,"May","SHIRLEY ANDREA HUAMAN APOLAYA","AV VICTORIO GOTUZZO 979 ROCOTO","F","NO","(en blanco)"]
[null,null,"B001667665",45804,"May","GLADYS TERESA GIANELLO SANCHEZ","JULIO CEVASCO 226 POR PLAZUELA VIRGEN MARIA DE LAS NIEVES","F","NO","(en blanco)"]
[null,null,"B001667476",45804,"May","MELCY ROSELA DAVALOS HUAYTALLA","AV EL PAR 528 POSTERIOR DEL ESTADIO","F","NO","(en blanco)"]
[null,null,"B001667418",45804,"May","ROSA MARIA ESCALAYA RAMOS DE T","AV MANCO CAPAC 181 CAMINO A LOS MOLINOS","F","NO","(en blanco)"]
[null,null,"B001667566",45804,"May","ANA TINCO GARCIA","AMISTAD 334 MZ 11P LT A PORTON CELESTE LAS PERLAS","F","NO","(en blanco)"]
[null,null,"B001667708",45804,"May","SINTIA LISBET ROJAS GARCIA","AV HABANA 975 COL MICAELA A DOS CDRAS","F","NO","(en blanco)"]
[null,null,"B001667486",45804,"May","CINTHYA NEVENKA CAMACHO LIMACH","AV BERNA 160 LA TINGUINA DEL PODER JUDICIAL 5 CDRAS","F","NO","(en blanco)"]
[null,null,"B001667561",45804,"May","FABIOLA MARICEL BARAHONA CAMAN","AV ROMA 148 PODER JUDICIAL TRES CUADRA ASI ARRIBA","F","NO","(en blanco)"]
[null,null,"B001667516",45804,"May","FANNY PAMELA LAINEZ LLUEN","CL 11 DE SETIEMBRE 452 LOZA DEPORTIVA EL ABANQUINO","F","NO","(en blanco)"]
[null,null,"B001667366",45804,"May","CAMILA EDITA URBANO RAMOS","VIENA 776 ALTURA DE LA 5TA CUADRA CASA DE 2 PISOS TINGUINA ALTA","F","NO","(en blanco)"]
[null,null,"B001667352",45804,"May","CARMEN ROSA BORDA MARTINEZ","AV DANIEL OLAECHEA 356 LA FISCALIA CETRO VIGEN MAYOR","F","NO","(en blanco)"]
[null,null,"B001667397",45804,"May","MARIBEL LIZBETH CARBAJAL ALALU","AV LONDRES 307 UNA CUADRA ANTES DE LA LA PLAZUELA JOSE AVENIDA","F","NO","(en blanco)"]
[null,null,"B001667620",45804,"May","IZABEL BEATRIZ PRADO GOMEZ","AV LONDRES 226 REF UNA CUADRA ANTES DEL SEGURO LONDRES C","F","NO","(en blanco)"]
[null,null,"B001667533",45804,"May","LADY DEL ROSARIO HUAYANCA PERE","VILLA CLUB F 48 ANTES DE LLEGAR AL CRUCE DE LA TINGUINA","F","NO","(en blanco)"]
[null,null,"B001667451",45804,"May","ISABEL KAROLINA MENESES ANTAYA","LAS CASAS NUEVAS 2DA ETAPA AI30 URB SAN IDELFONSO","F","NO","(en blanco)"]
[null,null,"B001667574",45804,"May","JUDY ROSA NINO DE GUZMAN SANCH","AV ARMANDO REVOREDO 599 ENTRE PARCONA Y TINGUINA","F","NO","(en blanco)"]
[null,null,"B001667379",45804,"May","GIANELLA ANGELITA YATACO MEJIA","AV VIENA 776 ESPALDA DEL COLEGIO MERINO RUIZ AV VIENA TINGUINA ALTA","F","NO","(en blanco)"]
[null,null,"B001668197",45804,"May","JJASMI YOSI MENDEZ BARRIENTOS","JULIO CEVASCO 226 POR LA PLAZUELA JULIO CEVASCO","F","NO","(en blanco)"]
[null,null,"B001667575",45804,"May","EUSEBIA ANGELICA SALLHUE MENDO","AV JUVENAL URIBE 298 REF RECTA COLISEO DE GALLOS","F","NO","(en blanco)"]
[null,null,"B001667531",45804,"May","SILVIA MARIELA MITACC HUARCAYA","ASOCIACION 28 CON SAN MARTIN FABRICA DE POSTES","F","NO","(en blanco)"]
[null,null,"B001667612",45804,"May","PAULO CESAR TREJO ORMENO","LLAXTA LOS AQUIJES MZ K1 LT 4 PASANDO YAURILLA LAS PIEDRAS DE BUENA VISTA LLAXTA","F","NO","(en blanco)"]
[null,null,"B001667586",45804,"May","KATHERINE NOEMI SALAZAR CHACAL","CACERIO GARGANTO K1O B COSTADO REST MENDOZA","F","NO","(en blanco)"]
[null,null,"B001667428",45804,"May","LISSETHE MILAGROS VENTURA CHAC","ALFONZO UGARTE EL ARENAL I 4 ESPALDA DE LA POLLERIA MELCHORITA","F","NO","(en blanco)"]
[null,null,"B001667601",45804,"May","LENY ARACELLI HERNANDEZ CHACAL","CASERIO GARGANTO MZ A K LT 6 11 RESTAURANTE MENDOZA","F","NO","(en blanco)"]
[null,null,"B001667360",45804,"May","LOURDES HERNANDEZ BOHORQUEZ","LOS AQUIJES MZ R LT 2A TIENDA DE NAIDU LOS AQUIJES","F","NO","(en blanco)"]
[null,null,"B001667438",45804,"May","LUZ ROXANA HUARCAYA SAYRITUPAC","LOS AQUIJES MZ K LT 11B A UNA CUADRA DEL MERCADO LOS AQUIJES","F","NO","(en blanco)"]
[null,null,"B001667701",45804,"May","SUSY MARIA DE LA CRUZ APARCANA","MZ G LT 5 TALLAMANA COSTADO IGLESIA CENTRO POBLADO","F","NO","(en blanco)"]
[null,null,"B001667571",45804,"May","LUISA MARANON PARDO","CASUARINAS 30 MZ C LT 30 CASUARINAS","F","NO","(en blanco)"]
[null,null,"B001667707",45804,"May","MATIAS ENRIQUE CALDERON CARMON","AV PACHACUTEC Y61 PRIMERA CUADRA 3 CASAS DEL REST HUERTA","F","NO","(en blanco)"]
[null,null,"B001667411",45804,"May","JESSICA LIZBET JIMENEZ MORALES","AV MIGUEL GRAU 199 ENT 18 FREBRERO PORL GRAU","F","NO","(en blanco)"]
[null,null,"B001667481",45804,"May","GRACCE LISSETE ENCIZO MENDOZA","CALLE MANUEL CARBAJAL 177 177 POR LA ENTRADA DE LA LLANTERIA SAN IDELFONSO","F","NO","(en blanco)"]
[null,null,"B001667720",45804,"May","CINTHIA YANINA CALDERON MERCAD","ANDRES AVELINO CACERES 308 MZ Q5 LT 32 ANTES DE LA LOZA DE LA ZONA SUR CENTRO POBLADO","F","NO","(en blanco)"]
[null,null,"B001667794",45804,"May","LALY DANEY GARAY DAVALOS","AV LA ANGOSTURA # 400 HOTEL LAS DUNAS PUERTA 2","F","NO","(en blanco)"]
[null,null,"B001667629",45804,"May","MARIA ISABEL PALACIOS APARICIO","SANTA ROSA DE II ETAPA L8 PARCONA PARCONA","F","NO","(en blanco)"]
[null,null,"B001667404",45804,"May","OLINDA EDITH BENDEZU BENDEZU","CLL AURORA FERNANDEZ NUM 290 FRENTE CLUB ESTRELLA ROJA","F","NO","(en blanco)"]
[null,null,"B001667698",45804,"May","CLARET IRIS URBANO LARA","CL ROSUEL CASTRO MZ K LT 7 RESPALDO DE LA ENCI","F","NO","(en blanco)"]
[null,null,"B001667479",45804,"May","GLADYS ALICIA LEON MITACC","RAMN CASTILLA 218 ALFN MERCADO","F","NO","(en blanco)"]
[null,null,"B001667699",45804,"May","CYNTHIA NATALI MISAJEL MARQUIN","CESAR VALLEJO 103 A DOS CASAS DE BODEGA CINTHYA PARCONA","F","NO","(en blanco)"]
[null,null,"B001668189",45804,"May","AHSLLIE DALLAM INFANTE TORREAL","1RA ETAPA MZ C1 LT 38 DOBLE VIA PRINCIPAL LA ALAMEDA","F","NO","(en blanco)"]
[null,null,"B001667439",45804,"May","MARIA ESMERALDA GUILLEN PALOMI","RICARDO PALMA 251 PASANDO IGLESIA DE LOS MORMONES RICARDO PALMA PARCONA","F","NO","(en blanco)"]
[null,null,"B001667624",45804,"May","ERICKA MERLY HUAMAN SIMON","ASC SANTA ROSA DE LIMA 1ET MZL L8 A UNA CUADRA DEL MERCADO DELOS HERMANOS","F","NO","(en blanco)"]
[null,null,"B001667772",45804,"May","ELIZABETH FARFAN SIMON","ACS SANTA ROSA L8 MZL LT CENTRO DE SALUD","F","NO","(en blanco)"]
[null,null,"B001667348",45804,"May","KAREN CUSQUISIBAN GARCIA","SANTA BARBARA B 4 POR SAN CAMILO PARCONA","F","NO","(en blanco)"]
[null,null,"B001667432",45804,"May","DAYANNE SANDYVETH RAMIREZ FARF","ASC SANTA ROSA DE LIMA 1ET MZP LT 16 A DOS ESPALDAS DE LA POSTA","F","NO","(en blanco)"]
[null,null,"B001667520",45804,"May","ISABEL LUISA TITO HUAMANI","JUAN PABLO FERNANDINI 371 A 3 CUADRAS DE IGLESIA DE PARCONA JUAN PABLO FERNANDINI","F","NO","(en blanco)"]
[null,null,"B001667579",45804,"May","CONSUELO AMPARO REYES DEFLORES","SANTA ROSA DE LIMA B 12 1 ET POLLERIA RAMIREZ DERECHA","F","NO","(en blanco)"]
[null,null,"B001667424",45804,"May","NEY ALARCON MEZA","JOSE GALVEZ 819 PUERTA PRINCIPAL DE ESTADIO HUGO SOTIL JOSE GALVEZ","F","NO","(en blanco)"]
[null,null,"B001667652",45804,"May","LIZ EVELYN SUAREZ VILLAGOMEZ","CL LIMA 224 CDRA DESPUES DE LA COMISARIA DE PARCONA","F","NO","(en blanco)"]
[null,null,"B001667447",45804,"May","DINA ROSARIO ORE GUILLEN","ALAMEDA DE PARCONA MZ B6 LT 59 FRENTE AL PARQUE ALAMEDA DE PARCONA SEGUNDA ETAPA","F","NO","(en blanco)"]
[null,null,"B001667763",45804,"May","KAREN GERALDINE ARCOS CAYO","COOP SANTA ROSA K1 URB ALAMEDA CENTRO POBLADO","F","NO","(en blanco)"]
[null,null,"B001667482",45804,"May","BREYDY LESLIE MACHACA GONZALES","AV7 MZ A LT 5 PASANDO GRIFO PHANY PSJE EL JUNCAL AV7 PARCONA","F","NO","(en blanco)"]
[null,null,"B001667359",45804,"May","SAYUMI HEIDY HUAMANI TELLEZ","AV TUPAC AMARU 501 CON RAUL PORRAS BARRENECHEA 501 MZ 04 LT 18 ESPALDA DE LA MUNICIPALIDAD DE PARCONA","F","NO","(en blanco)"]
[null,null,"B001667361",45804,"May","JENNY LEDIA GRADOS AVALOS","FRENTE A BODEGA FLICKS MZ R LT 19 POR LA POSTA MEDICA ACOMAYO","F","NO","(en blanco)"]
[null,null,"B001667532",45804,"May","JASMIN ESTEFANI MEZA MISAICO","CLL ANDRES AVELINO CACERES MZ N PUERTA 06","F","NO","(en blanco)"]
[null,null,"B001667562",45804,"May","SOLEDAD ELENA CANTORAL QUISPE","JIRON MARIA OLIVEROS 157 REF CUADRA 8 DE AV 18 DE FEBRERO A LA DERECHA","F","NO","(en blanco)"]
[null,null,"B001667343",45804,"May","SUSANA CRISTINA ESCATE FORONDA","POR COL NACIONAL DE MUJERES 695 FRENTE A COLEGIO 22319 CALLE 18 DE FEBRERO","F","NO","(en blanco)"]
[null,null,"B001667617",45804,"May","RAIZA DAMARIS RAMOS ARONI","AV MARIANA MELGAR 330 ASOC SANTA ROSA DE LIMA ETAPA 1","F","NO","(en blanco)"]
[null,null,"B001667618",45804,"May","LUIS RIVALDO PALOMINO CABRERA","CALLE SAN JORGE MZ B13 FRENTE COLEGIO SAN JORGE AV 7 MI NUEVO PERU B13","F","NO","(en blanco)"]
[null,null,"B001667745",45804,"May","MARIVID DELOSANGELES GUEVARA V","PARCONA ESTADIO A LA IZQUIERDA 2 CDRS","F","NO","(en blanco)"]
[null,null,"B001667797",45804,"May","YURIKO YULIANA SUICA QUISPE","PASAJE ORONGO MZ C LT 10 PASANDO HOTEL WANDA A LA DERECHA URB MARIA ELENA","F","NO","(en blanco)"]
[null,null,"B001667649",45804,"May","ROSS MARILEY REYES MENDOZA","C P YAJASI MZA C LT 9B PREGUNTAR POR CASA DE MALEY","F","NO","(en blanco)"]
[null,null,"B001668094",45804,"May","JUANA MARIA MORAN MORMORES","CASERIO DE YAJASI PASANDO CAPILLA CASERIO DE YAJASI","F","NO","(en blanco)"]
[null,null,"B001667754",45804,"May","ANA NOA OBREGON","URB NUEVA ESPERANZA 1RA FAMILIA MZ J LT 16 FARMACIA FARMA SANA","F","NO","(en blanco)"]
[null,null,"B001667645",45804,"May","GISELLA YANINA RAMOS QUISPE","NUEVA MACACONA MZ A LT 34 POR EL COLEGIO DE EDUCACION PRIMARIA CENTRO POBLADO CERRO PRIETO","F","NO","(en blanco)"]
[null,null,"B001668091",45804,"May","MARIA ELENA RAMOS HUARCAYA","AV CATALINA BUENDIA DE PECHO 47 ICA ICA","F","NO","(en blanco)"]
[null,null,"B001667771",45804,"May","MARIA DELOSANGELES PERALTA DIA","AV CATALINA BUENDIA DE PECHO MZQ LT 8 POSTA SALUD MANZANA G13","F","NO","(en blanco)"]
[null,null,"B001667500",45804,"May","MARIBEL ROSA CABRERA FRANCO","CL EL PROGRESO 358 MZ F LT 04 FRENTE AL COLEGIO EL OLIVO","F","NO","(en blanco)"]
[null,null,"B001667471",45804,"May","YULISSA ELIZABETH CUEVA CABRER","CASERIO LA ALTURA SN 3 PUERTAS DELCENTRO DE SALUD EL CARMEN","F","NO","(en blanco)"]
[null,null,"B001667415",45804,"May","JARUKO GABRIEL TATAJE SIGUAS","2 CALLE DND ESTA IGLESIA A MANO DERECHA CASERIO EL OLIVO CALLE BUENOS AIRES C7B","F","NO","(en blanco)"]
[null,null,"B001667336",45804,"May","MARIA MARGOTH CASTRO HUAROTO","FRANCISCO BOLOGNESI MZ I LT 6 PASANDO LOS PATOS PORTON DE MADERA FONAVI SAN MARTIN","F","NO","(en blanco)"]
[null,null,"B001668102",45804,"May","RAQUEL SOLEDAD SAYRITUPAC VILC","FONAVI SAN MARTIN MZ Z LT 1 FONAVI SAN MARTIN 4TA ETAPA","F","NO","(en blanco)"]
[null,null,"B001668096",45804,"May","STEPHANNY PIERINA HERRERA SANC","CALLE SANTA MARIA S11B PASANDO LA MUNICIPAL ANTES DEL TERCER SEMAFORO UBICADA EN LA CRUZ VERDE","F","NO","(en blanco)"]
[null,null,"B001667746",45804,"May","JUANA STEFANY VALENCIA FERNAND","SEC CENTRO SN 1RA ENTRADA DE LA PLAZA DE SANTIAGO","F","NO","(en blanco)"]
[null,null,"B001667634",45804,"May","LETICIA ROSA HUACHIN CORONADO","CALLE LOS JAYOS MZ K LT 23 FRENTE A COLEGIO SAN MARTIN SECTOR CASABLANCA","F","NO","(en blanco)"]
[null,null,"B001667597",45804,"May","YHOSELIN MARICIELO CORDERO HER","CENTRO POBLADO LOS MAYURIES MZ C LT 20A CERCA POLIDEPORTIVO EUGENIO","F","NO","(en blanco)"]
[null,null,"B001667422",45804,"May","VIVIANA ROSA DEL CARMEN PENA","URB ECHEGARAY 2 ESPALDA DEL ESTADIO ENTRADA COYOTES SN SANTIAGO","F","NO","(en blanco)"]
[null,null,"B001667395",45804,"May","PAULA SABINA TASAICO DE CANEDO","RANCHERIA STA MARGARITA C112 FRENTE A MINIMARKET MAX","F","NO","(en blanco)"]
[null,null,"B001667675",45804,"May","YANINA MARGARITA RAMOS UCHUYA","LA VENTA BAJA MZ C LT 43 PASANDO LA CAPILLA","F","NO","(en blanco)"]
[null,null,"B001667662",45804,"May","VIELKA KATIUSKA VELASQUEZ DIAZ","RESIDENCIAL EL HUERTO MZ H LT 6 COSTADO CONSORCIO SOLIS RESIDENCIAL EL HUERTO SANTIAGO","F","NO","(en blanco)"]
[null,null,"B001667344",45804,"May","ELADIA PAUCAR APARICIO","LA VENTA BAJA MZ C LT 43 ENTRANDO CALLEJON EN LA PANAMERICA LA VENTA BAJA","F","NO","(en blanco)"]
[null,null,"B001667749",45804,"May","DIANA ELIZABETH MUNANTE AQUIJE","BARRIO LOS ASENCIOS MZ D LT A1 ESPALDA DE LA COMISARIA DE SANTIAGO PANAMERICANA SUR KM 317","F","NO","(en blanco)"]
[null,null,"B001667673",45804,"May","JAQUELINA ESTEFANY CHAVEZ AURE","FONAVI SAN MARTIN X12 SEGUNDA ETAPA DEL SEMAFORO A LA IZQUIERDA FONAVI SAN MARTIN","F","NO","(en blanco)"]
[null,null,"B001667603",45804,"May","GRACE ANTONELLA AVILA CHUNGA","LOS HUERTOS DE SAN ANTONIO MZ 29 LT ALT COLG SAN ANTONIO","F","NO","(en blanco)"]
[null,null,"B001667583",45804,"May","VANIA QUEVEDO RIVAS","UR LAS LUNAS LA FLORIDA MZ A 26 CERCA RESTAURANTE DON MANUEL","F","NO","(en blanco)"]
[null,null,"B001667742",45804,"May","OLYN KLATETZKI ORMENO VARGAS","VIRGEN DE CHAPI MZ G LT 4 DEL TREN ROJO ALA DERECHA","F","NO","(en blanco)"]
[null,null,"B001668167",45804,"May","CARMEN MAGDALENA INJANTE ORE","ASOCIACION PRO VIVINEDA TEMISTOCLES ROCHA MZ D LT 6A FRENTE ALA PLAZUELA LINK ASOCIACION PRO VIVINEDA","F","NO","(en blanco)"]
[null,null,"B001667578",45804,"May","MONICA MAGDALENA MARCIAL MOQUI","TACNA MZ J2 T8E PASANDO LA POSTA 3 CUADRA","F","NO","(en blanco)"]
[null,null,"B001668092",45804,"May","MERCEDES YOLANDA RAMOS RIOS","UBB LA ANGOSTURA 2 ETAPA N 31 FONAVI SAN MARTIN 2 ETAPA N31","F","NO","(en blanco)"]
[null,null,"B001667738",45804,"May","JANET GIOVANNA PILLCO CURI","LOS OLIVOS MZ I PRIMA 18 I ET HABITACIONAL LA ANGOSTURA","F","NO","(en blanco)"]
[null,null,"B001667452",45804,"May","MARIA ELENA HUAYANCA PINEDA","COLINAS DE LA ANGOSTURA A 5 ESPALDA DE PROGRAMA MUNICIPAL","F","NO","(en blanco)"]
[null,null,"B001667456",45804,"May","JACQUELINE MARILU LOVERA GALVE","CL BOLOGNESI 125 A ESPALDAS DEL COLEGIO DE PRIMARIA","F","NO","(en blanco)"]
[null,null,"B001668347",45804,"May","JULEIDY MELISSA ESCOVAR PUMAYA","1 ET C 39 CONJU HABITACIONAL LA ANGOSTURA JARDIN DE NINOS 148","F","NO","(en blanco)"]
[null,null,"B001667752",45804,"May","TESSY LIZETH CORDOVA GUERRERO","LA CAPILLA MZ P LT 1 MUNICIPALIDAD","F","NO","(en blanco)"]
[null,null,"B001667386",45804,"May","ANGIE CAROLINA HUAMAN MARCOS","ROSARIO DE YAUCA E4CONJUNTO HABITAC CONJUNTO HABITACIONAL","F","NO","(en blanco)"]
[null,null,"B001667394",45804,"May","ROSA MARIA HERNANDEZ ANICAMA","MZG LT 34 C CENTRO POBLADO CAMINO GRANDE AL FRENTE DE LA FAMILA LOYOLA","F","NO","(en blanco)"]
[null,null,"B001667474",45804,"May","CLAUDIA BERNARDINA NIETO ARONE","CENTRO POBLADO SAN JOSE 2 ENTRADA POR LA RECTA DEL COMEDOR 2 ENTRADA","F","NO","(en blanco)"]
[null,null,"B001667493",45804,"May","BRENDA REBECA RUIZ VASQUEZ","CATEGORIA C MZ33 LOTE 52 PASAJE MI SENORA DE GUADALUPE","F","NO","(en blanco)"]
[null,null,"B001667538",45804,"May","KARIN AMELIA AURIS VILLALON DE","B 17 17 MZ B ESPALDA DEL COLEGIO SIMON RODRIGUEZ UNION VICTORIA","F","NO","(en blanco)"]
[null,null,"B001667664",45804,"May","JUANA NINFA CONDORI MOLINA","C FERMN DEL CASTILLO AL FRENTE RENIEC CTR PBD","F","NO","(en blanco)"]
[null,null,"B001667674",45804,"May","ROSA MARISOL CALLA QUISPE","CL CHICLAYO CASA 25 M8 SIN BARRIO CARCADO VISTA ALEGRE LA MISMA SUBIDA DE NUEVA UNION","F","NO","(en blanco)"]
[null,null,"B001667755",45804,"May","CARMEN IRENE BOHORQUEZ RAMOS","CL JUAN MATTA 510 510 A MEDIA CUADRA DE LA CLINICA JUAN PABLO","F","NO","(en blanco)"]
[null,null,"B001667725",45804,"May","MARIA TERESA ZAMBRANO QUISPE","CALLE JUAN MATTA 510 FRENTE GIMNASIO OLIMPO CERCADO NASCA","F","NO","(en blanco)"]
[null,null,"B001667654",45804,"May","CAROLINA MARISELA GARCIA TUERO","CL JOSE MARIA MEJIA SN COSTADO DEL INABIF CENTRO","F","NO","(en blanco)"]
[null,null,"B001667464",45804,"May","AGAVITA VIRGINIA QUISPE POMASO","ENTRANDO A LA IZQUIERDA MZ C LT 11 A 3 CDRAS DE IGLESIA EVANGELICA PAJONAL BAJO MICAELA BASTIDAS","F","NO","(en blanco)"]
[null,null,"B001667408",45804,"May","REILI MARITA CHAYA CHUMBILE","ALFONZO UGARTE MZE LT 8 POR EL FRANCO PERUANO RIO 5 CASAS","F","NO","(en blanco)"]
[null,null,"B001667371",45804,"May","CINDY ADABEL ACHATA ZEGARRA","CL JOS MARIA MEJA SN AL COSTADO DEL INABIF","F","NO","(en blanco)"]
[null,null,"B001667743",45804,"May","DYANDRA STEPHANIE SHIRLEY GAVA","JUAN MATTA 510 POR ELJARDIJ SANTA RITA DE CASIA JUAN MATTA","F","NO","(en blanco)"]
[null,null,"B001667740",45804,"May","LUCY AMPARO ESPINOZA NACIMIENT","CL PALPA 570 LA COMISARIA UNA CDRA HACIA ARRIBA","F","NO","(en blanco)"]
[null,null,"B001667401",45804,"May","ROSA MARIA TORRES PISCONTI","CL TALPA 562 COMISARIA VISTA ALEGRE","F","NO","(en blanco)"]
[null,null,"B001667757",45804,"May","VERONICA CALLA QUISPE","CHICLAYO CASA M8 25 MZ M8 POR LA SUBIDA DEL MERCADO VISTA ALEGRE VISTA ALEGRE","F","NO","(en blanco)"]
[null,null,"B001667367",45804,"May","RUTH MARLENI QUISPE VELASQUEZ","CALLE ENRRIQUE PAREDES MZ Z LT 32B LA TERCERA ENTRADA VINIENDO DE ICA","F","NO","(en blanco)"]
[null,null,"B001667537",45804,"May","MARTHA MARIA SALINAS VALENTIN","CONDE MONCLOVA 271 BODEGA 3 MELLIZOS","F","NO","(en blanco)"]
[null,null,"B001667737",45804,"May","CINTHIA ISABEL TAPIA CORDOVA","CLL JORGE CHAVEZ # 202 PASANDO CLUB JORGE CHAVEZ","F","NO","(en blanco)"]
[null,null,"B001667650",45804,"May","PAOLA CARMEN GUERRA LUYO","AV BOLOGNESI 1203 PISCO PLAYA REF ALT COLEGIO BOTONES ROJOS","F","NO","(en blanco)"]
[null,null,"B001667677",45804,"May","KARINA MILAGROS FALCON JORGES","CL DOS DE MAYO 382 CENTRO DE PISCO REF FRENTE A LA CASETA DE SERENAZG","F","NO","(en blanco)"]
[null,null,"B001667351",45804,"May","NAEKO NOGAMI CAMPOS","AV SAN MARTN 501 1 CDR ANTES OVALO SAN MARTIN","F","NO","(en blanco)"]
[null,null,"B001667584",45804,"May","LILIA JANNET SALAZAR VASQUEZ","CL GENARO MEDRANO SN LT 2 MZA VILLA LA FAP PASANDO LOS JARDINES","F","NO","(en blanco)"]
[null,null,"B001667651",45804,"May","KARINA ARACELI MAYURI GAMBOA","MARTHA REYES 158 REF PISCO PUEBLO","F","NO","(en blanco)"]
[null,null,"B001667342",45804,"May","ANA CLAUDIA DONAYRE MARTINEZ","CL MARQUEZ DE MANCERA 356 PISCO COLEGIO SIMON BOLIVAR","F","NO","(en blanco)"]
[null,null,"B001667724",45804,"May","CARMEN ROSARIO AYALA IVALA","URB SAN ALBERTO MZR LT 7 PAR ZONAL PISCO","F","NO","(en blanco)"]
[null,null,"B001667678",45804,"May","CARMEN LUISA AMADO FLORES DE C","CLL CALLAO 222 2PS PLZ DE ARMAS HOTEL CANDELABRO","F","NO","(en blanco)"]
[null,null,"B001667959",45804,"May","TERESA TOVAR DEPINEDO","CL MARTHA REYES 206 ESP DEL BOSQUE CENTRO DE PISXI","F","NO","(en blanco)"]
[null,null,"B001668293",45804,"May","MARIA ELENA TORRES CARRIZALES","MZ 44 LT 803 A ESPALDAS DE FABRICA SACOSPISCO URB RENACER","F","NO","(en blanco)"]
[null,null,"B001667756",45804,"May","CARLA VANESSA CALDERON CANELO","CL GUILLERMO QUINONEZ 451 AV AMERICAS ANTES COL SAN MARTIN","F","NO","(en blanco)"]
[null,null,"B001667661",45804,"May","GLORIA EMILY UCHUYA MARTINEZ","PROLONGACION INDEPENDENCIA 910 LA ESPERANZA POR LAS CAMARAS DE SEGURIDAD","F","NO","(en blanco)"]
[null,null,"B001667470",45804,"May","CESAR JESUS ANDRADE VARGAS","CALLE SAN JOSE 159 POR LA CEVICHERIA EL RINCON PERUCHO CALLE SAN JOSE","F","NO","(en blanco)"]
[null,null,"B001667573",45804,"May","CLAUDIA RAQUEL MONTANEZ CANCIN","CL PROGRESO 325 HOSTAL LOS FLAMENCOSREF 2 CUADRAS PLAZA DE ARMAS 2 CUADRAS PLAZA DE ARMAS","F","NO","(en blanco)"]
[null,null,"B001667758",45804,"May","JENNY EDITH ARIAS NEYRA","URB TERRA BLANCA I 17 ULTIMA CUADRA AV JHON F KENNEDY","F","NO","(en blanco)"]
[null,null,"B001667459",45804,"May","CLAUDIA PAOLA SIGUAS BERNAOLA","ASOC SAN PEDRO MZ E LT 25 REF POR LA LOSA","F","NO","(en blanco)"]
[null,null,"B001667596",45804,"May","DHESLY CAROLINA CASTILLO","COMERCIO 820 POR TIENDA PRECIO UNO","F","NO","(en blanco)"]
[null,null,"B001667514",45804,"May","ROSA MIRANDA LOPEZ","AAHH MEDRANO MZ B LT 17 ESPALDAS INSTITUTO TECNOLOGICO","F","NO","(en blanco)"]
[null,null,"B001667710",45804,"May","NELLY ESTHER ARROYO PIZARRO","AV BOLOGNESI 492 RECTA DEL COL SANTA LUISA DE MARILLA","F","NO","(en blanco)"]
[null,null,"B001667726",45804,"May","JUANA ELVIRA DE LA CRUZ GARCIA","CL PEDEMONTE 825 INTC MEDIA CDRA AUTOP LAS AMERICAS","F","NO","(en blanco)"]
[null,null,"B001667735",45804,"May","ANA YSABEL NOA CARTAGENA","CONDE MONCLOVA 271 POR LA TIENDA LOS 3 MELLIZOS CONDE MONCLOVA","F","NO","(en blanco)"]
[null,null,"B001667341",45804,"May","FLAVIA FERNANDA TIJERO HERRERA","URB BEATITA DE HUMAY 656 A 1 CDRA DE GRUTA VIRGEN DE CHAPI","F","NO","(en blanco)"]
[null,null,"B001667739",45804,"May","KARINA GISELLA GUERRERO ESCATE","ASOC SAN PEDRO MZ O LT 6 FRENTE ALA LOZA DEPORTIVA","F","NO","(en blanco)"]
[null,null,"B001667552",45804,"May","IVANA MARILYN PENA CAVERO","MZ CC LT 02JARDINES DE SAN ANDRS DE LA ENTRADA PRINCIPAL","F","NO","(en blanco)"]
[null,null,"B001668331",45804,"May","LUISA YOLANDA CAJO FELIPA","MARQUEZ DE MANSERA 399 COL SIMON BOLIVAR","F","NO","(en blanco)"]
[null,null,"B001667445",45804,"May","ANGELICA RICARDINA CARDENAS VI","GENARO MEDRANO SN 10 MZ B FRENTE AL ARCO DE INGRESO DE SAN ANDRES VILLA FAP SAN ANDRES","F","NO","(en blanco)"]
[null,null,"B001667570",45804,"May","CAROL MELISSA ZARATE ENCISO","CL SAN CLEMENTE 114 LOZA LOS BAMBINOS","F","NO","(en blanco)"]
[null,null,"B001667592",45804,"May","ELIZABETH ALEJANDRA ALVINO FER","AV LOS LIBERTADORES 449 CL LIMA","F","NO","(en blanco)"]
[null,null,"B001667526",45804,"May","VANESSA ELENA MATTA ESPINO","LU JIRETH # A1 08 A LA ESPALDA DE LA FACULTAD DE PESQUERIA O FRENTE DEL PARQUE DEL NINO","F","NO","(en blanco)"]
[null,null,"B001667568",45804,"May","PATRICIA PILAR GUEVARA HUARIPU","JIRETH MZ G LT 2 POR DONDE ESTAN LOS CAMIONES JIRETH LA VILLA TUPAC AMARU","F","NO","(en blanco)"]
[null,null,"B001667469",45804,"May","MARIA ANGELICA ORTIZ VICENTE","JOSE OLAYA MZ Q1 LT 7 MEDIA CDRA ANTES DE COLEGIO VIRGEN AV JOSE OLAYA","F","NO","(en blanco)"]
[null,null,"B001667641",45804,"May","KATHERINE ORTIZ VICENTE","AV 28 DE JULIO MZ N LT 4 COMEDOR DE CAPILLA DE ASIA","F","NO","(en blanco)"]
[null,null,"B001668157",45804,"May","LUCY MARISOL BAYLON SILVA","9 OCT PUEBLO MZ O LT 59 CARPINTERIA PONCE COSTADO UNA MECANICA","F","NO","(en blanco)"]
[null,null,"B001667733",45804,"May","RUT LLERENA TIBURCIO DE ABURTO","ANEXO LAS PALMAS BAJAS MZ F LT 7 1 CDRA DE LA ACADEMIA JHONY BELLO","F","NO","(en blanco)"]
[null,null,"B001668173",45804,"May","ESTHER LUZ ARIAS MUNOZ","MZL LT 7 AAHH ROSARIO DE ASIA CLUB ALMIRADOR ANT PANM SUR","F","NO","(en blanco)"]
[null,null,"B001667653",45804,"May","THRIANA AYLEE CORDOVA VIDAL","CL SAENZ PENA SN 28 DE JULIO COSTADO BODEGA PEPO","F","NO","(en blanco)"]
[null,null,"B001667346",45804,"May","SONIA MARIBEL ZAVALA MEDINA","MALECON JOSE OLAYA MZ SN RESTAURANTE MAR AZUL MALECON JOSE OLAYA","F","NO","(en blanco)"]
[null,null,"B001667455",45804,"May","JESSICA MARGARITA HUAPAYA CHAV","JR SALAVERRY MZ 111 LT 13 CERCA AL COLEGIO PRIMARIA 20135","F","NO","(en blanco)"]
[null,null,"B001667775",45804,"May","PATRICIA CARMEN LOPEZ PAZOS","VILLA JARDIN MZ V LT 6 COST PANADERIA NAVARRETE","F","NO","(en blanco)"]
[null,null,"B001667442",45804,"May","ELENA ESTHER GARCIA QUISPE","MZ A LT 10 AAHH VALLE HERMOSO SAN VICENTE","F","NO","(en blanco)"]
[null,null,"B001667505",45804,"May","BRITGHET DAYANARA ACOSTA CHANC","AAHH ASUNCION 8 LT 13 PQ ASUNCION","F","NO","(en blanco)"]
[null,null,"B001667582",45804,"May","ANTONIA CANDELA ALCALA","AAHH JOSEFINA RAMOS MZD1 LT 7 A 3 CDRAS PASANDO LA POSTA","F","NO","(en blanco)"]
[null,null,"B001667731",45804,"May","YAZMIN LISSETH AQUINO SANCHEZ","CL 28 DE JULIO 549 SUPERMERCADOS MAS CENTRO POBLADO IMPERIAL","F","NO","(en blanco)"]
[null,null,"B001667702",45804,"May","ERIKA LIZETH HERRERAS POLO","JRMANCO CAPAC 750 CAMAL DE LAS AVES","F","NO","(en blanco)"]
[null,null,"B001667441",45804,"May","MAYRA VANESSA CHAVEZ PARDO","URB LOS CIPRESES MZ D LT 11 URB LOS CIPRESES","F","NO","(en blanco)"]
[null,null,"B001667430",45804,"May","KARINA NAVARRO ZAMORA","LOS HRTOS DE CANETE MZ J LT 14 3 ET COLG CNI ENTRADA","F","NO","(en blanco)"]
[null,null,"B001667704",45804,"May","ROSARIO RAVELLO APARICIO","JR HUANCAYO 369 MZ P1 LT 26 CRUCE 28 JULIO CENTRO POBLADO IMPERIAL","F","NO","(en blanco)"]
[null,null,"B001667616",45804,"May","DORA LEONOR LUQUE FAJARDO","ANX CANTAGALLO 6 NOSIGLIA TANQ ELEVAD AGU IZQ CASA VERDE","F","NO","(en blanco)"]
[null,null,"B001667741",45804,"May","ROSA EMILIA SANCHEZ LUYO","JR SEVERO HUAPAYA MZ L LT 10 ALTURA COLEGIO DE LA GUARDIA CIVIL RAMOS LARREA","F","NO","(en blanco)"]
[null,null,"B001667723",45804,"May","BRENDA JERALDINE ANDIA COSME","AAHH ASUNCIN 8 MZ F LT 9 A ESPLDAS DEL PAR","F","NO","(en blanco)"]
[null,null,"B001667747",45804,"May","RUTH SAVEL GUERRERO HUAMANI","AV JOSEFINA RAMOS MZ U LT 20 PUESTO DE SALUD MALVINAS 2 CDRAS","F","NO","(en blanco)"]
[null,null,"B001667413",45804,"May","LESLEY MARICELA AIJA CANDELA","AAHH ASUNCIN 8 MZ J1 LT 12 A 2 CDRA DEL PARQUE ASUNCION 8","F","NO","(en blanco)"]
[null,null,"B001667465",45804,"May","PABLO CESAR NAVARRO GUTIERREZ","CALAS PALMAS 1 MZ T LT 21 CASA ROJA CON TIENDA AFUERA DIGNIDAD NACIONAL","F","NO","(en blanco)"]
[null,null,"B001667587",45804,"May","MARITZA RENGIFO MANIHUARI","MZ I LT 5 AAHH SANTA ROSA DE LA LOZA DE SANTA ROSA","F","NO","(en blanco)"]
[null,null,"B001667498",45804,"May","JHANET ANGELA HOYOS JHANET ANG","CL PROGRESO SUR MZ N LT 14 SANTA RO FRT A LA CAPILLA PARTE ALTA","F","NO","(en blanco)"]
[null,null,"B001668348",45804,"May","JANETT YAZMIM PUCHO RAMOS","C P CARMEN ALTO MZ51 LT 19 DEL PARADERO DE AUTOS","F","NO","(en blanco)"]
[null,null,"B001667744",45804,"May","YACQUELINE ROXANA NANEZ RODRIG","SANTA JUANA MAZA MZ A LT 15 ENTRADA DE ALMENARES FRENTE A MECANICO CALLE SANTA JUANA MAZA","F","NO","(en blanco)"]
[null,null,"B001667632",45804,"May","GLADYS MARGOT ACUNA CAMPOS","PUEBLO NUEVO DE CONTA AV DOS DE MAYO MZ N1 LT 6 FRENTE AL ESTADIO","F","NO","(en blanco)"]
[null,null,"B001667729",45804,"May","JULIA MILAGROS CHUI MAMANI","CL CHEPEN MZ J4 LT 22 HOSPEDAJE LA POSADA DE HABRAHAM","F","NO","(en blanco)"]
[null,null,"B001667656",45804,"May","DENYS ZORAIDA CANDELA ASIN","CL MANCHEGO MUNOZ 369 MUNICIPIPALIDAD","F","NO","(en blanco)"]
[null,null,"B001667671",45804,"May","OLGA ALINA HUAMAN TALLA","JR PUNTO ODOMTOLO GUZMAN 550 FRENTE ODONTOLOGO DERLY JR PUNTO ODOMTOLO GUZMAN QUILMANA","F","NO","(en blanco)"]
[null,null,"B001667672",45804,"May","OLGA LIDIA TALLA LUYO","JR PUNO 550 ODOMTOLO GUZMAN","F","NO","(en blanco)"]
[null,null,"B001667768",45804,"May","LINDA KIM FLORES RIVAS","AV LIBERTAD 120 AV PRINCIPAL POSTA MEDICA","F","NO","(en blanco)"]
[null,null,"B001667588",45804,"May","MELISSA SOLANGE RAMOS PICHIS","PLAZA DE ARMAS 120 LA QUINTA","F","NO","(en blanco)"]
[null,null,"B001667444",45804,"May","NAGELY JANETH HUAMANI CHUMPITA","SANTA ROSA MZ A LT 10 LOCAL UPIS SAN CRISTOBAL","F","NO","(en blanco)"]
[null,null,"B001667705",45804,"May","MARIA MERCEDES MANCO ORELLANA","CL COMERCIO 109 DE LA COLONIA CHINA A LA MANO DEREC","F","NO","(en blanco)"]
[null,null,"B001667640",45804,"May","RAYDA LOPE ROBLES","MZ O LT 3 CP LA QUEBRADA EL RESERVORIO BARRIOS LOS ANGELES","F","NO","(en blanco)"]
[null,null,"B001667727",45804,"May","CINTHIA MARIELA ESCALANTE PERE","CLL SANTOS MZ I LT 74B CASA 2 PISOS CENT POBLADO LAURA CALLER","F","NO","(en blanco)"]
[null,null,"B001668232",45804,"May","ROSARIO MILAGROS SUENG CHAVEZ","FRENTE PIZZERIA 507 MEDIA CDRA DE PLAZA DE ARMAS CALLE COMERCIO","F","NO","(en blanco)"]
[null,null,"B001667732",45804,"May","RUTH ELIZABETH OJEDA OCHOA","AV MARISCAL BENAVIDES MZ P LT 41 GRIFO PRIMAX SINDICATO DE CHOFERES","F","NO","(en blanco)"]
[null,null,"B001667572",45804,"May","ARIANA YAMILLE HUAMANNAHUI SAN","PASAJE TREBOL 7MA CASA LT 7 POR LA IGLESIA CARMELITA PSJE TREBOL VIALES SN KM144","F","NO","(en blanco)"]
[null,null,"B001667734",45804,"May","CECILIA ISABEL GARCIA MENESES","URB SANTA ROSA MZ J LT 11 ESQUINA DE LOZA DEPORTIVA URB SANTA ROSA SAN VICENTE CANETE","F","NO","(en blanco)"]
[null,null,"B001667473",45804,"May","MARITZA ELIZABETH SANCHEZ SALA","AV PANAMERICANA SUR 144 ALTURA MONASTERIO LAS CARMELITAS","F","NO","(en blanco)"]
[null,null,"B001667581",45804,"May","CECILIA VERONICA SILVERA DIAZ","MZ A 17 NVO IMPERIAL AV CARRIZALES AV FRENTE HOSPEDAJE LOS FICUS","F","NO","(en blanco)"]
[null,null,"B001667492",45804,"May","MARIA ESTHER LEGUIA CCONAS","MZC LT 7 CENTRO POBLADO EL ESTADIO DE LA ESMERALDA","F","NO","(en blanco)"]
[null,null,"B001667614",45804,"May","BLANCA IRIS CUCHO HUAPAYA","VILLA EL CARMEN STR 1 IGLESIA SAN JOSE","F","NO","(en blanco)"]
[null,null,"B001667490",45804,"May","PAMELA GOMEZ SANCHEZ","URB CAMACHO MZA LT 8 FRENTE AL MACRO","F","NO","(en blanco)"]
[null,null,"B001667340",45804,"May","MILAGROS VANESSA CHAMBERGO SAN","AAHH LA HUACA DE LOS CHINOS MZB LT 1 COL MATER CRISTI","F","NO","(en blanco)"]
[null,null,"B001669162",45805,"May","FANNY MYRELLA NINAQUISPE SOTEL","PROLONGACION CHAVIN 600 INT 4 ALT COLEGIO 22 236","F","NO","(en blanco)"]
[null,null,"B001669154",45805,"May","LETICIA ALEXANDRA FLORES SANCH","AV PRINCIPAL PUERTA 62 62 FRENTE MINIMARKET ADRIAN CENTRO POBLADO SAN JOSE","F","NO","(en blanco)"]
[null,null,"B001669170",45805,"May","TOMASA REYNA LLAMCCAYA ALVITES","AV ARENALES SANTA ROSA DE LIMA MZNA B LT 8 COLEGIO REPUBLICA FRENTE AL CEMENTERIO","F","NO","(en blanco)"]
[null,null,"B001669201",45805,"May","CAROLIN MERCEDES SEANCAS VILCA","CALLE SAN MARTIN CUADRA 15 MZ H LT 6 ENTRE SAN MARTIN Y RAUL BOZA CALLE SAN MARTIN","F","NO","(en blanco)"]
[null,null,"B001669149",45805,"May","JACKELYNE AUNQUE ZARATE","LA TINGUIA AV PERU MZB2 PASANDO LA PLAZUELA PUENTE CHOCORRO","F","NO","(en blanco)"]
[null,null,"B001669157",45805,"May","KAREN NAILEA CAVERO PENA","PANAMERICANA SUR KM 318 SANTIAGO CENTRO POBLADO CASABLANCA MZ U LTE 8","F","NO","(en blanco)"]
[null,null,"B001670751",45806,"May","ROSA DELOSMILAGROS MACEDO RODR","SAN CARLOS ET III MZ T LT 12 FRENTE AL PAR","F","NO","(en blanco)"]
[null,null,"B001670754",45806,"May","MARITZA ELIZABETH HUAMANI GUIL","PPJJ LA ESPREANZA MZ G LT 27 ULTIMA CUADRA PIMENTEL","F","NO","(en blanco)"]
[null,null,"B001670728",45806,"May","VERONICA ALEJANDRINA GALLARDO","SAN MARTIN 1272 A UNA CUADRA DE LA UGEL PISCO AV SAN MARTIN","F","NO","(en blanco)"]